consoleText

download

20 Started by upstream project "cubes-skos" build number 69
originally caused by:
Started by upstream project "cubicweb" build number 142
originally caused by:
Started by user anonymous
Building in workspace /var/lib/jenkins/jobs/cubes-skos/workspace/TOXENV/py27-dev
[py27-dev] $ hg showconfig paths.default
[py27-dev] $ hg pull --rev c791633f1989fa2525e89dad871708a74fef334b
pulling from http://hg.logilab.org/review/cubes/skos
no changes found
[py27-dev] $ hg update --clean --rev c791633f1989fa2525e89dad871708a74fef334b
0 files updated, 0 files merged, 0 files removed, 0 files unresolved
[py27-dev] $ hg --config extensions.purge= clean --all
[py27-dev] $ hg log --rev . --template {node}
[py27-dev] $ hg log --rev . --template {rev}
[py27-dev] $ hg log --rev c791633f1989fa2525e89dad871708a74fef334b
changeset: 278:c791633f1989
tag: tip
user: Sylvain ThĂŠnault <sylvain.thenault@logilab.fr>
date: Wed Feb 03 11:50:15 2016 +0100
summary: i18n improvments

[py27-dev] $ hg log --template "<changeset node='{node}' author='{author|xmlescape}' rev='{rev}' date='{date}'><msg>{desc|xmlescape}</msg><added>{file_adds|stringify|xmlescape}</added><deleted>{file_dels|stringify|xmlescape}</deleted><files>{files|stringify|xmlescape}</files><parents>{parents}</parents></changeset>\n" --rev c791633f1989fa2525e89dad871708a74fef334b:0 --follow --prune c791633f1989fa2525e89dad871708a74fef334b --encoding UTF-8 --encodingmode replace
[py27-dev] $ /bin/bash -xe /tmp/hudson6518825571854706180.sh
+ find . -name 'tmpdb*' -delete
[py27-dev] $ /bin/bash -xe /tmp/hudson5862466474855540414.sh
+ rm -rf /var/lib/jenkins/jobs/cubes-skos/workspace/TOXENV/py27-dev/.tox
[py27-dev] $ python /tmp/hudson1170007497174542640.py
GLOB sdist-make: /var/lib/jenkins/jobs/cubes-skos/workspace/TOXENV/py27-dev/setup.py
py27-dev create: /var/lib/jenkins/jobs/cubes-skos/workspace/TOXENV/py27-dev/.tox/py27-dev
py27-dev installdeps: hg+http://hg.logilab.org/master/cubicweb@cubicweb-3.23#egg=cubicweb, -rtest-requirements.txt, pytest
py27-dev inst: /var/lib/jenkins/jobs/cubes-skos/workspace/TOXENV/py27-dev/.tox/dist/cubicweb-skos-0.9.0.dev0.zip
py27-dev installed: You are using pip version 7.1.2, however version 8.0.2 is available.,You should consider upgrading via the 'pip install --upgrade pip' command.,beautifulsoup4==4.3.2,boto==2.34.0,bzr-etckeeper==0.0.0,cffi==0.8.6,characteristic==0.1.0,chardet==2.3.0,Cheetah==2.4.4,cloud-init==0.7.6,colorama==0.3.2,configobj==5.0.6,coverage==3.7.1,croniter==0.3.4,cryptography==0.6.1,cubicweb==3.22.0,cubicweb-skos==0.9.0.dev0,cwclientlib==0.4.1,Cython==0.21.1,decorator==3.4.0,docutils==0.12,ecdsa==0.11,euca2ools==3.1.0,GDAL==1.10.1,hg-evolve==5.2.1,html2text==2016.1.8,html5lib==0.999,isodate==0.5.0,Jinja2==2.7.3,joblib==0.8.3,jsonpatch==1.3,jsonpointer==1.0,linecache2==1.0.0,logilab-common==1.1.0,logilab-constraint==0.6.0,logilab-database==1.15.0,logilab-mtconverter==0.9.0,lxml==3.4.0,M2Crypto==0.21.1,Mako==1.0.0,Markdown==2.5.1,MarkupSafe==0.23,matplotlib==1.4.2,mercurial==3.5.2,mock==1.0.1,msgpack-python==0.4.2,nose==1.3.4,numexpr==2.4,numpy==1.8.2,oauth==1.0.1,openpyxl==1.7.0,pandas==0.14.1,paramiko==1.15.1,passlib==1.6.5,pep8==1.5.7,Pillow==2.6.1,pluggy==0.3.1,ply==3.4,prettytable==0.7.2,psycopg2==2.5.4,py==1.4.31,pyasn1==0.1.7,pyasn1-modules==0.0.5,pycparser==2.10,pycrypto==2.6.1,Pygments==2.0.1,pyinotify==0.9.4,pyOpenSSL==0.14,pyparsing==2.0.3,pyserial==2.6,pysqlite==2.6.3,pytest==2.8.7,python-apt==0.9.3.12,python-augeas==0.4.1,python-dateutil==2.2,python-jenkins==0.2.1,python-ldap==2.4.10,python-yapps==2.1.1,pytz==2012rc0,PyYAML==3.11,pyzmq==14.4.0,rdflib==4.1.2,requestbuilder==0.2.3,requests==2.4.3,roman==2.0.0,rql==0.34.0,rubber==1.1,salt==2015.5.3,scikit-learn==0.14.1,scipy==0.14.0,service-identity==1.0.0,Shapely==1.4.3,simplejson==3.6.5,SimpleTAL==4.1,six==1.8.0,SPARQLWrapper==1.6.0,statsmodels==0.4.2,tables==3.1.1,tox==2.3.1,traceback2==1.4.0,unittest2==1.1.0,urllib3==1.9.1,virtualenv==13.1.2,wheel==0.24.0,xlrd==0.9.2,xlwt==0.7.5,yams==0.42.0,Yapps==2.2.0,Yapps2==2.2.0
py27-dev runtests: PYTHONHASHSEED='4196208337'
py27-dev runtests: commands[0] | /var/lib/jenkins/jobs/cubes-skos/workspace/TOXENV/py27-dev/.tox/py27-dev/bin/python -m pytest /var/lib/jenkins/jobs/cubes-skos/workspace/TOXENV/py27-dev/test --junit-xml=test-results.xml
============================= test session starts ==============================
platform linux2 -- Python 2.7.9, pytest-2.8.7, py-1.4.31, pluggy-0.3.1
rootdir: /var/lib/jenkins/jobs/cubes-skos/workspace/TOXENV/py27-dev, inifile: tox.ini
collected 67 items

test/test_ccplugin.py EEE
test/unittest_entities.py FssssssssFsFssssssss
test/unittest_hooks.py Fsss
test/unittest_lcsv.py ...
test/unittest_rdfio.py ...................Fs
test/unittest_schema.py Fsssss
test/unittest_sobjects.py FFssFs
test/unittest_views.py Fsss

generated xml file: /var/lib/jenkins/jobs/cubes-skos/workspace/TOXENV/py27-dev/test-results.xml
==================================== ERRORS ====================================
____________ ERROR at setup of ImportSkosDataCommandTC.test_massive ____________

def setUpModule():
> startpgcluster(__file__)

test/test_ccplugin.py:14:
_ _ _ _ _ _ _ _ _ _ _ _ _ _ _ _ _ _ _ _ _ _ _ _ _ _ _ _ _ _ _ _ _ _ _ _ _ _ _ _

pyfile = '/var/lib/jenkins/jobs/cubes-skos/workspace/TOXENV/py27-dev/test/test_ccplugin.py'

def startpgcluster(pyfile):
"""Start a postgresql cluster next to pyfile"""
datadir = join(os.path.dirname(pyfile), 'data', 'database',
'pgdb-%s' % os.path.splitext(os.path.basename(pyfile))[0])
if not exists(datadir):
try:
subprocess.check_call(['initdb', '-D', datadir, '-E', 'utf-8', '--locale=C'])

except OSError as err:
if err.errno == errno.ENOENT:
> raise OSError('"initdb" could not be found. '
'You should add the postgresql bin folder to your PATH '
'(/usr/lib/postgresql/9.1/bin for example).')
E OSError: "initdb" could not be found. You should add the postgresql bin folder to your PATH (/usr/lib/postgresql/9.1/bin for example).

.tox/py27-dev/local/lib/python2.7/site-packages/cubicweb/devtools/__init__.py:551: OSError
____________ ERROR at setup of ImportSkosDataCommandTC.test_nohook _____________

def setUpModule():
> startpgcluster(__file__)

test/test_ccplugin.py:14:
_ _ _ _ _ _ _ _ _ _ _ _ _ _ _ _ _ _ _ _ _ _ _ _ _ _ _ _ _ _ _ _ _ _ _ _ _ _ _ _

pyfile = '/var/lib/jenkins/jobs/cubes-skos/workspace/TOXENV/py27-dev/test/test_ccplugin.py'

def startpgcluster(pyfile):
"""Start a postgresql cluster next to pyfile"""
datadir = join(os.path.dirname(pyfile), 'data', 'database',
'pgdb-%s' % os.path.splitext(os.path.basename(pyfile))[0])
if not exists(datadir):
try:
subprocess.check_call(['initdb', '-D', datadir, '-E', 'utf-8', '--locale=C'])

except OSError as err:
if err.errno == errno.ENOENT:
> raise OSError('"initdb" could not be found. '
'You should add the postgresql bin folder to your PATH '
'(/usr/lib/postgresql/9.1/bin for example).')
E OSError: "initdb" could not be found. You should add the postgresql bin folder to your PATH (/usr/lib/postgresql/9.1/bin for example).

.tox/py27-dev/local/lib/python2.7/site-packages/cubicweb/devtools/__init__.py:551: OSError
___________ ERROR at setup of ImportSkosDataCommandTC.test_nooption ____________

def setUpModule():
> startpgcluster(__file__)

test/test_ccplugin.py:14:
_ _ _ _ _ _ _ _ _ _ _ _ _ _ _ _ _ _ _ _ _ _ _ _ _ _ _ _ _ _ _ _ _ _ _ _ _ _ _ _

pyfile = '/var/lib/jenkins/jobs/cubes-skos/workspace/TOXENV/py27-dev/test/test_ccplugin.py'

def startpgcluster(pyfile):
"""Start a postgresql cluster next to pyfile"""
datadir = join(os.path.dirname(pyfile), 'data', 'database',
'pgdb-%s' % os.path.splitext(os.path.basename(pyfile))[0])
if not exists(datadir):
try:
subprocess.check_call(['initdb', '-D', datadir, '-E', 'utf-8', '--locale=C'])

except OSError as err:
if err.errno == errno.ENOENT:
> raise OSError('"initdb" could not be found. '
'You should add the postgresql bin folder to your PATH '
'(/usr/lib/postgresql/9.1/bin for example).')
E OSError: "initdb" could not be found. You should add the postgresql bin folder to your PATH (/usr/lib/postgresql/9.1/bin for example).

.tox/py27-dev/local/lib/python2.7/site-packages/cubicweb/devtools/__init__.py:551: OSError
=================================== FAILURES ===================================
___________ ConceptSchemeTC.test_add_concepts_from_file_decode_error ___________
.tox/py27-dev/local/lib/python2.7/site-packages/cubicweb/devtools/testlib.py:419: in setUp
self._init_repo()
.tox/py27-dev/local/lib/python2.7/site-packages/cubicweb/devtools/testlib.py:327: in _init_repo
db_handler.build_db_cache(self.test_db_id, self.pre_setup_database)
.tox/py27-dev/local/lib/python2.7/site-packages/cubicweb/devtools/__init__.py:498: in build_db_cache
self.init_test_database()
.tox/py27-dev/local/lib/python2.7/site-packages/cubicweb/devtools/__init__.py:823: in init_test_database
init_config=self.init_config)
.tox/py27-dev/local/lib/python2.7/site-packages/cubicweb/server/__init__.py:306: in init_repository
initialize_schema(config, schema, handler)
.tox/py27-dev/local/lib/python2.7/site-packages/cubicweb/server/__init__.py:341: in initialize_schema
mhandler.cmd_exec_event_script('post%s' % event)
.tox/py27-dev/local/lib/python2.7/site-packages/cubicweb/server/migractions.py:344: in cmd_exec_event_script
return self.cmd_process_script(apc, funcname, *args, **kwargs)
.tox/py27-dev/local/lib/python2.7/site-packages/cubicweb/server/migractions.py:179: in cmd_process_script
migrscript, funcname, *args, **kwargs)
.tox/py27-dev/local/lib/python2.7/site-packages/cubicweb/migration.py:362: in cmd_process_script
exec(code, scriptlocals)
.tox/py27-dev/share/cubicweb/migration/postcreate.py:31: in <module>
value=text_type(config.cube_version(cube)))
_ _ _ _ _ _ _ _ _ _ _ _ _ _ _ _ _ _ _ _ _ _ _ _ _ _ _ _ _ _ _ _ _ _ _ _ _ _ _ _

cls = <class 'cubicweb.devtools.ApptestConfiguration'>, cube = 'skos'

@classmethod
def cube_version(cls, cube):
"""return the version of the cube located in the given directory
"""
from logilab.common.changelog import Version
version = cls.cube_pkginfo(cube).numversion
> assert len(version) == 3, version
E AssertionError: (0, 9, 0, 'dev0')

.tox/py27-dev/local/lib/python2.7/site-packages/cubicweb/cwconfig.py:516: AssertionError
----------------------------- Captured stdout call -----------------------------
-> creating tables
-> inserting default user and default groups.
-> storing the schema in the database
----------------------------- Captured stderr call -----------------------------
2016-02-03 15:59:05 - (cubicweb.appobject) WARNING: can't find any workflow for CWUser
___________________________ ConceptTC.test_dc_title ____________________________

self = <unittest_entities.ConceptTC testMethod=test_dc_title>

def setUp(self):
> super(ConceptTC, self).setUp()

test/unittest_entities.py:232:
_ _ _ _ _ _ _ _ _ _ _ _ _ _ _ _ _ _ _ _ _ _ _ _ _ _ _ _ _ _ _ _ _ _ _ _ _ _ _ _
.tox/py27-dev/local/lib/python2.7/site-packages/cubicweb/devtools/testlib.py:419: in setUp
self._init_repo()
.tox/py27-dev/local/lib/python2.7/site-packages/cubicweb/devtools/testlib.py:327: in _init_repo
db_handler.build_db_cache(self.test_db_id, self.pre_setup_database)
.tox/py27-dev/local/lib/python2.7/site-packages/cubicweb/devtools/__init__.py:498: in build_db_cache
self.init_test_database()
.tox/py27-dev/local/lib/python2.7/site-packages/cubicweb/devtools/__init__.py:823: in init_test_database
init_config=self.init_config)
.tox/py27-dev/local/lib/python2.7/site-packages/cubicweb/server/__init__.py:306: in init_repository
initialize_schema(config, schema, handler)
.tox/py27-dev/local/lib/python2.7/site-packages/cubicweb/server/__init__.py:341: in initialize_schema
mhandler.cmd_exec_event_script('post%s' % event)
.tox/py27-dev/local/lib/python2.7/site-packages/cubicweb/server/migractions.py:344: in cmd_exec_event_script
return self.cmd_process_script(apc, funcname, *args, **kwargs)
.tox/py27-dev/local/lib/python2.7/site-packages/cubicweb/server/migractions.py:179: in cmd_process_script
migrscript, funcname, *args, **kwargs)
.tox/py27-dev/local/lib/python2.7/site-packages/cubicweb/migration.py:362: in cmd_process_script
exec(code, scriptlocals)
.tox/py27-dev/share/cubicweb/migration/postcreate.py:31: in <module>
value=text_type(config.cube_version(cube)))
_ _ _ _ _ _ _ _ _ _ _ _ _ _ _ _ _ _ _ _ _ _ _ _ _ _ _ _ _ _ _ _ _ _ _ _ _ _ _ _

cls = <class 'cubicweb.devtools.ApptestConfiguration'>, cube = 'skos'

@classmethod
def cube_version(cls, cube):
"""return the version of the cube located in the given directory
"""
from logilab.common.changelog import Version
version = cls.cube_pkginfo(cube).numversion
> assert len(version) == 3, version
E AssertionError: (0, 9, 0, 'dev0')

.tox/py27-dev/local/lib/python2.7/site-packages/cubicweb/cwconfig.py:516: AssertionError
----------------------------- Captured stdout call -----------------------------
-> creating tables
-> inserting default user and default groups.
-> storing the schema in the database
----------------------------- Captured stderr call -----------------------------
2016-02-03 15:59:16 - (cubicweb.appobject) WARNING: can't find any workflow for CWUser
_________________ RDFAdaptersTC.test_librdf_concept_list_repr __________________
.tox/py27-dev/local/lib/python2.7/site-packages/cubicweb/devtools/testlib.py:419: in setUp
self._init_repo()
.tox/py27-dev/local/lib/python2.7/site-packages/cubicweb/devtools/testlib.py:327: in _init_repo
db_handler.build_db_cache(self.test_db_id, self.pre_setup_database)
.tox/py27-dev/local/lib/python2.7/site-packages/cubicweb/devtools/__init__.py:498: in build_db_cache
self.init_test_database()
.tox/py27-dev/local/lib/python2.7/site-packages/cubicweb/devtools/__init__.py:823: in init_test_database
init_config=self.init_config)
.tox/py27-dev/local/lib/python2.7/site-packages/cubicweb/server/__init__.py:306: in init_repository
initialize_schema(config, schema, handler)
.tox/py27-dev/local/lib/python2.7/site-packages/cubicweb/server/__init__.py:341: in initialize_schema
mhandler.cmd_exec_event_script('post%s' % event)
.tox/py27-dev/local/lib/python2.7/site-packages/cubicweb/server/migractions.py:344: in cmd_exec_event_script
return self.cmd_process_script(apc, funcname, *args, **kwargs)
.tox/py27-dev/local/lib/python2.7/site-packages/cubicweb/server/migractions.py:179: in cmd_process_script
migrscript, funcname, *args, **kwargs)
.tox/py27-dev/local/lib/python2.7/site-packages/cubicweb/migration.py:362: in cmd_process_script
exec(code, scriptlocals)
.tox/py27-dev/share/cubicweb/migration/postcreate.py:31: in <module>
value=text_type(config.cube_version(cube)))
_ _ _ _ _ _ _ _ _ _ _ _ _ _ _ _ _ _ _ _ _ _ _ _ _ _ _ _ _ _ _ _ _ _ _ _ _ _ _ _

cls = <class 'cubicweb.devtools.ApptestConfiguration'>, cube = 'skos'

@classmethod
def cube_version(cls, cube):
"""return the version of the cube located in the given directory
"""
from logilab.common.changelog import Version
version = cls.cube_pkginfo(cube).numversion
> assert len(version) == 3, version
E AssertionError: (0, 9, 0, 'dev0')

.tox/py27-dev/local/lib/python2.7/site-packages/cubicweb/cwconfig.py:516: AssertionError
----------------------------- Captured stdout call -----------------------------
-> creating tables
-> inserting default user and default groups.
-> storing the schema in the database
----------------------------- Captured stderr call -----------------------------
2016-02-03 15:59:27 - (cubicweb.appobject) WARNING: can't find any workflow for CWUser
_______________ HooksTC.test_concept_unique_pref_label_language ________________
.tox/py27-dev/local/lib/python2.7/site-packages/cubicweb/devtools/testlib.py:419: in setUp
self._init_repo()
.tox/py27-dev/local/lib/python2.7/site-packages/cubicweb/devtools/testlib.py:327: in _init_repo
db_handler.build_db_cache(self.test_db_id, self.pre_setup_database)
.tox/py27-dev/local/lib/python2.7/site-packages/cubicweb/devtools/__init__.py:498: in build_db_cache
self.init_test_database()
.tox/py27-dev/local/lib/python2.7/site-packages/cubicweb/devtools/__init__.py:823: in init_test_database
init_config=self.init_config)
.tox/py27-dev/local/lib/python2.7/site-packages/cubicweb/server/__init__.py:306: in init_repository
initialize_schema(config, schema, handler)
.tox/py27-dev/local/lib/python2.7/site-packages/cubicweb/server/__init__.py:341: in initialize_schema
mhandler.cmd_exec_event_script('post%s' % event)
.tox/py27-dev/local/lib/python2.7/site-packages/cubicweb/server/migractions.py:344: in cmd_exec_event_script
return self.cmd_process_script(apc, funcname, *args, **kwargs)
.tox/py27-dev/local/lib/python2.7/site-packages/cubicweb/server/migractions.py:179: in cmd_process_script
migrscript, funcname, *args, **kwargs)
.tox/py27-dev/local/lib/python2.7/site-packages/cubicweb/migration.py:362: in cmd_process_script
exec(code, scriptlocals)
.tox/py27-dev/share/cubicweb/migration/postcreate.py:31: in <module>
value=text_type(config.cube_version(cube)))
_ _ _ _ _ _ _ _ _ _ _ _ _ _ _ _ _ _ _ _ _ _ _ _ _ _ _ _ _ _ _ _ _ _ _ _ _ _ _ _

cls = <class 'cubicweb.devtools.ApptestConfiguration'>, cube = 'skos'

@classmethod
def cube_version(cls, cube):
"""return the version of the cube located in the given directory
"""
from logilab.common.changelog import Version
version = cls.cube_pkginfo(cube).numversion
> assert len(version) == 3, version
E AssertionError: (0, 9, 0, 'dev0')

.tox/py27-dev/local/lib/python2.7/site-packages/cubicweb/cwconfig.py:516: AssertionError
----------------------------- Captured stdout call -----------------------------
-> creating tables
-> inserting default user and default groups.
-> storing the schema in the database
----------------------------- Captured stderr call -----------------------------
2016-02-03 15:59:37 - (cubicweb.appobject) WARNING: can't find any workflow for CWUser
_____________________ AddEntitiesToRDFGraphTC.test_librdf ______________________
.tox/py27-dev/local/lib/python2.7/site-packages/cubicweb/devtools/testlib.py:419: in setUp
self._init_repo()
.tox/py27-dev/local/lib/python2.7/site-packages/cubicweb/devtools/testlib.py:327: in _init_repo
db_handler.build_db_cache(self.test_db_id, self.pre_setup_database)
.tox/py27-dev/local/lib/python2.7/site-packages/cubicweb/devtools/__init__.py:498: in build_db_cache
self.init_test_database()
.tox/py27-dev/local/lib/python2.7/site-packages/cubicweb/devtools/__init__.py:823: in init_test_database
init_config=self.init_config)
.tox/py27-dev/local/lib/python2.7/site-packages/cubicweb/server/__init__.py:306: in init_repository
initialize_schema(config, schema, handler)
.tox/py27-dev/local/lib/python2.7/site-packages/cubicweb/server/__init__.py:341: in initialize_schema
mhandler.cmd_exec_event_script('post%s' % event)
.tox/py27-dev/local/lib/python2.7/site-packages/cubicweb/server/migractions.py:344: in cmd_exec_event_script
return self.cmd_process_script(apc, funcname, *args, **kwargs)
.tox/py27-dev/local/lib/python2.7/site-packages/cubicweb/server/migractions.py:179: in cmd_process_script
migrscript, funcname, *args, **kwargs)
.tox/py27-dev/local/lib/python2.7/site-packages/cubicweb/migration.py:362: in cmd_process_script
exec(code, scriptlocals)
.tox/py27-dev/share/cubicweb/migration/postcreate.py:31: in <module>
value=text_type(config.cube_version(cube)))
_ _ _ _ _ _ _ _ _ _ _ _ _ _ _ _ _ _ _ _ _ _ _ _ _ _ _ _ _ _ _ _ _ _ _ _ _ _ _ _

cls = <class 'cubicweb.devtools.ApptestConfiguration'>, cube = 'skos'

@classmethod
def cube_version(cls, cube):
"""return the version of the cube located in the given directory
"""
from logilab.common.changelog import Version
version = cls.cube_pkginfo(cube).numversion
> assert len(version) == 3, version
E AssertionError: (0, 9, 0, 'dev0')

.tox/py27-dev/local/lib/python2.7/site-packages/cubicweb/cwconfig.py:516: AssertionError
----------------------------- Captured stdout call -----------------------------
-> creating tables
-> inserting default user and default groups.
-> storing the schema in the database
----------------------------- Captured stderr call -----------------------------
2016-02-03 15:59:48 - (cubicweb.appobject) WARNING: can't find any workflow for CWUser
_________________ SKOSSchemaTC.test_concept_label_no_language __________________
.tox/py27-dev/local/lib/python2.7/site-packages/cubicweb/devtools/testlib.py:419: in setUp
self._init_repo()
.tox/py27-dev/local/lib/python2.7/site-packages/cubicweb/devtools/testlib.py:327: in _init_repo
db_handler.build_db_cache(self.test_db_id, self.pre_setup_database)
.tox/py27-dev/local/lib/python2.7/site-packages/cubicweb/devtools/__init__.py:498: in build_db_cache
self.init_test_database()
.tox/py27-dev/local/lib/python2.7/site-packages/cubicweb/devtools/__init__.py:823: in init_test_database
init_config=self.init_config)
.tox/py27-dev/local/lib/python2.7/site-packages/cubicweb/server/__init__.py:306: in init_repository
initialize_schema(config, schema, handler)
.tox/py27-dev/local/lib/python2.7/site-packages/cubicweb/server/__init__.py:341: in initialize_schema
mhandler.cmd_exec_event_script('post%s' % event)
.tox/py27-dev/local/lib/python2.7/site-packages/cubicweb/server/migractions.py:344: in cmd_exec_event_script
return self.cmd_process_script(apc, funcname, *args, **kwargs)
.tox/py27-dev/local/lib/python2.7/site-packages/cubicweb/server/migractions.py:179: in cmd_process_script
migrscript, funcname, *args, **kwargs)
.tox/py27-dev/local/lib/python2.7/site-packages/cubicweb/migration.py:362: in cmd_process_script
exec(code, scriptlocals)
.tox/py27-dev/share/cubicweb/migration/postcreate.py:31: in <module>
value=text_type(config.cube_version(cube)))
_ _ _ _ _ _ _ _ _ _ _ _ _ _ _ _ _ _ _ _ _ _ _ _ _ _ _ _ _ _ _ _ _ _ _ _ _ _ _ _

cls = <class 'cubicweb.devtools.ApptestConfiguration'>, cube = 'skos'

@classmethod
def cube_version(cls, cube):
"""return the version of the cube located in the given directory
"""
from logilab.common.changelog import Version
version = cls.cube_pkginfo(cube).numversion
> assert len(version) == 3, version
E AssertionError: (0, 9, 0, 'dev0')

.tox/py27-dev/local/lib/python2.7/site-packages/cubicweb/cwconfig.py:516: AssertionError
----------------------------- Captured stdout call -----------------------------
-> creating tables
-> inserting default user and default groups.
-> storing the schema in the database
----------------------------- Captured stderr call -----------------------------
2016-02-03 15:59:58 - (cubicweb.appobject) WARNING: can't find any workflow for CWUser
_____________________________ DumpRelationsTC.test _____________________________
.tox/py27-dev/local/lib/python2.7/site-packages/cubicweb/devtools/testlib.py:419: in setUp
self._init_repo()
.tox/py27-dev/local/lib/python2.7/site-packages/cubicweb/devtools/testlib.py:327: in _init_repo
db_handler.build_db_cache(self.test_db_id, self.pre_setup_database)
.tox/py27-dev/local/lib/python2.7/site-packages/cubicweb/devtools/__init__.py:498: in build_db_cache
self.init_test_database()
.tox/py27-dev/local/lib/python2.7/site-packages/cubicweb/devtools/__init__.py:823: in init_test_database
init_config=self.init_config)
.tox/py27-dev/local/lib/python2.7/site-packages/cubicweb/server/__init__.py:306: in init_repository
initialize_schema(config, schema, handler)
.tox/py27-dev/local/lib/python2.7/site-packages/cubicweb/server/__init__.py:341: in initialize_schema
mhandler.cmd_exec_event_script('post%s' % event)
.tox/py27-dev/local/lib/python2.7/site-packages/cubicweb/server/migractions.py:344: in cmd_exec_event_script
return self.cmd_process_script(apc, funcname, *args, **kwargs)
.tox/py27-dev/local/lib/python2.7/site-packages/cubicweb/server/migractions.py:179: in cmd_process_script
migrscript, funcname, *args, **kwargs)
.tox/py27-dev/local/lib/python2.7/site-packages/cubicweb/migration.py:362: in cmd_process_script
exec(code, scriptlocals)
.tox/py27-dev/share/cubicweb/migration/postcreate.py:31: in <module>
value=text_type(config.cube_version(cube)))
_ _ _ _ _ _ _ _ _ _ _ _ _ _ _ _ _ _ _ _ _ _ _ _ _ _ _ _ _ _ _ _ _ _ _ _ _ _ _ _

cls = <class 'cubicweb.devtools.ApptestConfiguration'>, cube = 'skos'

@classmethod
def cube_version(cls, cube):
"""return the version of the cube located in the given directory
"""
from logilab.common.changelog import Version
version = cls.cube_pkginfo(cube).numversion
> assert len(version) == 3, version
E AssertionError: (0, 9, 0, 'dev0')

.tox/py27-dev/local/lib/python2.7/site-packages/cubicweb/cwconfig.py:516: AssertionError
----------------------------- Captured stdout call -----------------------------
-> creating tables
-> inserting default user and default groups.
-> storing the schema in the database
----------------------------- Captured stderr call -----------------------------
2016-02-03 16:00:09 - (cubicweb.appobject) WARNING: can't find any workflow for CWUser
_____________________ SKOSXMLImportTC.test_datafeed_source _____________________
.tox/py27-dev/local/lib/python2.7/site-packages/cubicweb/devtools/testlib.py:419: in setUp
self._init_repo()
.tox/py27-dev/local/lib/python2.7/site-packages/cubicweb/devtools/testlib.py:327: in _init_repo
db_handler.build_db_cache(self.test_db_id, self.pre_setup_database)
.tox/py27-dev/local/lib/python2.7/site-packages/cubicweb/devtools/__init__.py:501: in build_db_cache
self.build_db_cache(DEFAULT_EMPTY_DB_ID)
.tox/py27-dev/local/lib/python2.7/site-packages/cubicweb/devtools/__init__.py:498: in build_db_cache
self.init_test_database()
.tox/py27-dev/local/lib/python2.7/site-packages/cubicweb/devtools/__init__.py:823: in init_test_database
init_config=self.init_config)
.tox/py27-dev/local/lib/python2.7/site-packages/cubicweb/server/__init__.py:306: in init_repository
initialize_schema(config, schema, handler)
.tox/py27-dev/local/lib/python2.7/site-packages/cubicweb/server/__init__.py:341: in initialize_schema
mhandler.cmd_exec_event_script('post%s' % event)
.tox/py27-dev/local/lib/python2.7/site-packages/cubicweb/server/migractions.py:344: in cmd_exec_event_script
return self.cmd_process_script(apc, funcname, *args, **kwargs)
.tox/py27-dev/local/lib/python2.7/site-packages/cubicweb/server/migractions.py:179: in cmd_process_script
migrscript, funcname, *args, **kwargs)
.tox/py27-dev/local/lib/python2.7/site-packages/cubicweb/migration.py:362: in cmd_process_script
exec(code, scriptlocals)
.tox/py27-dev/share/cubicweb/migration/postcreate.py:31: in <module>
value=text_type(config.cube_version(cube)))
_ _ _ _ _ _ _ _ _ _ _ _ _ _ _ _ _ _ _ _ _ _ _ _ _ _ _ _ _ _ _ _ _ _ _ _ _ _ _ _

cls = <class 'cubicweb.devtools.ApptestConfiguration'>, cube = 'skos'

@classmethod
def cube_version(cls, cube):
"""return the version of the cube located in the given directory
"""
from logilab.common.changelog import Version
version = cls.cube_pkginfo(cube).numversion
> assert len(version) == 3, version
E AssertionError: (0, 9, 0, 'dev0')

.tox/py27-dev/local/lib/python2.7/site-packages/cubicweb/cwconfig.py:516: AssertionError
----------------------------- Captured stdout call -----------------------------
Building xmlparser for database tmpdb
-> creating tables
-> inserting default user and default groups.
-> storing the schema in the database
----------------------------- Captured stderr call -----------------------------
2016-02-03 16:00:19 - (cubicweb.appobject) WARNING: can't find any workflow for CWUser
________________________ LCSVImportTC.test_import_lcsv _________________________
.tox/py27-dev/local/lib/python2.7/site-packages/cubicweb/devtools/testlib.py:419: in setUp
self._init_repo()
.tox/py27-dev/local/lib/python2.7/site-packages/cubicweb/devtools/testlib.py:327: in _init_repo
db_handler.build_db_cache(self.test_db_id, self.pre_setup_database)
.tox/py27-dev/local/lib/python2.7/site-packages/cubicweb/devtools/__init__.py:498: in build_db_cache
self.init_test_database()
.tox/py27-dev/local/lib/python2.7/site-packages/cubicweb/devtools/__init__.py:823: in init_test_database
init_config=self.init_config)
.tox/py27-dev/local/lib/python2.7/site-packages/cubicweb/server/__init__.py:306: in init_repository
initialize_schema(config, schema, handler)
.tox/py27-dev/local/lib/python2.7/site-packages/cubicweb/server/__init__.py:341: in initialize_schema
mhandler.cmd_exec_event_script('post%s' % event)
.tox/py27-dev/local/lib/python2.7/site-packages/cubicweb/server/migractions.py:344: in cmd_exec_event_script
return self.cmd_process_script(apc, funcname, *args, **kwargs)
.tox/py27-dev/local/lib/python2.7/site-packages/cubicweb/server/migractions.py:179: in cmd_process_script
migrscript, funcname, *args, **kwargs)
.tox/py27-dev/local/lib/python2.7/site-packages/cubicweb/migration.py:362: in cmd_process_script
exec(code, scriptlocals)
.tox/py27-dev/share/cubicweb/migration/postcreate.py:31: in <module>
value=text_type(config.cube_version(cube)))
_ _ _ _ _ _ _ _ _ _ _ _ _ _ _ _ _ _ _ _ _ _ _ _ _ _ _ _ _ _ _ _ _ _ _ _ _ _ _ _

cls = <class 'cubicweb.devtools.ApptestConfiguration'>, cube = 'skos'

@classmethod
def cube_version(cls, cube):
"""return the version of the cube located in the given directory
"""
from logilab.common.changelog import Version
version = cls.cube_pkginfo(cube).numversion
> assert len(version) == 3, version
E AssertionError: (0, 9, 0, 'dev0')

.tox/py27-dev/local/lib/python2.7/site-packages/cubicweb/cwconfig.py:516: AssertionError
----------------------------- Captured stdout call -----------------------------
-> creating tables
-> inserting default user and default groups.
-> storing the schema in the database
----------------------------- Captured stderr call -----------------------------
2016-02-03 16:00:30 - (cubicweb.appobject) WARNING: can't find any workflow for CWUser
___________________ ViewsTC.test_flat_scheme_concepts_import ___________________
.tox/py27-dev/local/lib/python2.7/site-packages/cubicweb/devtools/testlib.py:419: in setUp
self._init_repo()
.tox/py27-dev/local/lib/python2.7/site-packages/cubicweb/devtools/testlib.py:327: in _init_repo
db_handler.build_db_cache(self.test_db_id, self.pre_setup_database)
.tox/py27-dev/local/lib/python2.7/site-packages/cubicweb/devtools/__init__.py:498: in build_db_cache
self.init_test_database()
.tox/py27-dev/local/lib/python2.7/site-packages/cubicweb/devtools/__init__.py:823: in init_test_database
init_config=self.init_config)
.tox/py27-dev/local/lib/python2.7/site-packages/cubicweb/server/__init__.py:306: in init_repository
initialize_schema(config, schema, handler)
.tox/py27-dev/local/lib/python2.7/site-packages/cubicweb/server/__init__.py:341: in initialize_schema
mhandler.cmd_exec_event_script('post%s' % event)
.tox/py27-dev/local/lib/python2.7/site-packages/cubicweb/server/migractions.py:344: in cmd_exec_event_script
return self.cmd_process_script(apc, funcname, *args, **kwargs)
.tox/py27-dev/local/lib/python2.7/site-packages/cubicweb/server/migractions.py:179: in cmd_process_script
migrscript, funcname, *args, **kwargs)
.tox/py27-dev/local/lib/python2.7/site-packages/cubicweb/migration.py:362: in cmd_process_script
exec(code, scriptlocals)
.tox/py27-dev/share/cubicweb/migration/postcreate.py:31: in <module>
value=text_type(config.cube_version(cube)))
_ _ _ _ _ _ _ _ _ _ _ _ _ _ _ _ _ _ _ _ _ _ _ _ _ _ _ _ _ _ _ _ _ _ _ _ _ _ _ _

cls = <class 'cubicweb.devtools.ApptestConfiguration'>, cube = 'skos'

@classmethod
def cube_version(cls, cube):
"""return the version of the cube located in the given directory
"""
from logilab.common.changelog import Version
version = cls.cube_pkginfo(cube).numversion
> assert len(version) == 3, version
E AssertionError: (0, 9, 0, 'dev0')

.tox/py27-dev/local/lib/python2.7/site-packages/cubicweb/cwconfig.py:516: AssertionError
----------------------------- Captured stdout call -----------------------------
-> creating tables
-> inserting default user and default groups.
-> storing the schema in the database
----------------------------- Captured stderr call -----------------------------
2016-02-03 16:00:41 - (cubicweb.appobject) WARNING: can't find any workflow for CWUser
========= 10 failed, 22 passed, 32 skipped, 3 error in 106.77 seconds ==========
ERROR: InvocationError: '/var/lib/jenkins/jobs/cubes-skos/workspace/TOXENV/py27-dev/.tox/py27-dev/bin/python -m pytest /var/lib/jenkins/jobs/cubes-skos/workspace/TOXENV/py27-dev/test --junit-xml=test-results.xml'
___________________________________ summary ____________________________________
ERROR: py27-dev: commands failed
Build step 'Execute Python script' marked build as failure
Recording test results
[PostBuildScript] - Execution post build scripts.
[py27-dev] $ /bin/bash -xe /tmp/hudson8983291009648979474.sh
+ /var/lib/jenkins/scripts/notify_forge_apycot.py cwo cubicweb-skos c791633f1989 http://jenkins.logilab.fr/job/cubes-skos/TOXENV=py27-dev/69/ --status failure
<br/>

log from execution
download