consoleText

download

20 Started by upstream project "cubicweb" build number 172
originally caused by:
Started by an SCM change
Building in workspace /var/lib/jenkins/jobs/cubicweb/workspace/TOXENV/web
[web] $ hg showconfig paths.default
[web] $ hg pull --rev edb492ddf58c9ac4e4927a9fc9f45aa89b8768ce
pulling from http://hg.logilab.org/review/cubicweb
searching for changes
adding changesets
adding manifests
adding file changes
added 2 changesets with 5 changes to 5 files (+1 heads)
(run 'hg heads .' to see heads, 'hg merge' to merge)
[web] $ hg update --clean --rev edb492ddf58c9ac4e4927a9fc9f45aa89b8768ce
795 files updated, 0 files merged, 786 files removed, 0 files unresolved
[web] $ hg --config extensions.purge= clean --all
[web] $ hg log --rev . --template {node}
[web] $ hg log --rev . --template {rev}
Run condition [File exists] enabling prebuild for step [BuilderChain]
[File exists] check if file exists [tox.ini]
Run condition [File exists] enabling perform for step [BuilderChain]
[web] $ /bin/bash -xe /tmp/hudson3149036155487238975.sh
+ find . '(' -name 'pgdb*' -o -name 'tmpdb*' ')' -print0
+ xargs -0 rm -rf
[web] $ /bin/bash -xe /tmp/hudson2801782987250359666.sh
+ PATH=/usr/lib/postgresql/9.4/bin:/usr/local/bin:/usr/bin:/bin:/usr/local/games:/usr/games
+ tox --recreate
GLOB sdist-make: /var/lib/jenkins/jobs/cubicweb/workspace/TOXENV/web/setup.py
web create: /var/lib/jenkins/jobs/cubicweb/workspace/TOXENV/web/.tox/web
web installdeps: -r/var/lib/jenkins/jobs/cubicweb/workspace/TOXENV/web/web/test/requirements.txt
web inst: /var/lib/jenkins/jobs/cubicweb/workspace/TOXENV/web/.tox/dist/cubicweb-3.22.0.zip
web installed: You are using pip version 7.1.2, however version 8.0.2 is available.,You should consider upgrading via the 'pip install --upgrade pip' command.,beautifulsoup4==4.3.2,boto==2.34.0,bzr-etckeeper==0.0.0,cffi==0.8.6,characteristic==0.1.0,chardet==2.3.0,Cheetah==2.4.4,cloud-init==0.7.6,colorama==0.3.2,configobj==5.0.6,coverage==3.7.1,croniter==0.3.4,cryptography==0.6.1,cubicweb==3.22.0,cubicweb-blog==1.11.1,cubicweb-file==1.17.0,cubicweb-tag==1.8.2,cwclientlib==0.4.1,Cython==0.21.1,decorator==3.4.0,docutils==0.12,ecdsa==0.11,euca2ools==3.1.0,GDAL==1.10.1,hg-evolve==5.2.1,html2text==2016.1.8,html5lib==0.999,isodate==0.5.0,Jinja2==2.7.3,joblib==0.8.3,jsonpatch==1.3,jsonpointer==1.0,logilab-common==1.1.0,logilab-constraint==0.6.0,logilab-database==1.15.0,logilab-mtconverter==0.9.0,lxml==3.4.0,M2Crypto==0.21.1,Mako==1.0.0,Markdown==2.5.1,MarkupSafe==0.23,matplotlib==1.4.2,mercurial==3.5.2,mock==1.0.1,msgpack-python==0.4.2,nose==1.3.4,numexpr==2.4,numpy==1.8.2,oauth==1.0.1,openpyxl==1.7.0,pandas==0.14.1,paramiko==1.15.1,passlib==1.6.5,pep8==1.5.7,Pillow==2.6.1,pluggy==0.3.1,ply==3.4,prettytable==0.7.2,psycopg2==2.5.4,py==1.4.31,pyasn1==0.1.7,pyasn1-modules==0.0.5,pycparser==2.10,pycrypto==2.6.1,Pygments==2.0.1,pyinotify==0.9.4,pyOpenSSL==0.14,pyparsing==2.0.3,pyserial==2.6,pysqlite==2.6.3,python-apt==0.9.3.12,python-augeas==0.4.1,python-dateutil==2.2,python-jenkins==0.2.1,python-ldap==2.4.10,python-yapps==2.1.1,pytz==2012rc0,PyYAML==3.11,pyzmq==14.4.0,rdflib==4.1.2,requestbuilder==0.2.3,requests==2.4.3,roman==2.0.0,rql==0.34.0,rubber==1.1,salt==2015.5.3,scikit-learn==0.14.1,scipy==0.14.0,service-identity==1.0.0,Shapely==1.4.3,simplejson==3.6.5,SimpleTAL==4.1,six==1.8.0,SPARQLWrapper==1.6.0,statsmodels==0.4.2,tables==3.1.1,tox==2.3.1,Twisted==15.5.0,urllib3==1.9.1,virtualenv==13.1.2,waitress==0.8.10,WebOb==1.5.1,WebTest==2.0.20,wheel==0.24.0,xlrd==0.9.2,xlwt==0.7.5,yams==0.42.0,Yapps==2.2.0,Yapps2==2.2.0,zope.interface==4.1.3
web runtests: PYTHONHASHSEED='3120047937'
web runtests: commands[0] | /var/lib/jenkins/jobs/cubicweb/workspace/TOXENV/web/.tox/web/bin/python -c from logilab.common import pytest; pytest.run() -t /var/lib/jenkins/jobs/cubicweb/workspace/TOXENV/web/web/test
========================== test_views.py ===========================
2016-02-12 11:38:13 - (cubicweb.appobject) WARNING: can't find any workflow for CWUser
2016-02-12 11:38:26 - (cubicweb.web) WARNING: [3.17] massmailing extracted to cube massmailing that was not found. try installing it.
2016-02-12 11:38:27 - (cubicweb.web) WARNING: [3.17] igeocoding extracted to cube geocoding that was not found. try installing it.
2016-02-12 11:38:27 - (cubicweb.web) WARNING: [3.17] embedding extracted to cube embed that was not found. try installing it.
2016-02-12 11:38:27 - (cubicweb.web) WARNING: [3.17] isioc extracted to cube sioc that was not found. try installing it.
2016-02-12 11:38:29 - (py.warnings) WARNING: /var/lib/jenkins/jobs/cubicweb/workspace/TOXENV/web/.tox/web/local/lib/python2.7/site-packages/cubicweb/devtools/__init__.py:111: RuntimeWarning: adminc52fc6459be84fc0bc075c5ba24e40fa Open session found while turning repository off
%sessionid, RuntimeWarning)

.........................................................................................................................................................................................................................................................................................................................................................................................................................................................................................................................................................................................................................................................................................................................................................................................................................................................................................................2016-02-12 11:38:52 - (py.warnings) WARNING: /var/lib/jenkins/jobs/cubicweb/workspace/TOXENV/web/.tox/web/local/lib/python2.7/site-packages/cubicweb/web/formfields.py:1199: Warning: [yams 0.38] no targettype specified and there are several relation definitions for rtype constrained_by: ['CWAttribute', 'CWRelation']. Yet you get the first rdef.
rdef = eschema.rdef(rschema, role)

............................................................................................................................................................................................................................................................................................................................................................................................................................................................................................................................................................................................................................................................................................................................................................................................2016-02-12 11:38:56 - (py.warnings) WARNING: /var/lib/jenkins/jobs/cubicweb/workspace/TOXENV/web/.tox/web/local/lib/python2.7/site-packages/cubicweb/web/formfields.py:1199: Warning: [yams 0.38] no targettype specified and there are several relation definitions for rtype allowed_transition: ['BaseTransition', 'Transition', 'WorkflowTransition']. Yet you get the first rdef.
rdef = eschema.rdef(rschema, role)

...................................................................................................................................................................................................................................................................................2016-02-12 11:39:01 - (cubicweb.appobject) ERROR: cycle in breadcrumbs for entity <Entity TreeNode 1274 ['creation_date', 'name', 'cwuri', 'modification_date'] at 140705096273168>
..2016-02-12 11:39:01 - (cubicweb.appobject) ERROR: cycle in breadcrumbs for entity <Entity TreeNode 1274 ['creation_date', 'name', 'cwuri', 'modification_date'] at 140705096273168>
.2016-02-12 11:39:01 - (cubicweb.appobject) ERROR: cycle in breadcrumbs for entity <Entity TreeNode 1274 ['creation_date', 'name', 'cwuri', 'modification_date'] at 140705096273168>
..2016-02-12 11:39:01 - (cubicweb.appobject) ERROR: cycle in breadcrumbs for entity <Entity TreeNode 1274 ['creation_date', 'name', 'cwuri', 'modification_date'] at 140705096273168>
....2016-02-12 11:39:01 - (cubicweb.appobject) ERROR: cycle in breadcrumbs for entity <Entity TreeNode 1274 ['creation_date', 'name', 'cwuri', 'modification_date'] at 140705096273168>
..2016-02-12 11:39:02 - (cubicweb.appobject) ERROR: cycle in breadcrumbs for entity <Entity TreeNode 1274 ['creation_date', 'name', 'cwuri', 'modification_date'] at 140705096273168>
....2016-02-12 11:39:02 - (cubicweb.appobject) ERROR: cycle in breadcrumbs for entity <Entity TreeNode 1274 ['creation_date', 'name', 'cwuri', 'modification_date'] at 140705096273168>
..2016-02-12 11:39:02 - (cubicweb.appobject) ERROR: cycle in breadcrumbs for entity <Entity TreeNode 1274 ['creation_date', 'name', 'cwuri', 'modification_date'] at 140705096273168>
...................2016-02-12 11:39:02 - (cubicweb.appobject) ERROR: cycle in breadcrumbs for entity <Entity TreeNode 1274 ['creation_date', 'name', 'cwuri', 'modification_date'] at 140705096273168>
.........................................................................................................................................................................................................................................................................................................................................................................................................................................................................................................................................................................................................................................................................................................................................................................................................................................................................................................................................................................................................................................................................................................................................................................................................................................................................................................................................................................................................................................................................................................................................................................................
==================== unittest_views_treeview.py ====================
.
===================== unittest_application.py ======================
2016-02-12 11:39:40 - (cubicweb.web) ERROR: Exception('whatever',)
Traceback (most recent call last):
File "/var/lib/jenkins/jobs/cubicweb/workspace/TOXENV/web/.tox/web/local/lib/python2.7/site-packages/cubicweb/web/application.py", line 369, in core_handle
result = controller.publish(rset=rset)
File "/var/lib/jenkins/jobs/cubicweb/workspace/TOXENV/web/.tox/web/local/lib/python2.7/site-packages/cubicweb/web/views/basecontrollers.py", line 134, in publish
rset=rset, view=view)
File "/var/lib/jenkins/jobs/cubicweb/workspace/TOXENV/web/.tox/web/local/lib/python2.7/site-packages/cubicweb/cwvreg.py", line 225, in main_template
res = obj.render(**kwargs)
File "/var/lib/jenkins/jobs/cubicweb/workspace/TOXENV/web/.tox/web/local/lib/python2.7/site-packages/cubicweb/view.py", line 138, in render
view_func(**context)
File "/var/lib/jenkins/jobs/cubicweb/workspace/TOXENV/web/.tox/web/local/lib/python2.7/site-packages/cubicweb/web/views/basetemplates.py", line 163, in call
view.render(w=w)
File "/var/lib/jenkins/jobs/cubicweb/workspace/TOXENV/web/.tox/web/local/lib/python2.7/site-packages/cubicweb/view.py", line 138, in render
view_func(**context)
File "unittest_application.py", line 267, in call
raise Exception('whatever')
Exception: whatever
2016-02-12 11:39:40 - (py.warnings) WARNING: /var/lib/jenkins/jobs/cubicweb/workspace/TOXENV/web/.tox/web/local/lib/python2.7/site-packages/cubicweb/devtools/__init__.py:111: RuntimeWarning: anon8b66f372f47a4937ab75ab58ea8d4992 Open session found while turning repository off
%sessionid, RuntimeWarning)

.2016-02-12 11:39:41 - (py.warnings) WARNING: /var/lib/jenkins/jobs/cubicweb/workspace/TOXENV/web/.tox/web/local/lib/python2.7/site-packages/cubicweb/devtools/__init__.py:111: RuntimeWarning: anonde0d7c9d3cc648778c11abdcac895c01 Open session found while turning repository off
%sessionid, RuntimeWarning)

........2016-02-12 11:39:51 - (cubicweb.web) WARNING: the view toto could not be found
.........
================= unittest_views_apacherewrite.py ==================
.
=================== unittest_views_editforms.py ====================
......F...........
======================================================================
FAIL: test_inlined_form_views (unittest_views_editforms.AutomaticEntityFormTC)
----------------------------------------------------------------------
Traceback (most recent call last)
File "/var/lib/jenkins/jobs/cubicweb/workspace/TOXENV/web/.tox/web/local/lib/python2.7/site-packages/logilab/common/testlib.py", line 463, in _proceed
testfunc(*args, **kwargs)
File "/var/lib/jenkins/jobs/cubicweb/workspace/TOXENV/web/web/test/unittest_views_editforms.py", line 199, in test_inlined_form_views
self.assertEqual(len(formviews), 1, formviews)
File "/usr/lib/python2.7/unittest/case.py", line 513, in assertEqual
assertion_func(first, second, msg=msg)
File "/usr/lib/python2.7/unittest/case.py", line 506, in _baseAssertEqual
raise self.failureException(msg)
AssertionError: [<cubicweb.web.views.autoform.InlineEntityCreationFormView object at 0x7ff87356fd50>, <cubicweb.web.views.autoform.InlineAddNewLinkView object at 0x7ff87356f150>]

no stdout
no stderr
========================= unittest_web.py ==========================
..2016-02-12 11:39:57 - (py.warnings) WARNING: /var/lib/jenkins/jobs/cubicweb/workspace/TOXENV/web/.tox/web/local/lib/python2.7/site-packages/cubicweb/devtools/__init__.py:111: RuntimeWarning: anon1ae0718584e646868b034c36c90d98b3 Open session found while turning repository off
%sessionid, RuntimeWarning)

.2016-02-12 11:39:58 - (py.warnings) WARNING: /var/lib/jenkins/jobs/cubicweb/workspace/TOXENV/web/.tox/web/local/lib/python2.7/site-packages/cubicweb/devtools/__init__.py:111: RuntimeWarning: anon0db354d4d04d41c790e7e00a924da8cf Open session found while turning repository off
%sessionid, RuntimeWarning)

.2016-02-12 11:40:02 - (py.warnings) WARNING: /var/lib/jenkins/jobs/cubicweb/workspace/TOXENV/web/.tox/web/local/lib/python2.7/site-packages/cubicweb/devtools/__init__.py:111: RuntimeWarning: anon88c8fc979f824c2e866d885c1ea99208 Open session found while turning repository off
%sessionid, RuntimeWarning)

2016-02-12 11:40:02 - (py.warnings) WARNING: /var/lib/jenkins/jobs/cubicweb/workspace/TOXENV/web/.tox/web/local/lib/python2.7/site-packages/cubicweb/devtools/__init__.py:111: RuntimeWarning: anon3783b95be29e47578ab704d32b778a64 Open session found while turning repository off
%sessionid, RuntimeWarning)

.2016-02-12 11:40:05 - (py.warnings) WARNING: /var/lib/jenkins/jobs/cubicweb/workspace/TOXENV/web/.tox/web/local/lib/python2.7/site-packages/cubicweb/devtools/__init__.py:111: RuntimeWarning: admin8bdf63444a6f4750a8a67cc38eadfe83 Open session found while turning repository off
%sessionid, RuntimeWarning)

2016-02-12 11:40:05 - (py.warnings) WARNING: /var/lib/jenkins/jobs/cubicweb/workspace/TOXENV/web/.tox/web/local/lib/python2.7/site-packages/cubicweb/devtools/__init__.py:111: RuntimeWarning: anona09a73a12be1424d8c9afd422a572547 Open session found while turning repository off
%sessionid, RuntimeWarning)

.2016-02-12 11:40:06 - (py.warnings) WARNING: /var/lib/jenkins/jobs/cubicweb/workspace/TOXENV/web/.tox/web/local/lib/python2.7/site-packages/cubicweb/devtools/__init__.py:111: RuntimeWarning: anonf57dd121bc8a480794621a4da86de3fd Open session found while turning repository off
%sessionid, RuntimeWarning)

.2016-02-12 11:40:09 - (py.warnings) WARNING: /var/lib/jenkins/jobs/cubicweb/workspace/TOXENV/web/.tox/web/local/lib/python2.7/site-packages/cubicweb/devtools/__init__.py:111: RuntimeWarning: anonc18a2fe45ed342fdb568940b3f5b1204 Open session found while turning repository off
%sessionid, RuntimeWarning)

.2016-02-12 11:40:11 - (py.warnings) WARNING: /var/lib/jenkins/jobs/cubicweb/workspace/TOXENV/web/.tox/web/local/lib/python2.7/site-packages/cubicweb/devtools/__init__.py:111: RuntimeWarning: anon128a7c37b303427cb5c2c8e72c879fe5 Open session found while turning repository off
%sessionid, RuntimeWarning)

.
========================= unittest_http.py =========================
...........................
====================== unittest_formfields.py ======================
....2016-02-12 11:40:16 - (py.warnings) WARNING: /var/lib/jenkins/jobs/cubicweb/workspace/TOXENV/web/.tox/web/local/lib/python2.7/site-packages/cubicweb/web/formfields.py:1199: Warning: [yams 0.38] no targettype specified and there are several relation definitions for rtype owned_by: ['MicroBlogEntry', 'CWProperty', 'Personne', 'CWRType', 'File', 'CWSource', 'Salesterm', 'Ticket', 'BlogEntry', 'WorkflowTransition', 'CWConstraintType', 'Societe', 'CWEType', 'SubWorkflowExitPoint', 'CWAttribute', 'CWUser', 'CWConstraint', 'CWUniqueTogetherConstraint', 'BaseTransition', 'Tag', 'TreeNode', 'CWSourceHostConfig', 'CWRelation', 'CWSourceSchemaConfig', 'TrInfo', 'CWComputedRType', 'Transition', 'EmailAddress', 'Folder', 'RQLExpression', 'CWCache', 'ExternalUri', 'MicroBlog', 'Blog', 'UserAccount', 'Bookmark', 'Workflow', 'CWDataImport', 'Project', 'CWGroup', 'State']. Yet you get the first rdef.
rdef = eschema.rdef(rschema, role)

......
===================== unittest_http_headers.py =====================
.
===================== unittest_urlpublisher.py =====================
.............
========================= test_jscript.py ==========================
......................2016-02-12 11:40:41 - (py.warnings) WARNING: /var/lib/jenkins/jobs/cubicweb/workspace/TOXENV/web/.tox/web/local/lib/python2.7/site-packages/cubicweb/devtools/__init__.py:111: RuntimeWarning: anon23a9b4cdeaf44c30b69a92a31f80698c Open session found while turning repository off
%sessionid, RuntimeWarning)

2016-02-12 11:40:41 - (py.warnings) WARNING: /var/lib/jenkins/jobs/cubicweb/workspace/TOXENV/web/.tox/web/local/lib/python2.7/site-packages/cubicweb/devtools/__init__.py:111: RuntimeWarning: anondf1186e5e3f94e29ae8b182e2bcab016 Open session found while turning repository off
%sessionid, RuntimeWarning)

2016-02-12 11:40:41 - (py.warnings) WARNING: /var/lib/jenkins/jobs/cubicweb/workspace/TOXENV/web/.tox/web/local/lib/python2.7/site-packages/cubicweb/devtools/__init__.py:111: RuntimeWarning: anon90754a97558e469d811124d967fdf00e Open session found while turning repository off
%sessionid, RuntimeWarning)

===================== unittest_views_xmlrss.py =====================
.
====================== unittest_webconfig.py =======================
...
===================== unittest_magicsearch.py ======================
..................
===================== unittest_breadcrumbs.py ======================
.
=================== unittest_views_errorform.py ====================
....
=================== unittest_views_baseviews.py ====================
.............
======================== unittest_uicfg.py =========================
.........
=================== unittest_views_navigation.py ===================
...........
=============== unittest_views_searchrestriction.py ================
........
========================= unittest_form.py =========================
....2016-02-12 11:40:56 - (py.warnings) WARNING: /var/lib/jenkins/jobs/cubicweb/workspace/TOXENV/web/.tox/web/local/lib/python2.7/site-packages/cubicweb/web/formfields.py:1199: Warning: [yams 0.38] no targettype specified and there are several relation definitions for rtype tags: ['BlogEntry', 'CWUser', 'Tag']. Yet you get the first rdef.
rdef = eschema.rdef(rschema, role)

...........
====================== unittest_controller.py ======================
..
===================== unittest_views_forms.py ======================
...
==================== unittest_propertysheet.py =====================
.
======================== unittest_facet.py =========================
....................
======================= unittest_reledit.py ========================
.S.2016-02-12 11:41:03 - (cubicweb.rtags) WARNING: using explict subject type in <property object at 0x7ff874ca9c00>.tag_object_of() has no effect, use ("*", concerns, Project) instead of (Ticket, concerns, Project)
.
======================================================================
SKIPPED: test_default_forms (unittest_reledit.ClickAndEditFormTC)
Need to check if this test should still run post reledit/doreledit merge
===================== unittest_viewselector.py =====================
.......................
======================= unittest_request.py ========================
....
================ unittest_views_basecontrollers.py =================
.................2016-02-12 11:41:22 - (py.warnings) WARNING: /var/lib/jenkins/jobs/cubicweb/workspace/TOXENV/web/.tox/web/local/lib/python2.7/site-packages/cubicweb/web/formfields.py:1199: Warning: [yams 0.38] no targettype specified and there are several relation definitions for rtype to_entity: ['CWAttribute', 'CWRelation']. Yet you get the first rdef.
rdef = eschema.rdef(rschema, role)

.....2016-02-12 11:41:24 - (py.warnings) WARNING: /var/lib/jenkins/jobs/cubicweb/workspace/TOXENV/web/.tox/web/local/lib/python2.7/site-packages/cubicweb/web/formfields.py:1199: Warning: [yams 0.38] no targettype specified and there are several relation definitions for rtype read_permission: ['RQLExpression', 'CWGroup']. Yet you get the first rdef.
rdef = eschema.rdef(rschema, role)

2016-02-12 11:41:24 - (cubicweb.session) WARNING: no schema for 7
2016-02-12 11:41:24 - (cubicweb.session) WARNING: no schema for 7
..2016-02-12 11:41:25 - (cubicweb.web) WARNING: param login-subject mis-formatted
.........................................2016-02-12 11:41:46 - (py.warnings) WARNING: /var/lib/jenkins/jobs/cubicweb/workspace/TOXENV/web/.tox/web/local/lib/python2.7/site-packages/cubicweb/devtools/__init__.py:111: RuntimeWarning: anon0b72d99a5b10421ebe07e719d0c58f2f Open session found while turning repository off
%sessionid, RuntimeWarning)

.
====================== unittest_views_json.py ======================
...2016-02-12 11:41:48 - (py.warnings) WARNING: /var/lib/jenkins/jobs/cubicweb/workspace/TOXENV/web/.tox/web/local/lib/python2.7/site-packages/cubicweb/devtools/__init__.py:111: RuntimeWarning: anon0a9591eeb15d43518c1d4d78e5a3cad7 Open session found while turning repository off
%sessionid, RuntimeWarning)

.2016-02-12 11:41:48 - (cubicweb.web) WARNING: vid table can't be used with jsonp controller, falling back to jsonexport
2016-02-12 11:41:49 - (py.warnings) WARNING: /var/lib/jenkins/jobs/cubicweb/workspace/TOXENV/web/.tox/web/local/lib/python2.7/site-packages/cubicweb/devtools/__init__.py:111: RuntimeWarning: anon060ae40bf47f444ca72ae5db6ec96226 Open session found while turning repository off
%sessionid, RuntimeWarning)

.....2016-02-12 11:41:50 - (cubicweb.web) WARNING: vid table can't be used with jsonp controller, falling back to jsonexport
.
====================== unittest_urlrewrite.py ======================
........
=============== unittest_views_staticcontrollers.py ================
.2016-02-12 11:41:56 - (cubicweb.web) ERROR: concatenated data url error: u'dummy.js' file does not exist
.2016-02-12 11:41:56 - (cubicweb.web) ERROR: concatenated data url error: u'dummy.js' file does not exist
....
===================== unittest_formwidgets.py ======================
...
====================== unittest_views_csv.py =======================
..
==================== unittest_views_actions.py =====================
..
==================== unittest_views_pyviews.py =====================
..
================= unittest_views_basetemplates.py ==================
..
==================== unittest_idownloadable.py =====================
2016-02-12 11:42:02 - (cubicweb.web) ERROR: IOError()
Traceback (most recent call last):
File "/var/lib/jenkins/jobs/cubicweb/workspace/TOXENV/web/.tox/web/local/lib/python2.7/site-packages/cubicweb/web/application.py", line 369, in core_handle
result = controller.publish(rset=rset)
File "/var/lib/jenkins/jobs/cubicweb/workspace/TOXENV/web/.tox/web/local/lib/python2.7/site-packages/cubicweb/web/views/basecontrollers.py", line 134, in publish
rset=rset, view=view)
File "/var/lib/jenkins/jobs/cubicweb/workspace/TOXENV/web/.tox/web/local/lib/python2.7/site-packages/cubicweb/cwvreg.py", line 225, in main_template
res = obj.render(**kwargs)
File "/var/lib/jenkins/jobs/cubicweb/workspace/TOXENV/web/.tox/web/local/lib/python2.7/site-packages/cubicweb/view.py", line 138, in render
view_func(**context)
File "/var/lib/jenkins/jobs/cubicweb/workspace/TOXENV/web/.tox/web/local/lib/python2.7/site-packages/cubicweb/web/views/basetemplates.py", line 120, in call
view.render()
File "/var/lib/jenkins/jobs/cubicweb/workspace/TOXENV/web/.tox/web/local/lib/python2.7/site-packages/cubicweb/view.py", line 138, in render
view_func(**context)
File "/var/lib/jenkins/jobs/cubicweb/workspace/TOXENV/web/.tox/web/local/lib/python2.7/site-packages/cubicweb/web/views/idownloadable.py", line 94, in call
self.w(adapter.download_data())
File "unittest_idownloadable.py", line 56, in download_data
raise IOError()
IOError
......
Building autopopulate for database tmpdb
-> creating tables
-> inserting default user and default groups.
-> storing the schema in the database
-> database for instance data initialized.
*******************************************************************************
Ran 3843 test cases in 235.44s (219.21s CPU), 1 failures, 1 skipped
37 modules OK (1 failed)
failures: /var/lib/jenkins/jobs/cubicweb/workspace/TOXENV/web/web/test/unittest_views_editforms [1/18]
ERROR: InvocationError: '/var/lib/jenkins/jobs/cubicweb/workspace/TOXENV/web/.tox/web/bin/python -c from logilab.common import pytest; pytest.run() -t /var/lib/jenkins/jobs/cubicweb/workspace/TOXENV/web/web/test'
___________________________________ summary ____________________________________
ERROR: web: commands failed
Build step 'Conditional steps (multiple)' marked build as failure
Sending e-mails to: dlaxalde@logilab.fr jcr@logilab.fr syt@logilab.fr david@logilab.fr
[PostBuildScript] - Execution post build scripts.
[web] $ /bin/bash -xe /tmp/hudson6461610480995249783.sh
+ /var/lib/jenkins/scripts/notify_forge_apycot.py cwo cubicweb edb492ddf58c http://jenkins.logilab.fr/job/cubicweb/TOXENV=web/172/ --status failure
<br/>

log from execution
download