consoleText

download

20 Started by upstream project "cubicweb-3.22" build number 5
originally caused by:
Started by an SCM change
Building in workspace /var/lib/jenkins/jobs/cubicweb-3.22/workspace/TOXENV/web
[web] $ hg showconfig paths.default
[web] $ hg pull
pulling from http://hg.logilab.org/review/cubicweb
searching for changes
adding changesets
adding manifests
adding file changes
added 2 changesets with 2 changes to 3 files (+1 heads)
(run 'hg heads .' to see heads, 'hg merge' to merge)
[web] $ hg update --clean --rev 3ee14c60ffc9c1f00fb76a7ba930aed1373cbc99
1 files updated, 0 files merged, 0 files removed, 0 files unresolved
[web] $ hg --config extensions.purge= clean --all
[web] $ hg log --rev . --template {node}
[web] $ hg log --rev . --template {rev}
[web] $ hg id --branch
Run condition [File exists] enabling prebuild for step [BuilderChain]
[File exists] check if file exists [tox.ini]
Run condition [File exists] enabling perform for step [BuilderChain]
[web] $ /bin/bash -xe /tmp/hudson5187461525510167382.sh
+ find . '(' -name 'pgdb*' -o -name 'tmpdb*' ')' -print0
+ xargs -0 rm -rf
[web] $ /bin/bash -xe /tmp/hudson409662051356143355.sh
+ PATH=/usr/lib/postgresql/9.4/bin:/usr/local/bin:/usr/bin:/bin:/usr/local/games:/usr/games
+ tox --recreate
GLOB sdist-make: /var/lib/jenkins/jobs/cubicweb-3.22/workspace/TOXENV/web/setup.py
web create: /var/lib/jenkins/jobs/cubicweb-3.22/workspace/TOXENV/web/.tox/web
web installdeps: -r/var/lib/jenkins/jobs/cubicweb-3.22/workspace/TOXENV/web/web/test/requirements.txt
web inst: /var/lib/jenkins/jobs/cubicweb-3.22/workspace/TOXENV/web/.tox/dist/cubicweb-3.22.1.zip
web installed: You are using pip version 7.1.2, however version 8.0.2 is available.,You should consider upgrading via the 'pip install --upgrade pip' command.,beautifulsoup4==4.3.2,boto==2.34.0,bzr-etckeeper==0.0.0,cffi==0.8.6,characteristic==0.1.0,chardet==2.3.0,Cheetah==2.4.4,cloud-init==0.7.6,colorama==0.3.2,configobj==5.0.6,coverage==3.7.1,croniter==0.3.4,cryptography==0.6.1,cubicweb==3.22.1,cubicweb-blog==1.11.1,cubicweb-file==1.17.0,cubicweb-tag==1.8.2,cwclientlib==0.4.1,Cython==0.21.1,decorator==3.4.0,docutils==0.12,ecdsa==0.11,euca2ools==3.1.0,GDAL==1.10.1,hg-evolve==5.2.1,html2text==2016.1.8,html5lib==0.999,isodate==0.5.0,Jinja2==2.7.3,joblib==0.8.3,jsonpatch==1.3,jsonpointer==1.0,logilab-common==1.1.0,logilab-constraint==0.6.0,logilab-database==1.15.0,logilab-mtconverter==0.9.0,lxml==3.4.0,M2Crypto==0.21.1,Mako==1.0.0,Markdown==2.5.1,MarkupSafe==0.23,matplotlib==1.4.2,mercurial==3.5.2,mock==1.0.1,msgpack-python==0.4.2,nose==1.3.4,numexpr==2.4,numpy==1.8.2,oauth==1.0.1,openpyxl==1.7.0,pandas==0.14.1,paramiko==1.15.1,passlib==1.6.5,pep8==1.5.7,Pillow==2.6.1,pluggy==0.3.1,ply==3.4,prettytable==0.7.2,psycopg2==2.5.4,py==1.4.31,pyasn1==0.1.7,pyasn1-modules==0.0.5,pycparser==2.10,pycrypto==2.6.1,Pygments==2.0.1,pyinotify==0.9.4,pyOpenSSL==0.14,pyparsing==2.0.3,pyserial==2.6,pysqlite==2.6.3,python-apt==0.9.3.12,python-augeas==0.4.1,python-dateutil==2.2,python-jenkins==0.2.1,python-ldap==2.4.10,python-yapps==2.1.1,pytz==2012rc0,PyYAML==3.11,pyzmq==14.4.0,rdflib==4.1.2,requestbuilder==0.2.3,requests==2.4.3,roman==2.0.0,rql==0.34.0,rubber==1.1,salt==2015.5.3,scikit-learn==0.14.1,scipy==0.14.0,service-identity==1.0.0,Shapely==1.4.3,simplejson==3.6.5,SimpleTAL==4.1,six==1.8.0,SPARQLWrapper==1.6.0,statsmodels==0.4.2,tables==3.1.1,tox==2.3.1,Twisted==15.5.0,urllib3==1.9.1,virtualenv==13.1.2,waitress==0.8.10,WebOb==1.5.1,WebTest==2.0.20,wheel==0.24.0,xlrd==0.9.2,xlwt==0.7.5,yams==0.42.0,Yapps==2.2.0,Yapps2==2.2.0,zope.interface==4.1.3
web runtests: PYTHONHASHSEED='3067448533'
web runtests: commands[0] | /var/lib/jenkins/jobs/cubicweb-3.22/workspace/TOXENV/web/.tox/web/bin/python -c from logilab.common import pytest; pytest.run() -t /var/lib/jenkins/jobs/cubicweb-3.22/workspace/TOXENV/web/web/test
======================== unittest_facet.py =========================
2016-02-19 11:09:40 - (cubicweb.appobject) WARNING: can't find any workflow for CWUser
2016-02-19 11:09:52 - (cubicweb.web) WARNING: [3.17] massmailing extracted to cube massmailing that was not found. try installing it.
2016-02-19 11:09:53 - (cubicweb.web) WARNING: [3.17] igeocoding extracted to cube geocoding that was not found. try installing it.
2016-02-19 11:09:53 - (cubicweb.web) WARNING: [3.17] embedding extracted to cube embed that was not found. try installing it.
2016-02-19 11:09:53 - (cubicweb.web) WARNING: [3.17] isioc extracted to cube sioc that was not found. try installing it.
....................
========================= unittest_http.py =========================
...........................
========================= test_jscript.py ==========================
......................2016-02-19 11:10:07 - (py.warnings) WARNING: /var/lib/jenkins/jobs/cubicweb-3.22/workspace/TOXENV/web/.tox/web/local/lib/python2.7/site-packages/cubicweb/devtools/__init__.py:111: RuntimeWarning: anon129c756559ec49508c66cab788d58bbf Open session found while turning repository off
%sessionid, RuntimeWarning)

2016-02-19 11:10:07 - (py.warnings) WARNING: /var/lib/jenkins/jobs/cubicweb-3.22/workspace/TOXENV/web/.tox/web/local/lib/python2.7/site-packages/cubicweb/devtools/__init__.py:111: RuntimeWarning: anona70235cc342f48c5bad01bc85a79ebea Open session found while turning repository off
%sessionid, RuntimeWarning)

2016-02-19 11:10:07 - (py.warnings) WARNING: /var/lib/jenkins/jobs/cubicweb-3.22/workspace/TOXENV/web/.tox/web/local/lib/python2.7/site-packages/cubicweb/devtools/__init__.py:111: RuntimeWarning: anon7d94a39a67b643cc841964ce63cfb34b Open session found while turning repository off
%sessionid, RuntimeWarning)

===================== unittest_views_xmlrss.py =====================
.
===================== unittest_views_forms.py ======================
...
===================== unittest_application.py ======================
2016-02-19 11:10:11 - (cubicweb.web) ERROR: Exception('whatever',)
Traceback (most recent call last):
File "/var/lib/jenkins/jobs/cubicweb-3.22/workspace/TOXENV/web/.tox/web/local/lib/python2.7/site-packages/cubicweb/web/application.py", line 369, in core_handle
result = controller.publish(rset=rset)
File "/var/lib/jenkins/jobs/cubicweb-3.22/workspace/TOXENV/web/.tox/web/local/lib/python2.7/site-packages/cubicweb/web/views/basecontrollers.py", line 134, in publish
rset=rset, view=view)
File "/var/lib/jenkins/jobs/cubicweb-3.22/workspace/TOXENV/web/.tox/web/local/lib/python2.7/site-packages/cubicweb/cwvreg.py", line 225, in main_template
res = obj.render(**kwargs)
File "/var/lib/jenkins/jobs/cubicweb-3.22/workspace/TOXENV/web/.tox/web/local/lib/python2.7/site-packages/cubicweb/view.py", line 138, in render
view_func(**context)
File "/var/lib/jenkins/jobs/cubicweb-3.22/workspace/TOXENV/web/.tox/web/local/lib/python2.7/site-packages/cubicweb/web/views/basetemplates.py", line 163, in call
view.render(w=w)
File "/var/lib/jenkins/jobs/cubicweb-3.22/workspace/TOXENV/web/.tox/web/local/lib/python2.7/site-packages/cubicweb/view.py", line 138, in render
view_func(**context)
File "unittest_application.py", line 519, in call
raise Exception('whatever')
Exception: whatever
2016-02-19 11:10:11 - (py.warnings) WARNING: /var/lib/jenkins/jobs/cubicweb-3.22/workspace/TOXENV/web/.tox/web/local/lib/python2.7/site-packages/cubicweb/devtools/__init__.py:111: RuntimeWarning: anoneba27194718e40b48e464637ec2f9bd0 Open session found while turning repository off
%sessionid, RuntimeWarning)

.2016-02-19 11:10:13 - (py.warnings) WARNING: /var/lib/jenkins/jobs/cubicweb-3.22/workspace/TOXENV/web/.tox/web/local/lib/python2.7/site-packages/cubicweb/devtools/__init__.py:111: RuntimeWarning: anond404b593ac9c4ac5a9a31dd204aba545 Open session found while turning repository off
%sessionid, RuntimeWarning)

....2016-02-19 11:10:18 - (py.warnings) WARNING: /var/lib/jenkins/jobs/cubicweb-3.22/workspace/TOXENV/web/.tox/web/local/lib/python2.7/site-packages/cubicweb/web/formfields.py:1199: Warning: [yams 0.38] no targettype specified and there are several relation definitions for rtype parent: ['Directory', 'Filesystem']. Yet you get the first rdef.
rdef = eschema.rdef(rschema, role)

..E....2016-02-19 11:10:24 - (cubicweb.web) WARNING: the view toto could not be found
...FF.....FE.....
======================================================================
ERROR: test_delete_mandatory_composite (unittest_application.ApplicationTC)
----------------------------------------------------------------------
Traceback (most recent call last)
File "/var/lib/jenkins/jobs/cubicweb-3.22/workspace/TOXENV/web/.tox/web/local/lib/python2.7/site-packages/logilab/common/testlib.py", line 463, in _proceed
testfunc(*args, **kwargs)
File "/var/lib/jenkins/jobs/cubicweb-3.22/workspace/TOXENV/web/web/test/unittest_application.py", line 511, in test_delete_mandatory_composite
path, _params = self.expect_redirect_handle_request(req, 'edit')
File "/var/lib/jenkins/jobs/cubicweb-3.22/workspace/TOXENV/web/.tox/web/local/lib/python2.7/site-packages/cubicweb/devtools/testlib.py", line 827, in expect_redirect_handle_request
self.app_handle_request(req, path)
File "/var/lib/jenkins/jobs/cubicweb-3.22/workspace/TOXENV/web/.tox/web/local/lib/python2.7/site-packages/cubicweb/devtools/testlib.py", line 686, in app_handle_request
return self.app.core_handle(req, path)
File "/var/lib/jenkins/jobs/cubicweb-3.22/workspace/TOXENV/web/.tox/web/local/lib/python2.7/site-packages/cubicweb/web/application.py", line 393, in core_handle
result = self.validation_error_handler(req, ex)
File "/var/lib/jenkins/jobs/cubicweb-3.22/workspace/TOXENV/web/.tox/web/local/lib/python2.7/site-packages/cubicweb/web/application.py", line 461, in validation_error_handler
return self.error_handler(req, ex, tb=False)
File "/var/lib/jenkins/jobs/cubicweb-3.22/workspace/TOXENV/web/.tox/web/local/lib/python2.7/site-packages/cubicweb/web/application.py", line 369, in core_handle
result = controller.publish(rset=rset)
File "/var/lib/jenkins/jobs/cubicweb-3.22/workspace/TOXENV/web/.tox/web/local/lib/python2.7/site-packages/cubicweb/web/views/editcontroller.py", line 132, in publish
self._default_publish()
File "/var/lib/jenkins/jobs/cubicweb-3.22/workspace/TOXENV/web/.tox/web/local/lib/python2.7/site-packages/cubicweb/web/views/editcontroller.py", line 197, in _default_publish
eid = self.edit_entity(formparams)
File "/var/lib/jenkins/jobs/cubicweb-3.22/workspace/TOXENV/web/.tox/web/local/lib/python2.7/site-packages/cubicweb/web/views/editcontroller.py", line 271, in edit_entity
raise ValidationError(valerror_eid(entity.eid), errors)
ValidationError: 1295 (has_permission-object): required field

no stdout
no stderr
======================================================================
ERROR: test_subject_subentity_removal (unittest_application.ApplicationTC)
Editcontroller: detaching a composite relation removes the subentity
----------------------------------------------------------------------
Traceback (most recent call last)
File "/var/lib/jenkins/jobs/cubicweb-3.22/workspace/TOXENV/web/.tox/web/local/lib/python2.7/site-packages/logilab/common/testlib.py", line 463, in _proceed
testfunc(*args, **kwargs)
File "/var/lib/jenkins/jobs/cubicweb-3.22/workspace/TOXENV/web/web/test/unittest_application.py", line 355, in test_subject_subentity_removal
self._edit_parent(sub1.eid, parent_eid=None, **attrs)
File "/var/lib/jenkins/jobs/cubicweb-3.22/workspace/TOXENV/web/web/test/unittest_application.py", line 278, in _edit_parent
self.expect_redirect_handle_request(req)
File "/var/lib/jenkins/jobs/cubicweb-3.22/workspace/TOXENV/web/.tox/web/local/lib/python2.7/site-packages/cubicweb/devtools/testlib.py", line 827, in expect_redirect_handle_request
self.app_handle_request(req, path)
File "/var/lib/jenkins/jobs/cubicweb-3.22/workspace/TOXENV/web/.tox/web/local/lib/python2.7/site-packages/cubicweb/devtools/testlib.py", line 686, in app_handle_request
return self.app.core_handle(req, path)
File "/var/lib/jenkins/jobs/cubicweb-3.22/workspace/TOXENV/web/.tox/web/local/lib/python2.7/site-packages/cubicweb/web/application.py", line 393, in core_handle
result = self.validation_error_handler(req, ex)
File "/var/lib/jenkins/jobs/cubicweb-3.22/workspace/TOXENV/web/.tox/web/local/lib/python2.7/site-packages/cubicweb/web/application.py", line 461, in validation_error_handler
return self.error_handler(req, ex, tb=False)
File "/var/lib/jenkins/jobs/cubicweb-3.22/workspace/TOXENV/web/.tox/web/local/lib/python2.7/site-packages/cubicweb/web/application.py", line 369, in core_handle
result = controller.publish(rset=rset)
File "/var/lib/jenkins/jobs/cubicweb-3.22/workspace/TOXENV/web/.tox/web/local/lib/python2.7/site-packages/cubicweb/web/views/editcontroller.py", line 132, in publish
self._default_publish()
File "/var/lib/jenkins/jobs/cubicweb-3.22/workspace/TOXENV/web/.tox/web/local/lib/python2.7/site-packages/cubicweb/web/views/editcontroller.py", line 197, in _default_publish
eid = self.edit_entity(formparams)
File "/var/lib/jenkins/jobs/cubicweb-3.22/workspace/TOXENV/web/.tox/web/local/lib/python2.7/site-packages/cubicweb/web/views/editcontroller.py", line 271, in edit_entity
raise ValidationError(valerror_eid(entity.eid), errors)
ValidationError: 1296 (name-subject): required field

no stdout
no stderr
======================================================================
FAIL: test_object_mixed_composite_subentity_removal_2 (unittest_application.ApplicationTC)
Editcontroller: detaching several subentities respects each rdef's
----------------------------------------------------------------------
Traceback (most recent call last)
File "/var/lib/jenkins/jobs/cubicweb-3.22/workspace/TOXENV/web/.tox/web/local/lib/python2.7/site-packages/logilab/common/testlib.py", line 463, in _proceed
testfunc(*args, **kwargs)
File "/var/lib/jenkins/jobs/cubicweb-3.22/workspace/TOXENV/web/web/test/unittest_application.py", line 489, in test_object_mixed_composite_subentity_removal_2
self.assertFalse(cnx.find('Directory', eid=subd.eid))
File "/usr/lib/python2.7/unittest/case.py", line 416, in assertFalse
raise self.failureException(msg)
AssertionError: <resultset 'Any X WHERE X is Directory, X eid %(eid)s' (1 rows): [1297] ((u'Directory',))> is not false

no stdout
no stderr
======================================================================
FAIL: test_object_subentity_removal (unittest_application.ApplicationTC)
Editcontroller: detaching a composite relation removes the subentity
----------------------------------------------------------------------
Traceback (most recent call last)
File "/var/lib/jenkins/jobs/cubicweb-3.22/workspace/TOXENV/web/.tox/web/local/lib/python2.7/site-packages/logilab/common/testlib.py", line 463, in _proceed
testfunc(*args, **kwargs)
File "/var/lib/jenkins/jobs/cubicweb-3.22/workspace/TOXENV/web/web/test/unittest_application.py", line 377, in test_object_subentity_removal
self.assertFalse(cnx.find('Directory', eid=sub2.eid))
File "/usr/lib/python2.7/unittest/case.py", line 416, in assertFalse
raise self.failureException(msg)
AssertionError: <resultset 'Any X WHERE X is Directory, X eid %(eid)s' (1 rows): [1297] ((u'Directory',))> is not false

no stdout
no stderr
======================================================================
FAIL: test_subject_mixed_composite_subentity_removal_2 (unittest_application.ApplicationTC)
Editcontroller: detaching several subentities respects each rdef's
----------------------------------------------------------------------
Traceback (most recent call last)
File "/var/lib/jenkins/jobs/cubicweb-3.22/workspace/TOXENV/web/.tox/web/local/lib/python2.7/site-packages/logilab/common/testlib.py", line 463, in _proceed
testfunc(*args, **kwargs)
File "/var/lib/jenkins/jobs/cubicweb-3.22/workspace/TOXENV/web/web/test/unittest_application.py", line 450, in test_subject_mixed_composite_subentity_removal_2
self.assertFalse(cnx.find('Directory', eid=subd.eid))
File "/usr/lib/python2.7/unittest/case.py", line 416, in assertFalse
raise self.failureException(msg)
AssertionError: <resultset 'Any X WHERE X is Directory, X eid %(eid)s' (1 rows): [1297] ((u'Directory',))> is not false

no stdout
no stderr
=================== unittest_views_editforms.py ====================
..................
===================== unittest_urlpublisher.py =====================
.............
=================== unittest_views_errorform.py ====================
....
=================== unittest_views_baseviews.py ====================
.............
================= unittest_views_apacherewrite.py ==================
.
========================= unittest_web.py ==========================
..2016-02-19 11:10:45 - (py.warnings) WARNING: /var/lib/jenkins/jobs/cubicweb-3.22/workspace/TOXENV/web/.tox/web/local/lib/python2.7/site-packages/cubicweb/devtools/__init__.py:111: RuntimeWarning: anon0700bfb774984dd3904dd4616dd66083 Open session found while turning repository off
%sessionid, RuntimeWarning)

.2016-02-19 11:10:46 - (py.warnings) WARNING: /var/lib/jenkins/jobs/cubicweb-3.22/workspace/TOXENV/web/.tox/web/local/lib/python2.7/site-packages/cubicweb/devtools/__init__.py:111: RuntimeWarning: anon19670c15cb1c4d018a50619bfb248eac Open session found while turning repository off
%sessionid, RuntimeWarning)

.2016-02-19 11:10:51 - (py.warnings) WARNING: /var/lib/jenkins/jobs/cubicweb-3.22/workspace/TOXENV/web/.tox/web/local/lib/python2.7/site-packages/cubicweb/devtools/__init__.py:111: RuntimeWarning: anon736f2103fa114aa58354e0741f665a36 Open session found while turning repository off
%sessionid, RuntimeWarning)

2016-02-19 11:10:51 - (py.warnings) WARNING: /var/lib/jenkins/jobs/cubicweb-3.22/workspace/TOXENV/web/.tox/web/local/lib/python2.7/site-packages/cubicweb/devtools/__init__.py:111: RuntimeWarning: anon9fb30bfda18a4b229973c9ece8594494 Open session found while turning repository off
%sessionid, RuntimeWarning)

.2016-02-19 11:10:55 - (py.warnings) WARNING: /var/lib/jenkins/jobs/cubicweb-3.22/workspace/TOXENV/web/.tox/web/local/lib/python2.7/site-packages/cubicweb/devtools/__init__.py:111: RuntimeWarning: anon1bb33252c0494b6795e130536b24ec8a Open session found while turning repository off
%sessionid, RuntimeWarning)

2016-02-19 11:10:55 - (py.warnings) WARNING: /var/lib/jenkins/jobs/cubicweb-3.22/workspace/TOXENV/web/.tox/web/local/lib/python2.7/site-packages/cubicweb/devtools/__init__.py:111: RuntimeWarning: admin28a5feef73eb482999ad209f24f402ef Open session found while turning repository off
%sessionid, RuntimeWarning)

.2016-02-19 11:10:58 - (py.warnings) WARNING: /var/lib/jenkins/jobs/cubicweb-3.22/workspace/TOXENV/web/.tox/web/local/lib/python2.7/site-packages/cubicweb/devtools/__init__.py:111: RuntimeWarning: anonb1d7c3584deb46048967caea540e5226 Open session found while turning repository off
%sessionid, RuntimeWarning)

.2016-02-19 11:11:00 - (py.warnings) WARNING: /var/lib/jenkins/jobs/cubicweb-3.22/workspace/TOXENV/web/.tox/web/local/lib/python2.7/site-packages/cubicweb/devtools/__init__.py:111: RuntimeWarning: anon0930f4afbcde4b9e9d720438784afef3 Open session found while turning repository off
%sessionid, RuntimeWarning)

.2016-02-19 11:11:02 - (py.warnings) WARNING: /var/lib/jenkins/jobs/cubicweb-3.22/workspace/TOXENV/web/.tox/web/local/lib/python2.7/site-packages/cubicweb/devtools/__init__.py:111: RuntimeWarning: anon9c46f1d2695d455d89de7dd2861e13de Open session found while turning repository off
%sessionid, RuntimeWarning)

.
==================== unittest_views_actions.py =====================
..
======================= unittest_reledit.py ========================
.S.2016-02-19 11:11:04 - (cubicweb.rtags) WARNING: using explict subject type in <property object at 0x7f9832a29b50>.tag_object_of() has no effect, use ("*", concerns, Project) instead of (Ticket, concerns, Project)
.
======================================================================
SKIPPED: test_default_forms (unittest_reledit.ClickAndEditFormTC)
Need to check if this test should still run post reledit/doreledit merge
=============== unittest_views_staticcontrollers.py ================
.2016-02-19 11:11:05 - (cubicweb.web) ERROR: concatenated data url error: u'dummy.js' file does not exist
.2016-02-19 11:11:05 - (cubicweb.web) ERROR: concatenated data url error: u'dummy.js' file does not exist
....
========================== test_views.py ===========================
2016-02-19 11:11:09 - (py.warnings) WARNING: /var/lib/jenkins/jobs/cubicweb-3.22/workspace/TOXENV/web/.tox/web/local/lib/python2.7/site-packages/cubicweb/devtools/__init__.py:111: RuntimeWarning: admin1dadf18a0dbc444bb604f37f97ff23a4 Open session found while turning repository off
%sessionid, RuntimeWarning)

........................................................................................................................................................................................................................................................................................................................................................................................................................................................................................................................................................................................................................................2016-02-19 11:11:14 - (py.warnings) WARNING: /var/lib/jenkins/jobs/cubicweb-3.22/workspace/TOXENV/web/.tox/web/local/lib/python2.7/site-packages/cubicweb/web/formfields.py:1199: Warning: [yams 0.38] no targettype specified and there are several relation definitions for rtype allowed_transition: ['BaseTransition', 'Transition', 'WorkflowTransition']. Yet you get the first rdef.
rdef = eschema.rdef(rschema, role)

...................................................................................................................................................................................................................................................................................................................................................................................................................................................................................................................................................................................................................................................................................................................................................................................................................................................................................................................................................................................2016-02-19 11:11:38 - (py.warnings) WARNING: /var/lib/jenkins/jobs/cubicweb-3.22/workspace/TOXENV/web/.tox/web/local/lib/python2.7/site-packages/cubicweb/web/formfields.py:1199: Warning: [yams 0.38] no targettype specified and there are several relation definitions for rtype constrained_by: ['CWRelation', 'CWAttribute']. Yet you get the first rdef.
rdef = eschema.rdef(rschema, role)

...................................................................................................................................................................................................................................................................................................................................................................................................................................................................................................................................................................................................................................................................................................................................................................................................................................................................................................................................................................................................................................................................................................................................................................................................................................................................................................................................................................................................................................................................................................................................................................................................................................2016-02-19 11:12:05 - (cubicweb.appobject) ERROR: cycle in breadcrumbs for entity <Entity TreeNode 1459 ['cwuri'] at 140291237573584>
.......2016-02-19 11:12:05 - (cubicweb.appobject) ERROR: cycle in breadcrumbs for entity <Entity TreeNode 1459 ['name', 'creation_date', 'cwuri', 'modification_date'] at 140291237573584>
...2016-02-19 11:12:05 - (cubicweb.appobject) ERROR: cycle in breadcrumbs for entity <Entity TreeNode 1459 ['name', 'creation_date', 'cwuri', 'modification_date'] at 140291237573584>
.2016-02-19 11:12:05 - (cubicweb.appobject) ERROR: cycle in breadcrumbs for entity <Entity TreeNode 1459 ['name', 'creation_date', 'cwuri', 'modification_date'] at 140291237573584>
.2016-02-19 11:12:05 - (cubicweb.appobject) ERROR: cycle in breadcrumbs for entity <Entity TreeNode 1459 ['name', 'creation_date', 'cwuri', 'modification_date'] at 140291237573584>
...2016-02-19 11:12:05 - (cubicweb.appobject) ERROR: cycle in breadcrumbs for entity <Entity TreeNode 1459 ['name', 'creation_date', 'cwuri', 'modification_date'] at 140291237573584>
.2016-02-19 11:12:05 - (cubicweb.appobject) ERROR: cycle in breadcrumbs for entity <Entity TreeNode 1459 ['name', 'creation_date', 'cwuri', 'modification_date'] at 140291237573584>
.2016-02-19 11:12:05 - (cubicweb.appobject) ERROR: cycle in breadcrumbs for entity <Entity TreeNode 1459 ['name', 'creation_date', 'cwuri', 'modification_date'] at 140291237573584>
..........................2016-02-19 11:12:05 - (cubicweb.appobject) ERROR: cycle in breadcrumbs for entity <Entity TreeNode 1459 ['name', 'creation_date', 'cwuri', 'modification_date'] at 140291237573584>
............................................................................................................................................................................................................................................................................................................................................................................................................................................................................................................................................................................................................................................................................................
===================== unittest_http_headers.py =====================
.
==================== unittest_idownloadable.py =====================
2016-02-19 11:12:26 - (cubicweb.web) ERROR: IOError()
Traceback (most recent call last):
File "/var/lib/jenkins/jobs/cubicweb-3.22/workspace/TOXENV/web/.tox/web/local/lib/python2.7/site-packages/cubicweb/web/application.py", line 369, in core_handle
result = controller.publish(rset=rset)
File "/var/lib/jenkins/jobs/cubicweb-3.22/workspace/TOXENV/web/.tox/web/local/lib/python2.7/site-packages/cubicweb/web/views/basecontrollers.py", line 134, in publish
rset=rset, view=view)
File "/var/lib/jenkins/jobs/cubicweb-3.22/workspace/TOXENV/web/.tox/web/local/lib/python2.7/site-packages/cubicweb/cwvreg.py", line 225, in main_template
res = obj.render(**kwargs)
File "/var/lib/jenkins/jobs/cubicweb-3.22/workspace/TOXENV/web/.tox/web/local/lib/python2.7/site-packages/cubicweb/view.py", line 138, in render
view_func(**context)
File "/var/lib/jenkins/jobs/cubicweb-3.22/workspace/TOXENV/web/.tox/web/local/lib/python2.7/site-packages/cubicweb/web/views/basetemplates.py", line 120, in call
view.render()
File "/var/lib/jenkins/jobs/cubicweb-3.22/workspace/TOXENV/web/.tox/web/local/lib/python2.7/site-packages/cubicweb/view.py", line 138, in render
view_func(**context)
File "/var/lib/jenkins/jobs/cubicweb-3.22/workspace/TOXENV/web/.tox/web/local/lib/python2.7/site-packages/cubicweb/web/views/idownloadable.py", line 94, in call
self.w(adapter.download_data())
File "unittest_idownloadable.py", line 56, in download_data
raise IOError()
IOError
......
==================== unittest_views_pyviews.py =====================
..
================= unittest_views_basetemplates.py ==================
..
==================== unittest_views_treeview.py ====================
.
==================== unittest_propertysheet.py =====================
.
======================== unittest_uicfg.py =========================
.........
====================== unittest_formfields.py ======================
....2016-02-19 11:12:35 - (py.warnings) WARNING: /var/lib/jenkins/jobs/cubicweb-3.22/workspace/TOXENV/web/.tox/web/local/lib/python2.7/site-packages/cubicweb/web/formfields.py:1199: Warning: [yams 0.38] no targettype specified and there are several relation definitions for rtype owned_by: ['Personne', 'Directory', 'Salesterm', 'Project', 'Tag', 'Workflow', 'Societe', 'CWGroup', 'RQLExpression', 'Blog', 'CWConstraintType', 'SubWorkflowExitPoint', 'UserAccount', 'CWEType', 'MicroBlog', 'State', 'Bookmark', 'Transition', 'MicroBlogEntry', 'File', 'BlogEntry', 'CWRelation', 'Filesystem', 'Version', 'Folder', 'DirectoryPermission', 'CWCache', 'CWSource', 'CWAttribute', 'BaseTransition', 'TreeNode', 'CWComputedRType', 'CWUser', 'EmailAddress', 'CWProperty', 'TrInfo', 'CWDataImport', 'CWConstraint', 'ExternalUri', 'Ticket', 'CWRType', 'WorkflowTransition', 'CWUniqueTogetherConstraint', 'CWSourceSchemaConfig', 'CWSourceHostConfig']. Yet you get the first rdef.
rdef = eschema.rdef(rschema, role)

......
=================== unittest_views_navigation.py ===================
...........
===================== unittest_formwidgets.py ======================
...
===================== unittest_viewselector.py =====================
.......................
====================== unittest_views_json.py ======================
...2016-02-19 11:12:44 - (py.warnings) WARNING: /var/lib/jenkins/jobs/cubicweb-3.22/workspace/TOXENV/web/.tox/web/local/lib/python2.7/site-packages/cubicweb/devtools/__init__.py:111: RuntimeWarning: anon56cdc9983d864183bc0ec2a69bd75afc Open session found while turning repository off
%sessionid, RuntimeWarning)

.2016-02-19 11:12:44 - (cubicweb.web) WARNING: vid table can't be used with jsonp controller, falling back to jsonexport
2016-02-19 11:12:45 - (py.warnings) WARNING: /var/lib/jenkins/jobs/cubicweb-3.22/workspace/TOXENV/web/.tox/web/local/lib/python2.7/site-packages/cubicweb/devtools/__init__.py:111: RuntimeWarning: anon9a7c1f787e224fba8f090554a5977911 Open session found while turning repository off
%sessionid, RuntimeWarning)

.....2016-02-19 11:12:46 - (cubicweb.web) WARNING: vid table can't be used with jsonp controller, falling back to jsonexport
.
========================= unittest_form.py =========================
....2016-02-19 11:12:46 - (py.warnings) WARNING: /var/lib/jenkins/jobs/cubicweb-3.22/workspace/TOXENV/web/.tox/web/local/lib/python2.7/site-packages/cubicweb/web/formfields.py:1199: Warning: [yams 0.38] no targettype specified and there are several relation definitions for rtype tags: ['Tag', 'BlogEntry', 'CWUser']. Yet you get the first rdef.
rdef = eschema.rdef(rschema, role)

...........
===================== unittest_breadcrumbs.py ======================
.
====================== unittest_controller.py ======================
..
===================== unittest_magicsearch.py ======================
..................
====================== unittest_urlrewrite.py ======================
........
================ unittest_views_basecontrollers.py =================
.................2016-02-19 11:13:07 - (py.warnings) WARNING: /var/lib/jenkins/jobs/cubicweb-3.22/workspace/TOXENV/web/.tox/web/local/lib/python2.7/site-packages/cubicweb/web/formfields.py:1199: Warning: [yams 0.38] no targettype specified and there are several relation definitions for rtype to_entity: ['CWRelation', 'CWAttribute']. Yet you get the first rdef.
rdef = eschema.rdef(rschema, role)

.....2016-02-19 11:13:08 - (py.warnings) WARNING: /var/lib/jenkins/jobs/cubicweb-3.22/workspace/TOXENV/web/.tox/web/local/lib/python2.7/site-packages/cubicweb/web/formfields.py:1199: Warning: [yams 0.38] no targettype specified and there are several relation definitions for rtype read_permission: ['RQLExpression', 'CWGroup']. Yet you get the first rdef.
rdef = eschema.rdef(rschema, role)

2016-02-19 11:13:08 - (cubicweb.session) WARNING: no schema for 7
2016-02-19 11:13:09 - (cubicweb.session) WARNING: no schema for 7
..2016-02-19 11:13:09 - (cubicweb.web) WARNING: param login-subject mis-formatted
.........................................2016-02-19 11:13:28 - (py.warnings) WARNING: /var/lib/jenkins/jobs/cubicweb-3.22/workspace/TOXENV/web/.tox/web/local/lib/python2.7/site-packages/cubicweb/devtools/__init__.py:111: RuntimeWarning: anonae7d47ce1fde4c5381a9e68b948e4b3a Open session found while turning repository off
%sessionid, RuntimeWarning)

.
====================== unittest_views_csv.py =======================
..
====================== unittest_webconfig.py =======================
...
======================= unittest_request.py ========================
....
=============== unittest_views_searchrestriction.py ================
........
-> creating tables
-> inserting default user and default groups.
-> storing the schema in the database
-> database for instance data initialized.
Building autopopulate for database tmpdb
*******************************************************************************
Ran 4222 test cases in 232.20s (220.49s CPU), 2 errors, 3 failures, 1 skipped
37 modules OK (1 failed)
failures: /var/lib/jenkins/jobs/cubicweb-3.22/workspace/TOXENV/web/web/test/unittest_application [5/29]
ERROR: InvocationError: '/var/lib/jenkins/jobs/cubicweb-3.22/workspace/TOXENV/web/.tox/web/bin/python -c from logilab.common import pytest; pytest.run() -t /var/lib/jenkins/jobs/cubicweb-3.22/workspace/TOXENV/web/web/test'
___________________________________ summary ____________________________________
ERROR: web: commands failed
Build step 'Conditional steps (multiple)' marked build as failure
Sending e-mails to: dlaxalde@logilab.fr jcr@logilab.fr syt@logilab.fr david@logilab.fr
[PostBuildScript] - Execution post build scripts.
[web] $ /bin/bash -xe /tmp/hudson4109543867166404863.sh
+ /var/lib/jenkins/scripts/notify_forge_apycot.py cwo cubicweb 3ee14c60ffc9 http://jenkins.logilab.fr/job/cubicweb-3.22/TOXENV=web/5/ --status failure
<br/>

log from execution
download