consoleText

download

20 Started by upstream project "cubicweb-3.23" build number 17
originally caused by:
Started by an SCM change
Building in workspace /var/lib/jenkins/jobs/cubicweb-3.23/workspace/TOXENV/web
[web] $ hg showconfig paths.default
[web] $ hg pull
pulling from http://hg.logilab.org/review/cubicweb
real URL is https://hg.logilab.org/review/cubicweb
searching for changes
adding changesets
adding manifests
adding file changes
added 2 changesets with 2 changes to 5 files (+1 heads)
(run 'hg heads .' to see heads, 'hg merge' to merge)
[web] $ hg update --clean --rev 78c8e64f3cef7a4a57ad789bf8e7efccf45e2a25
4 files updated, 0 files merged, 0 files removed, 0 files unresolved
[web] $ hg --config extensions.purge= clean --all
[web] $ hg log --rev . --template {node}
[web] $ hg log --rev . --template {rev}
[web] $ hg id --branch
Run condition [File exists] enabling prebuild for step [BuilderChain]
[File exists] check if file exists [tox.ini]
Run condition [File exists] enabling perform for step [BuilderChain]
[web] $ /bin/bash -xe /tmp/hudson8437928750746839499.sh
+ xargs -0 rm -rf
+ find . '(' -name 'pgdb*' -o -name 'tmpdb*' ')' -print0
[web] $ /bin/bash -xe /tmp/hudson6384956822945454400.sh
+ PATH=/usr/lib/postgresql/9.4/bin:/usr/local/bin:/usr/bin:/bin:/usr/local/games:/usr/games
+ tox --recreate
web create: /var/lib/jenkins/jobs/cubicweb-3.23/workspace/TOXENV/web/.tox/web
web installdeps: -r/var/lib/jenkins/jobs/cubicweb-3.23/workspace/TOXENV/web/cubicweb/web/test/requirements.txt
web develop-inst: /var/lib/jenkins/jobs/cubicweb-3.23/workspace/TOXENV/web
web installed: You are using pip version 7.1.2, however version 8.0.2 is available.,You should consider upgrading via the 'pip install --upgrade pip' command.,beautifulsoup4==4.3.2,boto==2.34.0,bzr-etckeeper==0.0.0,cffi==0.8.6,characteristic==0.1.0,chardet==2.3.0,Cheetah==2.4.4,cloud-init==0.7.6,colorama==0.3.2,configobj==5.0.6,coverage==3.7.1,croniter==0.3.4,cryptography==0.6.1,-e hg+http://hg.logilab.org/review/cubicweb@78c8e64f3cef7a4a57ad789bf8e7efccf45e2a25#egg=cubicweb-dev,cubicweb-blog==1.11.1,cubicweb-file==1.17.0,cubicweb-tag==1.8.2,cwclientlib==0.4.1,Cython==0.21.1,decorator==3.4.0,docutils==0.12,ecdsa==0.11,euca2ools==3.1.0,GDAL==1.10.1,hg-evolve==5.2.1,html2text==2016.1.8,html5lib==0.999,isodate==0.5.0,Jinja2==2.7.3,joblib==0.8.3,jsonpatch==1.3,jsonpointer==1.0,linecache2==1.0.0,logilab-common==1.1.0,logilab-constraint==0.6.0,logilab-database==1.15.0,logilab-mtconverter==0.9.0,lxml==3.4.0,M2Crypto==0.21.1,Mako==1.0.0,Markdown==2.5.1,MarkupSafe==0.23,matplotlib==1.4.2,mercurial==3.5.2,mock==1.0.1,msgpack-python==0.4.2,nose==1.3.4,numexpr==2.4,numpy==1.8.2,oauth==1.0.1,openpyxl==1.7.0,pandas==0.14.1,paramiko==1.15.1,passlib==1.6.5,pep8==1.5.7,Pillow==2.6.1,pluggy==0.3.1,ply==3.4,prettytable==0.7.2,psycopg2==2.5.4,py==1.4.31,pyasn1==0.1.7,pyasn1-modules==0.0.5,pycparser==2.10,pycrypto==2.6.1,Pygments==2.0.1,pyinotify==0.9.4,pyOpenSSL==0.14,pyparsing==2.0.3,pyserial==2.6,pysqlite==2.6.3,python-apt==0.9.3.12,python-augeas==0.4.1,python-dateutil==2.2,python-jenkins==0.2.1,python-ldap==2.4.10,python-yapps==2.1.1,pytz==2012rc0,PyYAML==3.11,pyzmq==14.4.0,rdflib==4.1.2,requestbuilder==0.2.3,requests==2.4.3,roman==2.0.0,rql==0.34.0,rubber==1.1,salt==2015.5.3,scikit-learn==0.14.1,scipy==0.14.0,service-identity==1.0.0,Shapely==1.4.3,simplejson==3.6.5,SimpleTAL==4.1,six==1.8.0,SPARQLWrapper==1.6.0,statsmodels==0.4.2,tables==3.1.1,tox==2.3.1,traceback2==1.4.0,Twisted==15.5.0,unittest2==1.1.0,urllib3==1.9.1,virtualenv==13.1.2,waitress==0.8.10,WebOb==1.5.1,WebTest==2.0.20,wheel==0.24.0,xlrd==0.9.2,xlwt==0.7.5,yams==0.42.0,Yapps==2.2.0,Yapps2==2.2.0,zope.interface==4.1.3
web runtests: PYTHONHASHSEED='3214918266'
web runtests: commands[0] | /var/lib/jenkins/jobs/cubicweb-3.23/workspace/TOXENV/web/.tox/web/bin/python -c from logilab.common import pytest; pytest.run() -t /var/lib/jenkins/jobs/cubicweb-3.23/workspace/TOXENV/web/cubicweb/web/test
===================== unittest_application.py ======================
2016-02-19 14:14:16 - (cubicweb.appobject) WARNING: can't find any workflow for CWUser
2016-02-19 14:14:34 - (cubicweb.web) WARNING: [3.17] massmailing extracted to cube massmailing that was not found. try installing it.
2016-02-19 14:14:34 - (cubicweb.web) WARNING: [3.17] igeocoding extracted to cube geocoding that was not found. try installing it.
2016-02-19 14:14:34 - (cubicweb.web) WARNING: [3.17] embedding extracted to cube embed that was not found. try installing it.
2016-02-19 14:14:34 - (cubicweb.web) WARNING: [3.17] isioc extracted to cube sioc that was not found. try installing it.
2016-02-19 14:14:35 - (cubicweb.web) ERROR: Exception('whatever',)
Traceback (most recent call last):
File "/var/lib/jenkins/jobs/cubicweb-3.23/workspace/TOXENV/web/cubicweb/web/application.py", line 369, in core_handle
result = controller.publish(rset=rset)
File "/var/lib/jenkins/jobs/cubicweb-3.23/workspace/TOXENV/web/cubicweb/web/views/basecontrollers.py", line 134, in publish
rset=rset, view=view)
File "/var/lib/jenkins/jobs/cubicweb-3.23/workspace/TOXENV/web/cubicweb/cwvreg.py", line 225, in main_template
res = obj.render(**kwargs)
File "/var/lib/jenkins/jobs/cubicweb-3.23/workspace/TOXENV/web/cubicweb/view.py", line 138, in render
view_func(**context)
File "/var/lib/jenkins/jobs/cubicweb-3.23/workspace/TOXENV/web/cubicweb/web/views/basetemplates.py", line 163, in call
view.render(w=w)
File "/var/lib/jenkins/jobs/cubicweb-3.23/workspace/TOXENV/web/cubicweb/view.py", line 138, in render
view_func(**context)
File "unittest_application.py", line 519, in call
raise Exception('whatever')
Exception: whatever
2016-02-19 14:14:35 - (py.warnings) WARNING: /var/lib/jenkins/jobs/cubicweb-3.23/workspace/TOXENV/web/cubicweb/devtools/__init__.py:111: RuntimeWarning: anon4c8bc432ccf945beb30dba9e2d019e00 Open session found while turning repository off
%sessionid, RuntimeWarning)

.2016-02-19 14:14:36 - (py.warnings) WARNING: /var/lib/jenkins/jobs/cubicweb-3.23/workspace/TOXENV/web/cubicweb/devtools/__init__.py:111: RuntimeWarning: anon7bb5151cb8ab4685be9ef0982ed1b316 Open session found while turning repository off
%sessionid, RuntimeWarning)

....2016-02-19 14:14:42 - (py.warnings) WARNING: /var/lib/jenkins/jobs/cubicweb-3.23/workspace/TOXENV/web/cubicweb/web/formfields.py:1201: Warning: [yams 0.38] no targettype specified and there are several relation definitions for rtype parent: ['Directory', 'Filesystem']. Yet you get the first rdef.
rdef = eschema.rdef(rschema, role)

.....E.................
======================================================================
ERROR: test_login_by_email (unittest_application.ApplicationTC)
----------------------------------------------------------------------
Traceback (most recent call last)
File "/var/lib/jenkins/jobs/cubicweb-3.23/workspace/TOXENV/web/.tox/web/local/lib/python2.7/site-packages/unittest2/case.py", line 67, in testPartExecutor
yield
File "/var/lib/jenkins/jobs/cubicweb-3.23/workspace/TOXENV/web/.tox/web/local/lib/python2.7/site-packages/unittest2/case.py", line 625, in run
testMethod()
File "/var/lib/jenkins/jobs/cubicweb-3.23/workspace/TOXENV/web/cubicweb/web/test/unittest_application.py", line 612, in test_login_by_email
self.assertAuthSuccess(req, origsession)
File "/var/lib/jenkins/jobs/cubicweb-3.23/workspace/TOXENV/web/cubicweb/devtools/testlib.py", line 867, in assertAuthSuccess
session = self.app.get_session(req)
File "/var/lib/jenkins/jobs/cubicweb-3.23/workspace/TOXENV/web/cubicweb/web/application.py", line 200, in get_session
return self.session_handler.get_session(req)
File "/var/lib/jenkins/jobs/cubicweb-3.23/workspace/TOXENV/web/cubicweb/web/application.py", line 126, in get_session
session = self.open_session(req)
File "/var/lib/jenkins/jobs/cubicweb-3.23/workspace/TOXENV/web/cubicweb/web/application.py", line 135, in open_session
session = self.session_manager.open_session(req)
File "/var/lib/jenkins/jobs/cubicweb-3.23/workspace/TOXENV/web/cubicweb/web/views/sessions.py", line 142, in open_session
session, login = self.authmanager.authenticate(req)
File "/var/lib/jenkins/jobs/cubicweb-3.23/workspace/TOXENV/web/cubicweb/web/views/authentication.py", line 170, in authenticate
raise AuthenticationError()
AuthenticationError

no stdout
no stderr
====================== unittest_formfields.py ======================
....2016-02-19 14:14:49 - (py.warnings) WARNING: /var/lib/jenkins/jobs/cubicweb-3.23/workspace/TOXENV/web/cubicweb/web/formfields.py:1201: Warning: [yams 0.38] no targettype specified and there are several relation definitions for rtype owned_by: ['Blog', 'Bookmark', 'CWRelation', 'SubWorkflowExitPoint', 'CWSourceHostConfig', 'CWConstraintType', 'Folder', 'CWGroup', 'WorkflowTransition', 'Workflow', 'CWUniqueTogetherConstraint', 'BaseTransition', 'Ticket', 'MicroBlog', 'Version', 'File', 'MicroBlogEntry', 'Transition', 'CWConstraint', 'CWProperty', 'EmailAddress', 'BlogEntry', 'CWAttribute', 'Filesystem', 'Tag', 'Project', 'DirectoryPermission', 'TreeNode', 'CWUser', 'TrInfo', 'UserAccount', 'Personne', 'CWCache', 'Societe', 'RQLExpression', 'CWRType', 'Salesterm', 'CWSourceSchemaConfig', 'CWComputedRType', 'CWEType', 'State', 'CWDataImport', 'ExternalUri', 'Directory', 'CWSource']. Yet you get the first rdef.
rdef = eschema.rdef(rschema, role)

......
===================== unittest_http_headers.py =====================
.
==================== unittest_propertysheet.py =====================
.
====================== unittest_views_csv.py =======================
..
======================== unittest_uicfg.py =========================
.........
===================== unittest_views_forms.py ======================
...
==================== unittest_views_pyviews.py =====================
..
================ unittest_views_basecontrollers.py =================
.................2016-02-19 14:15:10 - (py.warnings) WARNING: /var/lib/jenkins/jobs/cubicweb-3.23/workspace/TOXENV/web/cubicweb/web/formfields.py:1201: Warning: [yams 0.38] no targettype specified and there are several relation definitions for rtype to_entity: ['CWRelation', 'CWAttribute']. Yet you get the first rdef.
rdef = eschema.rdef(rschema, role)

.....2016-02-19 14:15:15 - (py.warnings) WARNING: /var/lib/jenkins/jobs/cubicweb-3.23/workspace/TOXENV/web/cubicweb/web/formfields.py:1201: Warning: [yams 0.38] no targettype specified and there are several relation definitions for rtype read_permission: ['CWGroup', 'RQLExpression']. Yet you get the first rdef.
rdef = eschema.rdef(rschema, role)

2016-02-19 14:15:15 - (cubicweb.session) WARNING: no schema for 7
2016-02-19 14:15:16 - (cubicweb.session) WARNING: no schema for 7
..2016-02-19 14:15:17 - (cubicweb.web) WARNING: param login-subject mis-formatted
.........................................2016-02-19 14:15:45 - (py.warnings) WARNING: /var/lib/jenkins/jobs/cubicweb-3.23/workspace/TOXENV/web/cubicweb/devtools/__init__.py:111: RuntimeWarning: anon10280780f72d401db494bb466fc4febb Open session found while turning repository off
%sessionid, RuntimeWarning)

.
===================== unittest_urlpublisher.py =====================
.............
===================== unittest_breadcrumbs.py ======================
.
========================== test_views.py ===========================
2016-02-19 14:16:01 - (py.warnings) WARNING: /var/lib/jenkins/jobs/cubicweb-3.23/workspace/TOXENV/web/cubicweb/devtools/__init__.py:111: RuntimeWarning: admin2046c1e1e08b47c39d7e1cc7e6e600f9 Open session found while turning repository off
%sessionid, RuntimeWarning)

2016-02-19 14:16:02 - (py.warnings) WARNING: /var/lib/jenkins/jobs/cubicweb-3.23/workspace/TOXENV/web/cubicweb/web/formfields.py:1201: Warning: [yams 0.38] no targettype specified and there are several relation definitions for rtype allowed_transition: ['BaseTransition', 'Transition', 'WorkflowTransition']. Yet you get the first rdef.
rdef = eschema.rdef(rschema, role)

2016-02-19 14:16:09 - (py.warnings) WARNING: /var/lib/jenkins/jobs/cubicweb-3.23/workspace/TOXENV/web/cubicweb/web/formfields.py:1201: Warning: [yams 0.38] no targettype specified and there are several relation definitions for rtype constrained_by: ['CWAttribute', 'CWRelation']. Yet you get the first rdef.
rdef = eschema.rdef(rschema, role)

..2016-02-19 14:17:00 - (cubicweb.appobject) ERROR: cycle in breadcrumbs for entity <Entity TreeNode 1350 ['cwuri', 'creation_date', u'modification_date', u'name'] at 140415026532880>
2016-02-19 14:17:00 - (cubicweb.appobject) ERROR: cycle in breadcrumbs for entity <Entity TreeNode 1350 ['cwuri', 'creation_date', u'modification_date', u'name'] at 140415026532880>
2016-02-19 14:17:00 - (cubicweb.appobject) ERROR: cycle in breadcrumbs for entity <Entity TreeNode 1350 ['cwuri', 'creation_date', u'modification_date', u'name'] at 140415026532880>
2016-02-19 14:17:00 - (cubicweb.appobject) ERROR: cycle in breadcrumbs for entity <Entity TreeNode 1350 ['cwuri', 'creation_date', u'modification_date', u'name'] at 140415026532880>
2016-02-19 14:17:00 - (cubicweb.appobject) ERROR: cycle in breadcrumbs for entity <Entity TreeNode 1350 ['cwuri', 'creation_date', u'modification_date', u'name'] at 140415026532880>
2016-02-19 14:17:00 - (cubicweb.appobject) ERROR: cycle in breadcrumbs for entity <Entity TreeNode 1350 ['cwuri', 'creation_date', u'modification_date', u'name'] at 140415026532880>
2016-02-19 14:17:01 - (cubicweb.appobject) ERROR: cycle in breadcrumbs for entity <Entity TreeNode 1350 ['cwuri', 'creation_date', u'modification_date', u'name'] at 140415026532880>
2016-02-19 14:17:01 - (cubicweb.appobject) ERROR: cycle in breadcrumbs for entity <Entity TreeNode 1350 ['cwuri', 'creation_date', u'modification_date', u'name'] at 140415026532880>
2016-02-19 14:17:01 - (cubicweb.appobject) ERROR: cycle in breadcrumbs for entity <Entity TreeNode 1350 ['cwuri', 'creation_date', u'modification_date', u'name'] at 140415026532880>
.....
===================== unittest_magicsearch.py ======================
..................
=================== unittest_views_baseviews.py ====================
.............
=================== unittest_views_editforms.py ====================
..................
=============== unittest_views_staticcontrollers.py ================
.2016-02-19 14:17:49 - (cubicweb.web) ERROR: concatenated data url error: u'dummy.js' file does not exist
.2016-02-19 14:17:49 - (cubicweb.web) ERROR: concatenated data url error: u'dummy.js' file does not exist
....
========================= unittest_http.py =========================
...........................
====================== unittest_controller.py ======================
..
=============== unittest_views_searchrestriction.py ================
........
================= unittest_views_basetemplates.py ==================
..
==================== unittest_views_treeview.py ====================
.
===================== unittest_viewselector.py =====================
.......................
=================== unittest_views_errorform.py ====================
....
====================== unittest_urlrewrite.py ======================
........
================= unittest_views_apacherewrite.py ==================
.
======================= unittest_reledit.py ========================
.S2016-02-19 14:18:16 - (cubicweb.rtags) WARNING: using explict subject type in <property object at 0x7fb4f0799c58>.tag_object_of() has no effect, use ("*", concerns, Project) instead of (Ticket, concerns, Project)
.
======================================================================
SKIPPED: test_default_forms (unittest_reledit.ClickAndEditFormTC)
Need to check if this test should still run post reledit/doreledit merge
===================== unittest_views_xmlrss.py =====================
.
==================== unittest_idownloadable.py =====================
2016-02-19 14:18:18 - (cubicweb.web) ERROR: IOError()
Traceback (most recent call last):
File "/var/lib/jenkins/jobs/cubicweb-3.23/workspace/TOXENV/web/cubicweb/web/application.py", line 369, in core_handle
result = controller.publish(rset=rset)
File "/var/lib/jenkins/jobs/cubicweb-3.23/workspace/TOXENV/web/cubicweb/web/views/basecontrollers.py", line 134, in publish
rset=rset, view=view)
File "/var/lib/jenkins/jobs/cubicweb-3.23/workspace/TOXENV/web/cubicweb/cwvreg.py", line 225, in main_template
res = obj.render(**kwargs)
File "/var/lib/jenkins/jobs/cubicweb-3.23/workspace/TOXENV/web/cubicweb/view.py", line 138, in render
view_func(**context)
File "/var/lib/jenkins/jobs/cubicweb-3.23/workspace/TOXENV/web/cubicweb/web/views/basetemplates.py", line 120, in call
view.render()
File "/var/lib/jenkins/jobs/cubicweb-3.23/workspace/TOXENV/web/cubicweb/view.py", line 138, in render
view_func(**context)
File "/var/lib/jenkins/jobs/cubicweb-3.23/workspace/TOXENV/web/cubicweb/web/views/idownloadable.py", line 94, in call
self.w(adapter.download_data())
File "unittest_idownloadable.py", line 56, in download_data
raise IOError()
IOError
......
====================== unittest_views_json.py ======================
...2016-02-19 14:18:25 - (py.warnings) WARNING: /var/lib/jenkins/jobs/cubicweb-3.23/workspace/TOXENV/web/cubicweb/devtools/__init__.py:111: RuntimeWarning: anone72fb55432364ddbb2d417a6d020b754 Open session found while turning repository off
%sessionid, RuntimeWarning)

.2016-02-19 14:18:25 - (cubicweb.web) WARNING: vid table can't be used with jsonp controller, falling back to jsonexport
2016-02-19 14:18:27 - (py.warnings) WARNING: /var/lib/jenkins/jobs/cubicweb-3.23/workspace/TOXENV/web/cubicweb/devtools/__init__.py:111: RuntimeWarning: anon5131207fcb9b4d5aaf6a96a7689211f1 Open session found while turning repository off
%sessionid, RuntimeWarning)

.....2016-02-19 14:18:28 - (cubicweb.web) WARNING: vid table can't be used with jsonp controller, falling back to jsonexport
.
===================== unittest_formwidgets.py ======================
...
======================= unittest_request.py ========================
....
==================== unittest_views_actions.py =====================
..
====================== unittest_webconfig.py =======================
...
======================== unittest_facet.py =========================
....................
=================== unittest_views_cwsources.py ====================
.
========================= unittest_form.py =========================
....2016-02-19 14:18:34 - (py.warnings) WARNING: /var/lib/jenkins/jobs/cubicweb-3.23/workspace/TOXENV/web/cubicweb/web/formfields.py:1201: Warning: [yams 0.38] no targettype specified and there are several relation definitions for rtype tags: ['BlogEntry', 'CWUser', 'Tag']. Yet you get the first rdef.
rdef = eschema.rdef(rschema, role)

...........
=================== unittest_views_navigation.py ===================
...........
========================= unittest_web.py ==========================
..2016-02-19 14:18:42 - (py.warnings) WARNING: /var/lib/jenkins/jobs/cubicweb-3.23/workspace/TOXENV/web/cubicweb/devtools/__init__.py:111: RuntimeWarning: anon63a58e33173b4905a65c3a57cdb7062a Open session found while turning repository off
%sessionid, RuntimeWarning)

.2016-02-19 14:18:44 - (py.warnings) WARNING: /var/lib/jenkins/jobs/cubicweb-3.23/workspace/TOXENV/web/cubicweb/devtools/__init__.py:111: RuntimeWarning: anond3487ccf7d8d4e5baf1b499cee87afe1 Open session found while turning repository off
%sessionid, RuntimeWarning)

.2016-02-19 14:18:48 - (py.warnings) WARNING: /var/lib/jenkins/jobs/cubicweb-3.23/workspace/TOXENV/web/cubicweb/devtools/__init__.py:111: RuntimeWarning: anon1dc92da599f546be95d3286658dc2a37 Open session found while turning repository off
%sessionid, RuntimeWarning)

2016-02-19 14:18:48 - (py.warnings) WARNING: /var/lib/jenkins/jobs/cubicweb-3.23/workspace/TOXENV/web/cubicweb/devtools/__init__.py:111: RuntimeWarning: anon09457c0f1179491fa5dc50865f0a4c86 Open session found while turning repository off
%sessionid, RuntimeWarning)

.2016-02-19 14:18:51 - (py.warnings) WARNING: /var/lib/jenkins/jobs/cubicweb-3.23/workspace/TOXENV/web/cubicweb/devtools/__init__.py:111: RuntimeWarning: admin88abc1ee22694b2e9e7bd066279331d8 Open session found while turning repository off
%sessionid, RuntimeWarning)

2016-02-19 14:18:51 - (py.warnings) WARNING: /var/lib/jenkins/jobs/cubicweb-3.23/workspace/TOXENV/web/cubicweb/devtools/__init__.py:111: RuntimeWarning: anone219edea21e44ed69a45f5cfc2187448 Open session found while turning repository off
%sessionid, RuntimeWarning)

.2016-02-19 14:18:53 - (py.warnings) WARNING: /var/lib/jenkins/jobs/cubicweb-3.23/workspace/TOXENV/web/cubicweb/devtools/__init__.py:111: RuntimeWarning: anon89422c31a28149aaab6ebeaa23f9a6d7 Open session found while turning repository off
%sessionid, RuntimeWarning)

.2016-02-19 14:18:56 - (py.warnings) WARNING: /var/lib/jenkins/jobs/cubicweb-3.23/workspace/TOXENV/web/cubicweb/devtools/__init__.py:111: RuntimeWarning: anonb4fa10fec8a84f56aa7da13978729b24 Open session found while turning repository off
%sessionid, RuntimeWarning)

.2016-02-19 14:18:58 - (py.warnings) WARNING: /var/lib/jenkins/jobs/cubicweb-3.23/workspace/TOXENV/web/cubicweb/devtools/__init__.py:111: RuntimeWarning: anond0fb45186b3a4dfeb530db8db88bf86f Open session found while turning repository off
%sessionid, RuntimeWarning)

.
========================= test_jscript.py ==========================
2016-02-19 14:19:11 - (py.warnings) WARNING: /var/lib/jenkins/jobs/cubicweb-3.23/workspace/TOXENV/web/cubicweb/devtools/__init__.py:111: RuntimeWarning: anon2ce983d5ef094eb0b6b576adc0954e42 Open session found while turning repository off
%sessionid, RuntimeWarning)

2016-02-19 14:19:11 - (py.warnings) WARNING: /var/lib/jenkins/jobs/cubicweb-3.23/workspace/TOXENV/web/cubicweb/devtools/__init__.py:111: RuntimeWarning: anonbe14a2e7e6cb44f8966849f123f6c704 Open session found while turning repository off
%sessionid, RuntimeWarning)

2016-02-19 14:19:11 - (py.warnings) WARNING: /var/lib/jenkins/jobs/cubicweb-3.23/workspace/TOXENV/web/cubicweb/devtools/__init__.py:111: RuntimeWarning: anon964732b9999643d09122d53ac634ad7a Open session found while turning repository off
%sessionid, RuntimeWarning)

.
-> creating tables
-> inserting default user and default groups.
-> storing the schema in the database
-> database for instance data initialized.
Building autopopulate for database tmpdb
*******************************************************************************
Ran 363 test cases in 297.75s (285.02s CPU), 1 errors, 1 skipped
38 modules OK (1 failed)
failures: /var/lib/jenkins/jobs/cubicweb-3.23/workspace/TOXENV/web/cubicweb/web/test/unittest_application [1/28]
ERROR: InvocationError: '/var/lib/jenkins/jobs/cubicweb-3.23/workspace/TOXENV/web/.tox/web/bin/python -c from logilab.common import pytest; pytest.run() -t /var/lib/jenkins/jobs/cubicweb-3.23/workspace/TOXENV/web/cubicweb/web/test'
___________________________________ summary ____________________________________
ERROR: web: commands failed
Build step 'Conditional steps (multiple)' marked build as failure
Sending e-mails to: dlaxalde@logilab.fr jcr@logilab.fr syt@logilab.fr david@logilab.fr
[PostBuildScript] - Execution post build scripts.
[web] $ /bin/bash -xe /tmp/hudson9188184745321331972.sh
+ /var/lib/jenkins/scripts/notify_forge_apycot.py cwo cubicweb 78c8e64f3cef http://jenkins.logilab.fr/job/cubicweb-3.23/TOXENV=web/17/ --status failure
<br/>

log from execution
download