consoleText

download

20 Started by upstream project "cubicweb-3.23" build number 18
originally caused by:
Started by an SCM change
Building in workspace /var/lib/jenkins/jobs/cubicweb-3.23/workspace/TOXENV/web
[web] $ hg showconfig paths.default
[web] $ hg pull
pulling from http://hg.logilab.org/review/cubicweb
real URL is https://hg.logilab.org/review/cubicweb
searching for changes
adding changesets
adding manifests
adding file changes
added 1 changesets with 2 changes to 2 files
updating bookmark cubicweb-3.23
(run 'hg update' to get a working copy)
[web] $ hg update --clean --rev df928a3a94e31435486f8d34a34a43f672cd5cbb
2 files updated, 0 files merged, 0 files removed, 0 files unresolved
[web] $ hg --config extensions.purge= clean --all
[web] $ hg log --rev . --template {node}
[web] $ hg log --rev . --template {rev}
[web] $ hg id --branch
Run condition [File exists] enabling prebuild for step [BuilderChain]
[File exists] check if file exists [tox.ini]
Run condition [File exists] enabling perform for step [BuilderChain]
[web] $ /bin/bash -xe /tmp/hudson1086115469284348225.sh
+ find . '(' -name 'pgdb*' -o -name 'tmpdb*' ')' -print0
+ xargs -0 rm -rf
[web] $ /bin/bash -xe /tmp/hudson1262207911099444722.sh
+ PATH=/usr/lib/postgresql/9.4/bin:/usr/local/bin:/usr/bin:/bin:/usr/local/games:/usr/games
+ tox --recreate
web create: /var/lib/jenkins/jobs/cubicweb-3.23/workspace/TOXENV/web/.tox/web
web installdeps: -r/var/lib/jenkins/jobs/cubicweb-3.23/workspace/TOXENV/web/cubicweb/web/test/requirements.txt
web develop-inst: /var/lib/jenkins/jobs/cubicweb-3.23/workspace/TOXENV/web
web installed: You are using pip version 7.1.2, however version 8.0.2 is available.,You should consider upgrading via the 'pip install --upgrade pip' command.,beautifulsoup4==4.3.2,boto==2.34.0,bzr-etckeeper==0.0.0,cffi==0.8.6,characteristic==0.1.0,chardet==2.3.0,Cheetah==2.4.4,cloud-init==0.7.6,colorama==0.3.2,configobj==5.0.6,coverage==3.7.1,croniter==0.3.4,cryptography==0.6.1,-e hg+http://hg.logilab.org/review/cubicweb@df928a3a94e31435486f8d34a34a43f672cd5cbb#egg=cubicweb-dev,cubicweb-blog==1.11.1,cubicweb-file==1.17.0,cubicweb-tag==1.8.2,cwclientlib==0.4.1,Cython==0.21.1,decorator==3.4.0,docutils==0.12,ecdsa==0.11,euca2ools==3.1.0,GDAL==1.10.1,hg-evolve==5.2.1,html2text==2016.1.8,html5lib==0.999,isodate==0.5.0,Jinja2==2.7.3,joblib==0.8.3,jsonpatch==1.3,jsonpointer==1.0,linecache2==1.0.0,logilab-common==1.1.0,logilab-constraint==0.6.0,logilab-database==1.15.0,logilab-mtconverter==0.9.0,lxml==3.4.0,M2Crypto==0.21.1,Mako==1.0.0,Markdown==2.5.1,MarkupSafe==0.23,matplotlib==1.4.2,mercurial==3.5.2,mock==1.0.1,msgpack-python==0.4.2,nose==1.3.4,numexpr==2.4,numpy==1.8.2,oauth==1.0.1,openpyxl==1.7.0,pandas==0.14.1,paramiko==1.15.1,passlib==1.6.5,pep8==1.5.7,Pillow==2.6.1,pluggy==0.3.1,ply==3.4,prettytable==0.7.2,psycopg2==2.5.4,py==1.4.31,pyasn1==0.1.7,pyasn1-modules==0.0.5,pycparser==2.10,pycrypto==2.6.1,Pygments==2.0.1,pyinotify==0.9.4,pyOpenSSL==0.14,pyparsing==2.0.3,pyserial==2.6,pysqlite==2.6.3,python-apt==0.9.3.12,python-augeas==0.4.1,python-dateutil==2.2,python-jenkins==0.2.1,python-ldap==2.4.10,python-yapps==2.1.1,pytz==2012rc0,PyYAML==3.11,pyzmq==14.4.0,rdflib==4.1.2,requestbuilder==0.2.3,requests==2.4.3,roman==2.0.0,rql==0.34.0,rubber==1.1,salt==2015.5.3,scikit-learn==0.14.1,scipy==0.14.0,service-identity==1.0.0,Shapely==1.4.3,simplejson==3.6.5,SimpleTAL==4.1,six==1.8.0,SPARQLWrapper==1.6.0,statsmodels==0.4.2,tables==3.1.1,tox==2.3.1,traceback2==1.4.0,Twisted==15.5.0,unittest2==1.1.0,urllib3==1.9.1,virtualenv==13.1.2,waitress==0.8.10,WebOb==1.5.1,WebTest==2.0.20,wheel==0.24.0,xlrd==0.9.2,xlwt==0.7.5,yams==0.42.0,Yapps==2.2.0,Yapps2==2.2.0,zope.interface==4.1.3
web runtests: PYTHONHASHSEED='3061970398'
web runtests: commands[0] | /var/lib/jenkins/jobs/cubicweb-3.23/workspace/TOXENV/web/.tox/web/bin/python -c from logilab.common import pytest; pytest.run() -t /var/lib/jenkins/jobs/cubicweb-3.23/workspace/TOXENV/web/cubicweb/web/test
===================== unittest_application.py ======================
2016-02-19 15:17:09 - (cubicweb.appobject) WARNING: can't find any workflow for CWUser
2016-02-19 15:17:27 - (cubicweb.web) WARNING: [3.17] massmailing extracted to cube massmailing that was not found. try installing it.
2016-02-19 15:17:27 - (cubicweb.web) WARNING: [3.17] igeocoding extracted to cube geocoding that was not found. try installing it.
2016-02-19 15:17:28 - (cubicweb.web) WARNING: [3.17] embedding extracted to cube embed that was not found. try installing it.
2016-02-19 15:17:28 - (cubicweb.web) WARNING: [3.17] isioc extracted to cube sioc that was not found. try installing it.
2016-02-19 15:17:29 - (cubicweb.web) ERROR: Exception('whatever',)
Traceback (most recent call last):
File "/var/lib/jenkins/jobs/cubicweb-3.23/workspace/TOXENV/web/cubicweb/web/application.py", line 369, in core_handle
result = controller.publish(rset=rset)
File "/var/lib/jenkins/jobs/cubicweb-3.23/workspace/TOXENV/web/cubicweb/web/views/basecontrollers.py", line 134, in publish
rset=rset, view=view)
File "/var/lib/jenkins/jobs/cubicweb-3.23/workspace/TOXENV/web/cubicweb/cwvreg.py", line 225, in main_template
res = obj.render(**kwargs)
File "/var/lib/jenkins/jobs/cubicweb-3.23/workspace/TOXENV/web/cubicweb/view.py", line 138, in render
view_func(**context)
File "/var/lib/jenkins/jobs/cubicweb-3.23/workspace/TOXENV/web/cubicweb/web/views/basetemplates.py", line 163, in call
view.render(w=w)
File "/var/lib/jenkins/jobs/cubicweb-3.23/workspace/TOXENV/web/cubicweb/view.py", line 138, in render
view_func(**context)
File "unittest_application.py", line 519, in call
raise Exception('whatever')
Exception: whatever
2016-02-19 15:17:29 - (py.warnings) WARNING: /var/lib/jenkins/jobs/cubicweb-3.23/workspace/TOXENV/web/cubicweb/devtools/__init__.py:111: RuntimeWarning: anon8e1c6d38b53c402999de35b63340372b Open session found while turning repository off
%sessionid, RuntimeWarning)

.2016-02-19 15:17:32 - (py.warnings) WARNING: /var/lib/jenkins/jobs/cubicweb-3.23/workspace/TOXENV/web/cubicweb/devtools/__init__.py:111: RuntimeWarning: anond473ffb69b334cc68043dbc950252c1d Open session found while turning repository off
%sessionid, RuntimeWarning)

....2016-02-19 15:17:37 - (py.warnings) WARNING: /var/lib/jenkins/jobs/cubicweb-3.23/workspace/TOXENV/web/cubicweb/web/formfields.py:1201: Warning: [yams 0.38] no targettype specified and there are several relation definitions for rtype parent: ['Filesystem', 'Directory']. Yet you get the first rdef.
rdef = eschema.rdef(rschema, role)

.....E.................
======================================================================
ERROR: test_login_by_email (unittest_application.ApplicationTC)
----------------------------------------------------------------------
Traceback (most recent call last)
File "/var/lib/jenkins/jobs/cubicweb-3.23/workspace/TOXENV/web/.tox/web/local/lib/python2.7/site-packages/unittest2/case.py", line 67, in testPartExecutor
yield
File "/var/lib/jenkins/jobs/cubicweb-3.23/workspace/TOXENV/web/.tox/web/local/lib/python2.7/site-packages/unittest2/case.py", line 625, in run
testMethod()
File "/var/lib/jenkins/jobs/cubicweb-3.23/workspace/TOXENV/web/cubicweb/web/test/unittest_application.py", line 612, in test_login_by_email
self.assertAuthSuccess(req, origsession)
File "/var/lib/jenkins/jobs/cubicweb-3.23/workspace/TOXENV/web/cubicweb/devtools/testlib.py", line 867, in assertAuthSuccess
session = self.app.get_session(req)
File "/var/lib/jenkins/jobs/cubicweb-3.23/workspace/TOXENV/web/cubicweb/web/application.py", line 200, in get_session
return self.session_handler.get_session(req)
File "/var/lib/jenkins/jobs/cubicweb-3.23/workspace/TOXENV/web/cubicweb/web/application.py", line 126, in get_session
session = self.open_session(req)
File "/var/lib/jenkins/jobs/cubicweb-3.23/workspace/TOXENV/web/cubicweb/web/application.py", line 135, in open_session
session = self.session_manager.open_session(req)
File "/var/lib/jenkins/jobs/cubicweb-3.23/workspace/TOXENV/web/cubicweb/web/views/sessions.py", line 142, in open_session
session, login = self.authmanager.authenticate(req)
File "/var/lib/jenkins/jobs/cubicweb-3.23/workspace/TOXENV/web/cubicweb/web/views/authentication.py", line 170, in authenticate
raise AuthenticationError()
AuthenticationError

no stdout
no stderr
======================== unittest_uicfg.py =========================
.........
==================== unittest_idownloadable.py =====================
2016-02-19 15:17:48 - (cubicweb.web) ERROR: IOError()
Traceback (most recent call last):
File "/var/lib/jenkins/jobs/cubicweb-3.23/workspace/TOXENV/web/cubicweb/web/application.py", line 369, in core_handle
result = controller.publish(rset=rset)
File "/var/lib/jenkins/jobs/cubicweb-3.23/workspace/TOXENV/web/cubicweb/web/views/basecontrollers.py", line 134, in publish
rset=rset, view=view)
File "/var/lib/jenkins/jobs/cubicweb-3.23/workspace/TOXENV/web/cubicweb/cwvreg.py", line 225, in main_template
res = obj.render(**kwargs)
File "/var/lib/jenkins/jobs/cubicweb-3.23/workspace/TOXENV/web/cubicweb/view.py", line 138, in render
view_func(**context)
File "/var/lib/jenkins/jobs/cubicweb-3.23/workspace/TOXENV/web/cubicweb/web/views/basetemplates.py", line 120, in call
view.render()
File "/var/lib/jenkins/jobs/cubicweb-3.23/workspace/TOXENV/web/cubicweb/view.py", line 138, in render
view_func(**context)
File "/var/lib/jenkins/jobs/cubicweb-3.23/workspace/TOXENV/web/cubicweb/web/views/idownloadable.py", line 94, in call
self.w(adapter.download_data())
File "unittest_idownloadable.py", line 56, in download_data
raise IOError()
IOError
......
====================== unittest_webconfig.py =======================
...
====================== unittest_views_json.py ======================
...2016-02-19 15:17:54 - (py.warnings) WARNING: /var/lib/jenkins/jobs/cubicweb-3.23/workspace/TOXENV/web/cubicweb/devtools/__init__.py:111: RuntimeWarning: anonb40509183d9045a4ae08202b955ba7ba Open session found while turning repository off
%sessionid, RuntimeWarning)

.2016-02-19 15:17:54 - (cubicweb.web) WARNING: vid table can't be used with jsonp controller, falling back to jsonexport
2016-02-19 15:17:55 - (py.warnings) WARNING: /var/lib/jenkins/jobs/cubicweb-3.23/workspace/TOXENV/web/cubicweb/devtools/__init__.py:111: RuntimeWarning: anon76dc78dd8b2847e19b0af2a62c45e6ae Open session found while turning repository off
%sessionid, RuntimeWarning)

.....2016-02-19 15:17:56 - (cubicweb.web) WARNING: vid table can't be used with jsonp controller, falling back to jsonexport
.
===================== unittest_viewselector.py =====================
.......................
====================== unittest_formfields.py ======================
....2016-02-19 15:18:04 - (py.warnings) WARNING: /var/lib/jenkins/jobs/cubicweb-3.23/workspace/TOXENV/web/cubicweb/web/formfields.py:1201: Warning: [yams 0.38] no targettype specified and there are several relation definitions for rtype owned_by: ['State', 'CWDataImport', 'Ticket', 'CWSourceHostConfig', 'Societe', 'CWCache', 'Folder', 'Version', 'TreeNode', 'Project', 'Blog', 'CWConstraintType', 'CWAttribute', 'CWUniqueTogetherConstraint', 'CWProperty', 'TrInfo', 'CWUser', 'Tag', 'CWSourceSchemaConfig', 'UserAccount', 'SubWorkflowExitPoint', 'MicroBlogEntry', 'BlogEntry', 'EmailAddress', 'CWRType', 'Transition', 'Bookmark', 'WorkflowTransition', 'BaseTransition', 'CWComputedRType', 'Filesystem', 'DirectoryPermission', 'File', 'RQLExpression', 'Salesterm', 'Directory', 'CWGroup', 'ExternalUri', 'CWEType', 'MicroBlog', 'Personne', 'CWConstraint', 'CWRelation', 'CWSource', 'Workflow']. Yet you get the first rdef.
rdef = eschema.rdef(rschema, role)

......
===================== unittest_breadcrumbs.py ======================
.
=================== unittest_views_navigation.py ===================
...........
===================== unittest_http_headers.py =====================
.
========================= unittest_web.py ==========================
..2016-02-19 15:18:10 - (py.warnings) WARNING: /var/lib/jenkins/jobs/cubicweb-3.23/workspace/TOXENV/web/cubicweb/devtools/__init__.py:111: RuntimeWarning: anon7730b69e441b4795853c256655f0284c Open session found while turning repository off
%sessionid, RuntimeWarning)

.2016-02-19 15:18:12 - (py.warnings) WARNING: /var/lib/jenkins/jobs/cubicweb-3.23/workspace/TOXENV/web/cubicweb/devtools/__init__.py:111: RuntimeWarning: anon7ca04231451644ba987c095aa2058290 Open session found while turning repository off
%sessionid, RuntimeWarning)

.2016-02-19 15:18:16 - (py.warnings) WARNING: /var/lib/jenkins/jobs/cubicweb-3.23/workspace/TOXENV/web/cubicweb/devtools/__init__.py:111: RuntimeWarning: anon4d42bd1c5bed418ca274f1d980d1f9b1 Open session found while turning repository off
%sessionid, RuntimeWarning)

2016-02-19 15:18:16 - (py.warnings) WARNING: /var/lib/jenkins/jobs/cubicweb-3.23/workspace/TOXENV/web/cubicweb/devtools/__init__.py:111: RuntimeWarning: anon2f5c5938f7174b2a93b57d5e50aa75df Open session found while turning repository off
%sessionid, RuntimeWarning)

.2016-02-19 15:18:21 - (py.warnings) WARNING: /var/lib/jenkins/jobs/cubicweb-3.23/workspace/TOXENV/web/cubicweb/devtools/__init__.py:111: RuntimeWarning: adminf93908db18454f8580c159c88020bafe Open session found while turning repository off
%sessionid, RuntimeWarning)

2016-02-19 15:18:21 - (py.warnings) WARNING: /var/lib/jenkins/jobs/cubicweb-3.23/workspace/TOXENV/web/cubicweb/devtools/__init__.py:111: RuntimeWarning: anonb00d69a12b6b4e0f8ce0ca0de6a126bc Open session found while turning repository off
%sessionid, RuntimeWarning)

.2016-02-19 15:18:23 - (py.warnings) WARNING: /var/lib/jenkins/jobs/cubicweb-3.23/workspace/TOXENV/web/cubicweb/devtools/__init__.py:111: RuntimeWarning: anon426e991afcc5408c963270e0aa711494 Open session found while turning repository off
%sessionid, RuntimeWarning)

.2016-02-19 15:18:25 - (py.warnings) WARNING: /var/lib/jenkins/jobs/cubicweb-3.23/workspace/TOXENV/web/cubicweb/devtools/__init__.py:111: RuntimeWarning: anonab961ee50c0f4d23af4a2b2f9d1a45a2 Open session found while turning repository off
%sessionid, RuntimeWarning)

.2016-02-19 15:18:26 - (py.warnings) WARNING: /var/lib/jenkins/jobs/cubicweb-3.23/workspace/TOXENV/web/cubicweb/devtools/__init__.py:111: RuntimeWarning: anonf3f7ca5b08da4e6ebd3c2f5acb13871b Open session found while turning repository off
%sessionid, RuntimeWarning)

.
===================== unittest_formwidgets.py ======================
...
=================== unittest_views_editforms.py ====================
..................
==================== unittest_views_actions.py =====================
..
========================= unittest_form.py =========================
....2016-02-19 15:18:32 - (py.warnings) WARNING: /var/lib/jenkins/jobs/cubicweb-3.23/workspace/TOXENV/web/cubicweb/web/formfields.py:1201: Warning: [yams 0.38] no targettype specified and there are several relation definitions for rtype tags: ['BlogEntry', 'CWUser', 'Tag']. Yet you get the first rdef.
rdef = eschema.rdef(rschema, role)

...........
====================== unittest_controller.py ======================
..
===================== unittest_views_forms.py ======================
...
=============== unittest_views_searchrestriction.py ================
........
================= unittest_views_apacherewrite.py ==================
.
========================= test_jscript.py ==========================
2016-02-19 15:18:50 - (py.warnings) WARNING: /var/lib/jenkins/jobs/cubicweb-3.23/workspace/TOXENV/web/cubicweb/devtools/__init__.py:111: RuntimeWarning: anonc89847f3b7724b57bc38f7c503c74e9f Open session found while turning repository off
%sessionid, RuntimeWarning)

2016-02-19 15:18:50 - (py.warnings) WARNING: /var/lib/jenkins/jobs/cubicweb-3.23/workspace/TOXENV/web/cubicweb/devtools/__init__.py:111: RuntimeWarning: anona0983eec48b74087aa75f10b8bde915b Open session found while turning repository off
%sessionid, RuntimeWarning)

2016-02-19 15:18:50 - (py.warnings) WARNING: /var/lib/jenkins/jobs/cubicweb-3.23/workspace/TOXENV/web/cubicweb/devtools/__init__.py:111: RuntimeWarning: anon7e29faf127ee46f39f5271dd95efeed3 Open session found while turning repository off
%sessionid, RuntimeWarning)

.
===================== unittest_views_xmlrss.py =====================
.
=================== unittest_views_baseviews.py ====================
.............
==================== unittest_views_treeview.py ====================
.
=============== unittest_views_staticcontrollers.py ================
.2016-02-19 15:18:55 - (cubicweb.web) ERROR: concatenated data url error: u'dummy.js' file does not exist
.2016-02-19 15:18:55 - (cubicweb.web) ERROR: concatenated data url error: u'dummy.js' file does not exist
....
====================== unittest_urlrewrite.py ======================
........
===================== unittest_magicsearch.py ======================
..................
========================= unittest_http.py =========================
...........................
====================== unittest_views_csv.py =======================
..
=================== unittest_views_cwsources.py ====================
.
==================== unittest_views_pyviews.py =====================
..
======================= unittest_reledit.py ========================
.S2016-02-19 15:19:12 - (cubicweb.rtags) WARNING: using explict subject type in <property object at 0x7ff7c17eb5d0>.tag_object_of() has no effect, use ("*", concerns, Project) instead of (Ticket, concerns, Project)
.
======================================================================
SKIPPED: test_default_forms (unittest_reledit.ClickAndEditFormTC)
Need to check if this test should still run post reledit/doreledit merge
=================== unittest_views_errorform.py ====================
....
==================== unittest_propertysheet.py =====================
.
===================== unittest_urlpublisher.py =====================
.............
================ unittest_views_basecontrollers.py =================
.................2016-02-19 15:19:40 - (py.warnings) WARNING: /var/lib/jenkins/jobs/cubicweb-3.23/workspace/TOXENV/web/cubicweb/web/formfields.py:1201: Warning: [yams 0.38] no targettype specified and there are several relation definitions for rtype to_entity: ['CWAttribute', 'CWRelation']. Yet you get the first rdef.
rdef = eschema.rdef(rschema, role)

.....2016-02-19 15:19:44 - (py.warnings) WARNING: /var/lib/jenkins/jobs/cubicweb-3.23/workspace/TOXENV/web/cubicweb/web/formfields.py:1201: Warning: [yams 0.38] no targettype specified and there are several relation definitions for rtype read_permission: ['RQLExpression', 'CWGroup']. Yet you get the first rdef.
rdef = eschema.rdef(rschema, role)

2016-02-19 15:19:44 - (cubicweb.session) WARNING: no schema for 7
2016-02-19 15:19:45 - (cubicweb.session) WARNING: no schema for 7
..2016-02-19 15:19:46 - (cubicweb.web) WARNING: param login-subject mis-formatted
.........................................2016-02-19 15:20:13 - (py.warnings) WARNING: /var/lib/jenkins/jobs/cubicweb-3.23/workspace/TOXENV/web/cubicweb/devtools/__init__.py:111: RuntimeWarning: anon1345ab5e6b0e41a0bb229fd2728bbd33 Open session found while turning repository off
%sessionid, RuntimeWarning)

.
======================== unittest_facet.py =========================
....................
========================== test_views.py ===========================
2016-02-19 15:20:17 - (py.warnings) WARNING: /var/lib/jenkins/jobs/cubicweb-3.23/workspace/TOXENV/web/cubicweb/devtools/__init__.py:111: RuntimeWarning: adminaad4694baa62450eb7c7c25b71bb12fd Open session found while turning repository off
%sessionid, RuntimeWarning)

2016-02-19 15:20:18 - (py.warnings) WARNING: /var/lib/jenkins/jobs/cubicweb-3.23/workspace/TOXENV/web/cubicweb/web/formfields.py:1201: Warning: [yams 0.38] no targettype specified and there are several relation definitions for rtype allowed_transition: ['BaseTransition', 'Transition', 'WorkflowTransition']. Yet you get the first rdef.
rdef = eschema.rdef(rschema, role)

2016-02-19 15:20:52 - (py.warnings) WARNING: /var/lib/jenkins/jobs/cubicweb-3.23/workspace/TOXENV/web/cubicweb/web/formfields.py:1201: Warning: [yams 0.38] no targettype specified and there are several relation definitions for rtype constrained_by: ['CWRelation', 'CWAttribute']. Yet you get the first rdef.
rdef = eschema.rdef(rschema, role)

..2016-02-19 15:21:08 - (cubicweb.appobject) ERROR: cycle in breadcrumbs for entity <Entity TreeNode 1418 ['cwuri', 'creation_date', 'modification_date', 'name'] at 140701588761936>
2016-02-19 15:21:08 - (cubicweb.appobject) ERROR: cycle in breadcrumbs for entity <Entity TreeNode 1418 ['cwuri', 'creation_date', 'modification_date', 'name'] at 140701588761936>
2016-02-19 15:21:08 - (cubicweb.appobject) ERROR: cycle in breadcrumbs for entity <Entity TreeNode 1418 ['cwuri', 'creation_date', 'modification_date', 'name'] at 140701588761936>
2016-02-19 15:21:08 - (cubicweb.appobject) ERROR: cycle in breadcrumbs for entity <Entity TreeNode 1418 ['cwuri', 'creation_date', 'modification_date', 'name'] at 140701588761936>
2016-02-19 15:21:08 - (cubicweb.appobject) ERROR: cycle in breadcrumbs for entity <Entity TreeNode 1418 ['cwuri', 'creation_date', 'modification_date', 'name'] at 140701588761936>
2016-02-19 15:21:08 - (cubicweb.appobject) ERROR: cycle in breadcrumbs for entity <Entity TreeNode 1418 ['cwuri', 'creation_date', 'modification_date', 'name'] at 140701588761936>
2016-02-19 15:21:08 - (cubicweb.appobject) ERROR: cycle in breadcrumbs for entity <Entity TreeNode 1418 ['cwuri', 'creation_date', 'modification_date', 'name'] at 140701588761936>
2016-02-19 15:21:08 - (cubicweb.appobject) ERROR: cycle in breadcrumbs for entity <Entity TreeNode 1418 ['cwuri', 'creation_date', 'modification_date', 'name'] at 140701588761936>
2016-02-19 15:21:08 - (cubicweb.appobject) ERROR: cycle in breadcrumbs for entity <Entity TreeNode 1418 ['cwuri', 'creation_date', 'modification_date', 'name'] at 140701588761936>
2016-02-19 15:21:36 - (cubicweb.appobject) ERROR: cycle in breadcrumbs for entity <Entity Folder 1303 ['cwuri', 'creation_date', 'modification_date', 'name'] at 140701507573456>
2016-02-19 15:21:36 - (cubicweb.appobject) ERROR: cycle in breadcrumbs for entity <Entity Folder 1303 ['cwuri', 'creation_date', 'modification_date', 'name'] at 140701507573456>
2016-02-19 15:21:36 - (cubicweb.appobject) ERROR: cycle in breadcrumbs for entity <Entity Folder 1303 ['cwuri', 'creation_date', 'modification_date', 'name'] at 140701507573456>
2016-02-19 15:21:36 - (cubicweb.appobject) ERROR: cycle in breadcrumbs for entity <Entity Folder 1303 ['cwuri', 'creation_date', 'modification_date', 'name'] at 140701507573456>
2016-02-19 15:21:36 - (cubicweb.appobject) ERROR: cycle in breadcrumbs for entity <Entity Folder 1303 ['cwuri', 'creation_date', 'modification_date', 'name'] at 140701507573456>
2016-02-19 15:21:36 - (cubicweb.appobject) ERROR: cycle in breadcrumbs for entity <Entity Folder 1303 ['cwuri', 'creation_date', 'modification_date', 'name'] at 140701507573456>
2016-02-19 15:21:36 - (cubicweb.appobject) ERROR: cycle in breadcrumbs for entity <Entity Folder 1303 ['cwuri', 'creation_date', 'modification_date', 'name'] at 140701507573456>
2016-02-19 15:21:36 - (cubicweb.appobject) ERROR: cycle in breadcrumbs for entity <Entity Folder 1303 ['cwuri', 'creation_date', 'modification_date', 'name'] at 140701507573456>
.....
======================= unittest_request.py ========================
....
================= unittest_views_basetemplates.py ==================
..
-> creating tables
-> inserting default user and default groups.
-> storing the schema in the database
-> database for instance data initialized.
Building autopopulate for database tmpdb
*******************************************************************************
Ran 363 test cases in 284.31s (272.66s CPU), 1 errors, 1 skipped
38 modules OK (1 failed)
failures: /var/lib/jenkins/jobs/cubicweb-3.23/workspace/TOXENV/web/cubicweb/web/test/unittest_application [1/28]
ERROR: InvocationError: '/var/lib/jenkins/jobs/cubicweb-3.23/workspace/TOXENV/web/.tox/web/bin/python -c from logilab.common import pytest; pytest.run() -t /var/lib/jenkins/jobs/cubicweb-3.23/workspace/TOXENV/web/cubicweb/web/test'
___________________________________ summary ____________________________________
ERROR: web: commands failed
Build step 'Conditional steps (multiple)' marked build as failure
Sending e-mails to: dlaxalde@logilab.fr jcr@logilab.fr syt@logilab.fr david@logilab.fr
[PostBuildScript] - Execution post build scripts.
[web] $ /bin/bash -xe /tmp/hudson6695400724767486544.sh
+ /var/lib/jenkins/scripts/notify_forge_apycot.py cwo cubicweb df928a3a94e3 http://jenkins.logilab.fr/job/cubicweb-3.23/TOXENV=web/18/ --status failure
<br/>

log from execution
download