consoleText

download

20 Started by upstream project "cubicweb-3.23" build number 27
originally caused by:
Started by user anonymous
Building in workspace /var/lib/jenkins/jobs/cubicweb-3.23/workspace/TOXENV/py34-devtools
[py34-devtools] $ hg showconfig paths.default
[py34-devtools] $ hg pull
pulling from http://hg.logilab.org/review/cubicweb
searching for changes
no changes found
[py34-devtools] $ hg update --clean --rev fccc6ddd975c4f05387f291d3ad8e69d2b66f607
0 files updated, 0 files merged, 0 files removed, 0 files unresolved
[py34-devtools] $ hg --config extensions.purge= clean --all
[py34-devtools] $ hg log --rev . --template {node}
[py34-devtools] $ hg log --rev . --template {rev}
[py34-devtools] $ hg id --branch
[py34-devtools] $ /bin/bash -xe /tmp/hudson3249110398841693719.sh
+ find . '(' -name 'pgdb*' -o -name 'tmpdb*' ')' -print0
+ xargs -0 rm -rf
[py34-devtools] $ /bin/bash -xe /tmp/hudson7236338316297809022.sh
+ PATH=/usr/lib/postgresql/9.4/bin:/usr/local/bin:/usr/bin:/bin:/usr/local/games:/usr/games
+ tox --recreate
py34-devtools create: /var/lib/jenkins/jobs/cubicweb-3.23/workspace/TOXENV/py34-devtools/.tox/py34-devtools
py34-devtools installdeps: -r/var/lib/jenkins/jobs/cubicweb-3.23/workspace/TOXENV/py34-devtools/cubicweb/devtools/test/requirements.txt
py34-devtools develop-inst: /var/lib/jenkins/jobs/cubicweb-3.23/workspace/TOXENV/py34-devtools
py34-devtools installed: You are using pip version 7.1.2, however version 8.0.2 is available.,You should consider upgrading via the 'pip install --upgrade pip' command.,beautifulsoup4==4.4.1,chardet==2.3.0,colorama==0.3.2,-e hg+http://hg.logilab.org/review/cubicweb@fccc6ddd975c4f05387f291d3ad8e69d2b66f607#egg=cubicweb-dev,cwclientlib==0.4.1,html2text==2016.1.8,html5lib==0.999,linecache2==1.0.0,logilab-common==1.1.0,logilab-constraint==0.6.0,logilab-database==1.15.0,logilab-mtconverter==0.9.0,lxml==3.5.0,Markdown==2.6.5,passlib==1.6.5,psycopg2==2.5.4,py==1.4.25,python-apt==0.9.3.12,python-dateutil==2.4.2,pytz==2015.7,requests==2.4.3,rql==0.34.0,six==1.8.0,tox==1.9.2,traceback2==1.4.0,Twisted==15.5.0,unattended-upgrades==0.1,unittest2==1.1.0,urllib3==1.9.1,virtualenv==1.11.6,waitress==0.8.10,WebOb==1.5.1,WebTest==2.0.20,wheel==0.24.0,yams==0.42.0,Yapps==2.2.0,Yapps2==2.2.0,zope.interface==4.1.3
py34-devtools runtests: PYTHONHASHSEED='3513995457'
py34-devtools runtests: commands[0] | /var/lib/jenkins/jobs/cubicweb-3.23/workspace/TOXENV/py34-devtools/.tox/py34-devtools/bin/python -c from logilab.common import pytest; pytest.run() -t /var/lib/jenkins/jobs/cubicweb-3.23/workspace/TOXENV/py34-devtools/cubicweb/devtools/test
======================== unittest_qunit.py =========================
2016-02-23 16:23:25 - (cubicweb.appobject) WARNING: can't find any workflow for CWUser
2016-02-23 16:23:34 - (cubicweb.web) WARNING: [3.17] massmailing extracted to cube massmailing that was not found. try installing it.
2016-02-23 16:23:34 - (cubicweb.web) WARNING: [3.17] igeocoding extracted to cube geocoding that was not found. try installing it.
2016-02-23 16:23:34 - (cubicweb.web) WARNING: [3.17] embedding extracted to cube embed that was not found. try installing it.
2016-02-23 16:23:34 - (cubicweb.web) WARNING: [3.17] isioc extracted to cube sioc that was not found. try installing it.
E/var/lib/jenkins/jobs/cubicweb-3.23/workspace/TOXENV/py34-devtools/cubicweb/devtools/__init__.py:111: RuntimeWarning: anon8c3180a2e3d346c69f2916826bf782b8 Open session found while turning repository off
%sessionid, RuntimeWarning)
/var/lib/jenkins/jobs/cubicweb-3.23/workspace/TOXENV/py34-devtools/cubicweb/devtools/__init__.py:111: RuntimeWarning: anonf33834163a4743588e3a90905fcb2007 Open session found while turning repository off
%sessionid, RuntimeWarning)
.
======================================================================
ERROR: test_javascripts (unittest_qunit.QUnitTestCaseTC)
air // test 1 (/static/js_examples/test_simple_success.js)
----------------------------------------------------------------------
Traceback (most recent call last)
File "/var/lib/jenkins/jobs/cubicweb-3.23/workspace/TOXENV/py34-devtools/.tox/py34-devtools/lib/python3.4/site-packages/logilab/common/testlib.py", line 463, in _proceed
testfunc(*args, **kwargs)
File "/var/lib/jenkins/jobs/cubicweb-3.23/workspace/TOXENV/py34-devtools/cubicweb/devtools/qunit.py", line 113, in test_javascripts
with self.subTest(name=name):
File "/usr/lib/python3.4/contextlib.py", line 59, in __enter__
return next(self.gen)
File "/usr/lib/python3.4/unittest/case.py", line 487, in subTest
if not self._outcome.result_supports_subtests:
AttributeError: 'NoneType' object has no attribute 'result_supports_subtests'

no stdout
no stderr
======================= unittest_httptest.py =======================
Unhandled Error
Traceback (most recent call last):
File "/var/lib/jenkins/jobs/cubicweb-3.23/workspace/TOXENV/py34-devtools/.tox/py34-devtools/lib/python3.4/site-packages/twisted/python/log.py", line 101, in callWithLogger
return callWithContext({"system": lp}, func, *args, **kw)
File "/var/lib/jenkins/jobs/cubicweb-3.23/workspace/TOXENV/py34-devtools/.tox/py34-devtools/lib/python3.4/site-packages/twisted/python/log.py", line 84, in callWithContext
return context.call({ILogContext: newCtx}, func, *args, **kw)
File "/var/lib/jenkins/jobs/cubicweb-3.23/workspace/TOXENV/py34-devtools/.tox/py34-devtools/lib/python3.4/site-packages/twisted/python/context.py", line 118, in callWithContext
return self.currentContext().callWithContext(ctx, func, *args, **kw)
File "/var/lib/jenkins/jobs/cubicweb-3.23/workspace/TOXENV/py34-devtools/.tox/py34-devtools/lib/python3.4/site-packages/twisted/python/context.py", line 81, in callWithContext
return func(*args,**kw)
--- <exception caught here> ---
File "/var/lib/jenkins/jobs/cubicweb-3.23/workspace/TOXENV/py34-devtools/.tox/py34-devtools/lib/python3.4/site-packages/twisted/internet/posixbase.py", line 597, in _doReadOrWrite
why = selectable.doRead()
File "/var/lib/jenkins/jobs/cubicweb-3.23/workspace/TOXENV/py34-devtools/.tox/py34-devtools/lib/python3.4/site-packages/twisted/internet/tcp.py", line 209, in doRead
return self._dataReceived(data)
File "/var/lib/jenkins/jobs/cubicweb-3.23/workspace/TOXENV/py34-devtools/.tox/py34-devtools/lib/python3.4/site-packages/twisted/internet/tcp.py", line 215, in _dataReceived
rval = self.protocol.dataReceived(data)
File "/var/lib/jenkins/jobs/cubicweb-3.23/workspace/TOXENV/py34-devtools/.tox/py34-devtools/lib/python3.4/site-packages/twisted/protocols/basic.py", line 571, in dataReceived
why = self.lineReceived(line)
File "/var/lib/jenkins/jobs/cubicweb-3.23/workspace/TOXENV/py34-devtools/.tox/py34-devtools/lib/python3.4/site-packages/twisted/web/http.py", line 1720, in lineReceived
self.allContentReceived()
File "/var/lib/jenkins/jobs/cubicweb-3.23/workspace/TOXENV/py34-devtools/.tox/py34-devtools/lib/python3.4/site-packages/twisted/web/http.py", line 1799, in allContentReceived
req.requestReceived(command, path, version)
File "/var/lib/jenkins/jobs/cubicweb-3.23/workspace/TOXENV/py34-devtools/cubicweb/etwist/server.py", line 206, in requestReceived
x = self.uri.split('?', 1)
builtins.TypeError: Type str doesn't support the buffer API

EUnhandled Error
Traceback (most recent call last):
File "/var/lib/jenkins/jobs/cubicweb-3.23/workspace/TOXENV/py34-devtools/.tox/py34-devtools/lib/python3.4/site-packages/twisted/python/log.py", line 101, in callWithLogger
return callWithContext({"system": lp}, func, *args, **kw)
File "/var/lib/jenkins/jobs/cubicweb-3.23/workspace/TOXENV/py34-devtools/.tox/py34-devtools/lib/python3.4/site-packages/twisted/python/log.py", line 84, in callWithContext
return context.call({ILogContext: newCtx}, func, *args, **kw)
File "/var/lib/jenkins/jobs/cubicweb-3.23/workspace/TOXENV/py34-devtools/.tox/py34-devtools/lib/python3.4/site-packages/twisted/python/context.py", line 118, in callWithContext
return self.currentContext().callWithContext(ctx, func, *args, **kw)
File "/var/lib/jenkins/jobs/cubicweb-3.23/workspace/TOXENV/py34-devtools/.tox/py34-devtools/lib/python3.4/site-packages/twisted/python/context.py", line 81, in callWithContext
return func(*args,**kw)
--- <exception caught here> ---
File "/var/lib/jenkins/jobs/cubicweb-3.23/workspace/TOXENV/py34-devtools/.tox/py34-devtools/lib/python3.4/site-packages/twisted/internet/posixbase.py", line 597, in _doReadOrWrite
why = selectable.doRead()
File "/var/lib/jenkins/jobs/cubicweb-3.23/workspace/TOXENV/py34-devtools/.tox/py34-devtools/lib/python3.4/site-packages/twisted/internet/tcp.py", line 209, in doRead
return self._dataReceived(data)
File "/var/lib/jenkins/jobs/cubicweb-3.23/workspace/TOXENV/py34-devtools/.tox/py34-devtools/lib/python3.4/site-packages/twisted/internet/tcp.py", line 215, in _dataReceived
rval = self.protocol.dataReceived(data)
File "/var/lib/jenkins/jobs/cubicweb-3.23/workspace/TOXENV/py34-devtools/.tox/py34-devtools/lib/python3.4/site-packages/twisted/protocols/basic.py", line 571, in dataReceived
why = self.lineReceived(line)
File "/var/lib/jenkins/jobs/cubicweb-3.23/workspace/TOXENV/py34-devtools/.tox/py34-devtools/lib/python3.4/site-packages/twisted/web/http.py", line 1720, in lineReceived
self.allContentReceived()
File "/var/lib/jenkins/jobs/cubicweb-3.23/workspace/TOXENV/py34-devtools/.tox/py34-devtools/lib/python3.4/site-packages/twisted/web/http.py", line 1799, in allContentReceived
req.requestReceived(command, path, version)
File "/var/lib/jenkins/jobs/cubicweb-3.23/workspace/TOXENV/py34-devtools/cubicweb/etwist/server.py", line 206, in requestReceived
x = self.uri.split('?', 1)
builtins.TypeError: Type str doesn't support the buffer API

EUnhandled Error
Traceback (most recent call last):
File "/var/lib/jenkins/jobs/cubicweb-3.23/workspace/TOXENV/py34-devtools/.tox/py34-devtools/lib/python3.4/site-packages/twisted/python/log.py", line 101, in callWithLogger
return callWithContext({"system": lp}, func, *args, **kw)
File "/var/lib/jenkins/jobs/cubicweb-3.23/workspace/TOXENV/py34-devtools/.tox/py34-devtools/lib/python3.4/site-packages/twisted/python/log.py", line 84, in callWithContext
return context.call({ILogContext: newCtx}, func, *args, **kw)
File "/var/lib/jenkins/jobs/cubicweb-3.23/workspace/TOXENV/py34-devtools/.tox/py34-devtools/lib/python3.4/site-packages/twisted/python/context.py", line 118, in callWithContext
return self.currentContext().callWithContext(ctx, func, *args, **kw)
File "/var/lib/jenkins/jobs/cubicweb-3.23/workspace/TOXENV/py34-devtools/.tox/py34-devtools/lib/python3.4/site-packages/twisted/python/context.py", line 81, in callWithContext
return func(*args,**kw)
--- <exception caught here> ---
File "/var/lib/jenkins/jobs/cubicweb-3.23/workspace/TOXENV/py34-devtools/.tox/py34-devtools/lib/python3.4/site-packages/twisted/internet/posixbase.py", line 597, in _doReadOrWrite
why = selectable.doRead()
File "/var/lib/jenkins/jobs/cubicweb-3.23/workspace/TOXENV/py34-devtools/.tox/py34-devtools/lib/python3.4/site-packages/twisted/internet/tcp.py", line 209, in doRead
return self._dataReceived(data)
File "/var/lib/jenkins/jobs/cubicweb-3.23/workspace/TOXENV/py34-devtools/.tox/py34-devtools/lib/python3.4/site-packages/twisted/internet/tcp.py", line 215, in _dataReceived
rval = self.protocol.dataReceived(data)
File "/var/lib/jenkins/jobs/cubicweb-3.23/workspace/TOXENV/py34-devtools/.tox/py34-devtools/lib/python3.4/site-packages/twisted/protocols/basic.py", line 571, in dataReceived
why = self.lineReceived(line)
File "/var/lib/jenkins/jobs/cubicweb-3.23/workspace/TOXENV/py34-devtools/.tox/py34-devtools/lib/python3.4/site-packages/twisted/web/http.py", line 1720, in lineReceived
self.allContentReceived()
File "/var/lib/jenkins/jobs/cubicweb-3.23/workspace/TOXENV/py34-devtools/.tox/py34-devtools/lib/python3.4/site-packages/twisted/web/http.py", line 1799, in allContentReceived
req.requestReceived(command, path, version)
File "/var/lib/jenkins/jobs/cubicweb-3.23/workspace/TOXENV/py34-devtools/cubicweb/etwist/server.py", line 206, in requestReceived
x = self.uri.split('?', 1)
builtins.TypeError: Type str doesn't support the buffer API

E/var/lib/jenkins/jobs/cubicweb-3.23/workspace/TOXENV/py34-devtools/cubicweb/devtools/__init__.py:111: RuntimeWarning: admined28ed81130948dba36d88ffa616496d Open session found while turning repository off
%sessionid, RuntimeWarning)
Unhandled Error
Traceback (most recent call last):
File "/var/lib/jenkins/jobs/cubicweb-3.23/workspace/TOXENV/py34-devtools/.tox/py34-devtools/lib/python3.4/site-packages/twisted/python/log.py", line 101, in callWithLogger
return callWithContext({"system": lp}, func, *args, **kw)
File "/var/lib/jenkins/jobs/cubicweb-3.23/workspace/TOXENV/py34-devtools/.tox/py34-devtools/lib/python3.4/site-packages/twisted/python/log.py", line 84, in callWithContext
return context.call({ILogContext: newCtx}, func, *args, **kw)
File "/var/lib/jenkins/jobs/cubicweb-3.23/workspace/TOXENV/py34-devtools/.tox/py34-devtools/lib/python3.4/site-packages/twisted/python/context.py", line 118, in callWithContext
return self.currentContext().callWithContext(ctx, func, *args, **kw)
File "/var/lib/jenkins/jobs/cubicweb-3.23/workspace/TOXENV/py34-devtools/.tox/py34-devtools/lib/python3.4/site-packages/twisted/python/context.py", line 81, in callWithContext
return func(*args,**kw)
--- <exception caught here> ---
File "/var/lib/jenkins/jobs/cubicweb-3.23/workspace/TOXENV/py34-devtools/.tox/py34-devtools/lib/python3.4/site-packages/twisted/internet/posixbase.py", line 597, in _doReadOrWrite
why = selectable.doRead()
File "/var/lib/jenkins/jobs/cubicweb-3.23/workspace/TOXENV/py34-devtools/.tox/py34-devtools/lib/python3.4/site-packages/twisted/internet/tcp.py", line 209, in doRead
return self._dataReceived(data)
File "/var/lib/jenkins/jobs/cubicweb-3.23/workspace/TOXENV/py34-devtools/.tox/py34-devtools/lib/python3.4/site-packages/twisted/internet/tcp.py", line 215, in _dataReceived
rval = self.protocol.dataReceived(data)
File "/var/lib/jenkins/jobs/cubicweb-3.23/workspace/TOXENV/py34-devtools/.tox/py34-devtools/lib/python3.4/site-packages/twisted/protocols/basic.py", line 571, in dataReceived
why = self.lineReceived(line)
File "/var/lib/jenkins/jobs/cubicweb-3.23/workspace/TOXENV/py34-devtools/.tox/py34-devtools/lib/python3.4/site-packages/twisted/web/http.py", line 1720, in lineReceived
self.allContentReceived()
File "/var/lib/jenkins/jobs/cubicweb-3.23/workspace/TOXENV/py34-devtools/.tox/py34-devtools/lib/python3.4/site-packages/twisted/web/http.py", line 1799, in allContentReceived
req.requestReceived(command, path, version)
File "/var/lib/jenkins/jobs/cubicweb-3.23/workspace/TOXENV/py34-devtools/cubicweb/etwist/server.py", line 206, in requestReceived
x = self.uri.split('?', 1)
builtins.TypeError: Type str doesn't support the buffer API

EUnhandled Error
Traceback (most recent call last):
File "/var/lib/jenkins/jobs/cubicweb-3.23/workspace/TOXENV/py34-devtools/.tox/py34-devtools/lib/python3.4/site-packages/twisted/python/log.py", line 101, in callWithLogger
return callWithContext({"system": lp}, func, *args, **kw)
File "/var/lib/jenkins/jobs/cubicweb-3.23/workspace/TOXENV/py34-devtools/.tox/py34-devtools/lib/python3.4/site-packages/twisted/python/log.py", line 84, in callWithContext
return context.call({ILogContext: newCtx}, func, *args, **kw)
File "/var/lib/jenkins/jobs/cubicweb-3.23/workspace/TOXENV/py34-devtools/.tox/py34-devtools/lib/python3.4/site-packages/twisted/python/context.py", line 118, in callWithContext
return self.currentContext().callWithContext(ctx, func, *args, **kw)
File "/var/lib/jenkins/jobs/cubicweb-3.23/workspace/TOXENV/py34-devtools/.tox/py34-devtools/lib/python3.4/site-packages/twisted/python/context.py", line 81, in callWithContext
return func(*args,**kw)
--- <exception caught here> ---
File "/var/lib/jenkins/jobs/cubicweb-3.23/workspace/TOXENV/py34-devtools/.tox/py34-devtools/lib/python3.4/site-packages/twisted/internet/posixbase.py", line 597, in _doReadOrWrite
why = selectable.doRead()
File "/var/lib/jenkins/jobs/cubicweb-3.23/workspace/TOXENV/py34-devtools/.tox/py34-devtools/lib/python3.4/site-packages/twisted/internet/tcp.py", line 209, in doRead
return self._dataReceived(data)
File "/var/lib/jenkins/jobs/cubicweb-3.23/workspace/TOXENV/py34-devtools/.tox/py34-devtools/lib/python3.4/site-packages/twisted/internet/tcp.py", line 215, in _dataReceived
rval = self.protocol.dataReceived(data)
File "/var/lib/jenkins/jobs/cubicweb-3.23/workspace/TOXENV/py34-devtools/.tox/py34-devtools/lib/python3.4/site-packages/twisted/protocols/basic.py", line 571, in dataReceived
why = self.lineReceived(line)
File "/var/lib/jenkins/jobs/cubicweb-3.23/workspace/TOXENV/py34-devtools/.tox/py34-devtools/lib/python3.4/site-packages/twisted/web/http.py", line 1720, in lineReceived
self.allContentReceived()
File "/var/lib/jenkins/jobs/cubicweb-3.23/workspace/TOXENV/py34-devtools/.tox/py34-devtools/lib/python3.4/site-packages/twisted/web/http.py", line 1799, in allContentReceived
req.requestReceived(command, path, version)
File "/var/lib/jenkins/jobs/cubicweb-3.23/workspace/TOXENV/py34-devtools/cubicweb/etwist/server.py", line 206, in requestReceived
x = self.uri.split('?', 1)
builtins.TypeError: Type str doesn't support the buffer API

E
======================================================================
ERROR: test_base_url (unittest_httptest.TwistedCWAnonTC)
----------------------------------------------------------------------
Traceback (most recent call last)
File "/var/lib/jenkins/jobs/cubicweb-3.23/workspace/TOXENV/py34-devtools/.tox/py34-devtools/lib/python3.4/site-packages/logilab/common/testlib.py", line 463, in _proceed
testfunc(*args, **kwargs)
File "/var/lib/jenkins/jobs/cubicweb-3.23/workspace/TOXENV/py34-devtools/cubicweb/devtools/test/unittest_httptest.py", line 39, in test_base_url
if self.config['base-url'] not in self.web_get().read():
File "/var/lib/jenkins/jobs/cubicweb-3.23/workspace/TOXENV/py34-devtools/cubicweb/devtools/httptest.py", line 152, in web_get
return self.web_request(path=path, body=body, headers=headers)
File "/var/lib/jenkins/jobs/cubicweb-3.23/workspace/TOXENV/py34-devtools/cubicweb/devtools/httptest.py", line 146, in web_request
response = self._web_test_cnx.getresponse()
File "/usr/lib/python3.4/http/client.py", line 1172, in getresponse
response.begin()
File "/usr/lib/python3.4/http/client.py", line 351, in begin
version, status, reason = self._read_status()
File "/usr/lib/python3.4/http/client.py", line 321, in _read_status
raise BadStatusLine(line)
http.client.BadStatusLine: ''

no stdout
no stderr
======================================================================
ERROR: test_response (unittest_httptest.TwistedCWAnonTC)
----------------------------------------------------------------------
Traceback (most recent call last)
File "/var/lib/jenkins/jobs/cubicweb-3.23/workspace/TOXENV/py34-devtools/.tox/py34-devtools/lib/python3.4/site-packages/logilab/common/testlib.py", line 463, in _proceed
testfunc(*args, **kwargs)
File "/var/lib/jenkins/jobs/cubicweb-3.23/workspace/TOXENV/py34-devtools/cubicweb/devtools/test/unittest_httptest.py", line 30, in test_response
response = self.web_get()
File "/var/lib/jenkins/jobs/cubicweb-3.23/workspace/TOXENV/py34-devtools/cubicweb/devtools/httptest.py", line 152, in web_get
return self.web_request(path=path, body=body, headers=headers)
File "/var/lib/jenkins/jobs/cubicweb-3.23/workspace/TOXENV/py34-devtools/cubicweb/devtools/httptest.py", line 146, in web_request
response = self._web_test_cnx.getresponse()
File "/usr/lib/python3.4/http/client.py", line 1172, in getresponse
response.begin()
File "/usr/lib/python3.4/http/client.py", line 351, in begin
version, status, reason = self._read_status()
File "/usr/lib/python3.4/http/client.py", line 321, in _read_status
raise BadStatusLine(line)
http.client.BadStatusLine: ''

no stdout
no stderr
======================================================================
ERROR: test_response_anon (unittest_httptest.TwistedCWAnonTC)
----------------------------------------------------------------------
Traceback (most recent call last)
File "/var/lib/jenkins/jobs/cubicweb-3.23/workspace/TOXENV/py34-devtools/.tox/py34-devtools/lib/python3.4/site-packages/logilab/common/testlib.py", line 463, in _proceed
testfunc(*args, **kwargs)
File "/var/lib/jenkins/jobs/cubicweb-3.23/workspace/TOXENV/py34-devtools/cubicweb/devtools/test/unittest_httptest.py", line 35, in test_response_anon
response = self.web_get()
File "/var/lib/jenkins/jobs/cubicweb-3.23/workspace/TOXENV/py34-devtools/cubicweb/devtools/httptest.py", line 152, in web_get
return self.web_request(path=path, body=body, headers=headers)
File "/var/lib/jenkins/jobs/cubicweb-3.23/workspace/TOXENV/py34-devtools/cubicweb/devtools/httptest.py", line 146, in web_request
response = self._web_test_cnx.getresponse()
File "/usr/lib/python3.4/http/client.py", line 1172, in getresponse
response.begin()
File "/usr/lib/python3.4/http/client.py", line 351, in begin
version, status, reason = self._read_status()
File "/usr/lib/python3.4/http/client.py", line 321, in _read_status
raise BadStatusLine(line)
http.client.BadStatusLine: ''

no stdout
no stderr
======================================================================
ERROR: test_login (unittest_httptest.TwistedCWIdentTC)
----------------------------------------------------------------------
Traceback (most recent call last)
File "/var/lib/jenkins/jobs/cubicweb-3.23/workspace/TOXENV/py34-devtools/.tox/py34-devtools/lib/python3.4/site-packages/logilab/common/testlib.py", line 463, in _proceed
testfunc(*args, **kwargs)
File "/var/lib/jenkins/jobs/cubicweb-3.23/workspace/TOXENV/py34-devtools/cubicweb/devtools/test/unittest_httptest.py", line 53, in test_login
response = self.web_get()
File "/var/lib/jenkins/jobs/cubicweb-3.23/workspace/TOXENV/py34-devtools/cubicweb/devtools/httptest.py", line 152, in web_get
return self.web_request(path=path, body=body, headers=headers)
File "/var/lib/jenkins/jobs/cubicweb-3.23/workspace/TOXENV/py34-devtools/cubicweb/devtools/httptest.py", line 146, in web_request
response = self._web_test_cnx.getresponse()
File "/usr/lib/python3.4/http/client.py", line 1172, in getresponse
response.begin()
File "/usr/lib/python3.4/http/client.py", line 351, in begin
version, status, reason = self._read_status()
File "/usr/lib/python3.4/http/client.py", line 321, in _read_status
raise BadStatusLine(line)
http.client.BadStatusLine: ''

no stdout
no stderr
======================================================================
ERROR: test_response_denied (unittest_httptest.TwistedCWIdentTC)
----------------------------------------------------------------------
Traceback (most recent call last)
File "/var/lib/jenkins/jobs/cubicweb-3.23/workspace/TOXENV/py34-devtools/.tox/py34-devtools/lib/python3.4/site-packages/logilab/common/testlib.py", line 463, in _proceed
testfunc(*args, **kwargs)
File "/var/lib/jenkins/jobs/cubicweb-3.23/workspace/TOXENV/py34-devtools/cubicweb/devtools/test/unittest_httptest.py", line 49, in test_response_denied
response = self.web_get()
File "/var/lib/jenkins/jobs/cubicweb-3.23/workspace/TOXENV/py34-devtools/cubicweb/devtools/httptest.py", line 152, in web_get
return self.web_request(path=path, body=body, headers=headers)
File "/var/lib/jenkins/jobs/cubicweb-3.23/workspace/TOXENV/py34-devtools/cubicweb/devtools/httptest.py", line 146, in web_request
response = self._web_test_cnx.getresponse()
File "/usr/lib/python3.4/http/client.py", line 1172, in getresponse
response.begin()
File "/usr/lib/python3.4/http/client.py", line 351, in begin
version, status, reason = self._read_status()
File "/usr/lib/python3.4/http/client.py", line 321, in _read_status
raise BadStatusLine(line)
http.client.BadStatusLine: ''

no stdout
no stderr
======================= unittest_testlib.py ========================
..................../var/lib/jenkins/jobs/cubicweb-3.23/workspace/TOXENV/py34-devtools/cubicweb/devtools/__init__.py:111: RuntimeWarning: admincddcf898aee64a1d9e655f3e25f0da42 Open session found while turning repository off
%sessionid, RuntimeWarning)
..
========================= unittest_fill.py =========================
...
======================= unittest_webtest.py ========================
/var/lib/jenkins/jobs/cubicweb-3.23/workspace/TOXENV/py34-devtools/cubicweb/devtools/__init__.py:111: RuntimeWarning: admin36fc1c577d1a4c2f93fb8eabaf7592d8 Open session found while turning repository off
%sessionid, RuntimeWarning)
../var/lib/jenkins/jobs/cubicweb-3.23/workspace/TOXENV/py34-devtools/cubicweb/devtools/__init__.py:111: RuntimeWarning: anon3c12b69c1c234b3baefaa452c995c90a Open session found while turning repository off
%sessionid, RuntimeWarning)
./var/lib/jenkins/jobs/cubicweb-3.23/workspace/TOXENV/py34-devtools/cubicweb/devtools/__init__.py:111: RuntimeWarning: anona3aa820f608547d0a773213ee9a406f6 Open session found while turning repository off
%sessionid, RuntimeWarning)
.
======================== unittest_dbfill.py ========================
S........
======================================================================
SKIPPED: test_writeme (unittest_dbfill.ConstraintInsertionTC)
Test automatic insertion / Schema Constraints
======================== unittest_devctl.py ========================
.
========================= unittest_i18n.py =========================
.
-> creating tables
-> inserting default user and default groups.
-> storing the schema in the database
-> database for instance data initialized.
Building httptest-cwident for database tmpdb
Building RepoInstancesConsistencyTC for database tmpdb
Building webtest-ident for database tmpdb
*******************************************************************************
Ran 46 test cases in 39.19s (27.98s CPU), 6 errors, 1 skipped
6 modules OK (2 failed)
failures: /var/lib/jenkins/jobs/cubicweb-3.23/workspace/TOXENV/py34-devtools/cubicweb/devtools/test/unittest_qunit [1/2], /var/lib/jenkins/jobs/cubicweb-3.23/workspace/TOXENV/py34-devtools/cubicweb/devtools/test/unittest_httptest [5/5]
ERROR: InvocationError: '/var/lib/jenkins/jobs/cubicweb-3.23/workspace/TOXENV/py34-devtools/.tox/py34-devtools/bin/python -c from logilab.common import pytest; pytest.run() -t /var/lib/jenkins/jobs/cubicweb-3.23/workspace/TOXENV/py34-devtools/cubicweb/devtools/test'
___________________________________ summary ____________________________________
ERROR: py34-devtools: commands failed
Build step 'Execute shell' marked build as failure
Sending e-mails to: dlaxalde@logilab.fr jcr@logilab.fr syt@logilab.fr david@logilab.fr
[PostBuildScript] - Execution post build scripts.
[py34-devtools] $ /bin/bash -xe /tmp/hudson2716230824762928218.sh
+ /var/lib/jenkins/scripts/notify_forge_apycot.py cwo cubicweb fccc6ddd975c http://jenkins.logilab.fr/job/cubicweb-3.23/TOXENV=py34-devtools/27/ --status failure
<br/>

log from execution
download