consoleText

download

20 Started by upstream project "cubicweb-3.23" build number 43
originally caused by:
Started by an SCM change
Building in workspace /var/lib/jenkins/jobs/cubicweb-3.23/workspace/TOXENV/py27-server
[py27-server] $ hg showconfig paths.default
[py27-server] $ hg pull
pulling from http://hg.logilab.org/review/cubicweb
searching for changes
adding changesets
adding manifests
adding file changes
added 1 changesets with 1 changes to 1 files (+1 heads)
4 new obsolescence markers
(run 'hg heads .' to see heads, 'hg merge' to merge)
[py27-server] $ hg update --clean --rev f3d220ff36fc775a8d8d3e6cd3d467d49a23e70f
6 files updated, 0 files merged, 0 files removed, 0 files unresolved
[py27-server] $ hg --config extensions.purge= clean --all
[py27-server] $ hg log --rev . --template {node}
[py27-server] $ hg log --rev . --template {rev}
[py27-server] $ hg id --branch
[py27-server] $ /bin/bash -xe /tmp/hudson1749643691022259231.sh
+ find . '(' -name 'pgdb*' -o -name 'tmpdb*' ')' -print0
+ xargs -0 rm -rf
[py27-server] $ /bin/bash -xe /tmp/hudson3377183897960722607.sh
+ PATH=/usr/lib/postgresql/9.4/bin:/usr/local/bin:/usr/bin:/bin:/usr/local/games:/usr/games
+ tox --recreate
py27-server create: /var/lib/jenkins/jobs/cubicweb-3.23/workspace/TOXENV/py27-server/.tox/py27-server
py27-server installdeps: -r/var/lib/jenkins/jobs/cubicweb-3.23/workspace/TOXENV/py27-server/cubicweb/server/test/requirements.txt
py27-server develop-inst: /var/lib/jenkins/jobs/cubicweb-3.23/workspace/TOXENV/py27-server
py27-server installed: You are using pip version 7.1.2, however version 8.1.0 is available.,You should consider upgrading via the 'pip install --upgrade pip' command.,beautifulsoup4==4.3.2,boto==2.34.0,bzr-etckeeper==0.0.0,cffi==0.8.6,characteristic==0.1.0,chardet==2.3.0,Cheetah==2.4.4,cloud-init==0.7.6,colorama==0.3.2,configobj==5.0.6,coverage==3.7.1,croniter==0.3.4,cryptography==0.6.1,-e hg+http://hg.logilab.org/review/cubicweb@f3d220ff36fc775a8d8d3e6cd3d467d49a23e70f#egg=cubicweb-dev,cubicweb-basket==1.5.0,cubicweb-card==0.5.8,cubicweb-comment==1.12.1,cubicweb-file==1.17.0,cubicweb-localperms==0.3.2,cubicweb-tag==1.8.2,cwclientlib==0.4.1,Cython==0.21.1,decorator==3.4.0,docutils==0.12,ecdsa==0.11,euca2ools==3.1.0,GDAL==1.10.1,hg-evolve==5.2.1,html2text==2016.1.8,html5lib==0.999,isodate==0.5.0,Jinja2==2.7.3,joblib==0.8.3,jsonpatch==1.3,jsonpointer==1.0,ldap3==1.0.4,linecache2==1.0.0,logilab-common==1.1.0,logilab-constraint==0.6.0,logilab-database==1.15.0,logilab-mtconverter==0.9.0,lxml==3.4.0,M2Crypto==0.21.1,Mako==1.0.0,Markdown==2.5.1,MarkupSafe==0.23,matplotlib==1.4.2,mercurial==3.5.2,mock==1.0.1,msgpack-python==0.4.2,nose==1.3.4,numexpr==2.4,numpy==1.8.2,oauth==1.0.1,openpyxl==1.7.0,pandas==0.14.1,paramiko==1.15.1,passlib==1.6.5,pep8==1.5.7,Pillow==2.6.1,pluggy==0.3.1,ply==3.4,prettytable==0.7.2,psycopg2==2.5.4,py==1.4.31,pyasn1==0.1.9,pyasn1-modules==0.0.5,pycparser==2.10,pycrypto==2.6.1,Pygments==2.0.1,pyinotify==0.9.4,pyOpenSSL==0.14,pyparsing==2.0.3,pyserial==2.6,pysqlite==2.6.3,python-apt==0.9.3.12,python-augeas==0.4.1,python-dateutil==2.2,python-jenkins==0.2.1,python-ldap==2.4.10,python-yapps==2.1.1,python3-ldap==0.9.4.2,pytz==2012rc0,PyYAML==3.11,pyzmq==14.4.0,rdflib==4.1.2,requestbuilder==0.2.3,requests==2.4.3,roman==2.0.0,rql==0.34.0,rubber==1.1,salt==2015.5.3,scikit-learn==0.14.1,scipy==0.14.0,service-identity==1.0.0,Shapely==1.4.3,simplejson==3.6.5,SimpleTAL==4.1,six==1.8.0,SPARQLWrapper==1.6.0,statsmodels==0.4.2,tables==3.1.1,tox==2.3.1,traceback2==1.4.0,unittest2==1.1.0,urllib3==1.9.1,virtualenv==13.1.2,wheel==0.24.0,xlrd==0.9.2,xlwt==0.7.5,yams==0.42.0,Yapps==2.2.0,Yapps2==2.2.0
py27-server runtests: PYTHONHASHSEED='331399569'
py27-server runtests: commands[0] | /var/lib/jenkins/jobs/cubicweb-3.23/workspace/TOXENV/py27-server/.tox/py27-server/bin/python -m unittest discover -s /var/lib/jenkins/jobs/cubicweb-3.23/workspace/TOXENV/py27-server/cubicweb/server/test -p *test_*.py -b
....................................................................................................................................................s..........................................................................................................................................s.........................s.......................................................................................................The files belonging to this database system will be owned by user "jenkins".
This user must also own the server process.

The database cluster will be initialized with locale "C".
The default text search configuration will be set to "english".

Data page checksums are disabled.

creating directory /var/lib/jenkins/jobs/cubicweb-3.23/workspace/TOXENV/py27-server/cubicweb/server/test/data/database/pgdb-unittest_migractions ... ok
creating subdirectories ... ok
selecting default max_connections ... 100
selecting default shared_buffers ... 128MB
selecting dynamic shared memory implementation ... posix
creating configuration files ... ok
creating template1 database in /var/lib/jenkins/jobs/cubicweb-3.23/workspace/TOXENV/py27-server/cubicweb/server/test/data/database/pgdb-unittest_migractions/base/1 ... ok
initializing pg_authid ... ok
initializing dependencies ... ok
creating system views ... ok
loading system objects' descriptions ... ok
creating collations ... ok
creating conversions ... ok
creating dictionaries ... ok
setting privileges on built-in objects ... ok
creating information schema ... ok
loading PL/pgSQL server-side language ... ok
vacuuming database template1 ... ok
copying template1 to template0 ... ok
copying template1 to postgres ... ok
syncing data to disk ... ok

WARNING: enabling "trust" authentication for local connections
You can change this by editing pg_hba.conf or using the option -A, or
--auth-local and --auth-host, the next time you run initdb.

Success. You can now start the database server using:

postgres -D /var/lib/jenkins/jobs/cubicweb-3.23/workspace/TOXENV/py27-server/cubicweb/server/test/data/database/pgdb-unittest_migractions
or
pg_ctl -D /var/lib/jenkins/jobs/cubicweb-3.23/workspace/TOXENV/py27-server/cubicweb/server/test/data/database/pgdb-unittest_migractions -l logfile start

waiting for server to start....LOG: database system was shut down at 2016-03-08 09:32:01 CET
LOG: MultiXact member wraparound protections are now enabled
LOG: database system is ready to accept connections
LOG: autovacuum launcher started
done
server started
........................................s....waiting for server to shut down....LOG: received fast shutdown request
LOG: aborting any active transactions
FATAL: terminating connection due to administrator command
LOG: autovacuum launcher shutting down
LOG: shutting down
LOG: database system is shut down
done
server stopped
.........................................F..............................................................The files belonging to this database system will be owned by user "jenkins".
This user must also own the server process.

The database cluster will be initialized with locale "C".
The default text search configuration will be set to "english".

Data page checksums are disabled.

creating directory /var/lib/jenkins/jobs/cubicweb-3.23/workspace/TOXENV/py27-server/cubicweb/server/test/data/database/pgdb-unittest_postgres ... ok
creating subdirectories ... ok
selecting default max_connections ... 100
selecting default shared_buffers ... 128MB
selecting dynamic shared memory implementation ... posix
creating configuration files ... ok
creating template1 database in /var/lib/jenkins/jobs/cubicweb-3.23/workspace/TOXENV/py27-server/cubicweb/server/test/data/database/pgdb-unittest_postgres/base/1 ... ok
initializing pg_authid ... ok
initializing dependencies ... ok
creating system views ... ok
loading system objects' descriptions ... ok
creating collations ... ok
creating conversions ... ok
creating dictionaries ... ok
setting privileges on built-in objects ... ok
creating information schema ... ok
loading PL/pgSQL server-side language ... ok
vacuuming database template1 ... ok
copying template1 to template0 ... ok
copying template1 to postgres ... ok
syncing data to disk ... ok

WARNING: enabling "trust" authentication for local connections
You can change this by editing pg_hba.conf or using the option -A, or
--auth-local and --auth-host, the next time you run initdb.

Success. You can now start the database server using:

postgres -D /var/lib/jenkins/jobs/cubicweb-3.23/workspace/TOXENV/py27-server/cubicweb/server/test/data/database/pgdb-unittest_postgres
or
pg_ctl -D /var/lib/jenkins/jobs/cubicweb-3.23/workspace/TOXENV/py27-server/cubicweb/server/test/data/database/pgdb-unittest_postgres -l logfile start

waiting for server to start....LOG: database system was shut down at 2016-03-08 09:40:45 CET
LOG: MultiXact member wraparound protections are now enabled
LOG: database system is ready to accept connections
LOG: autovacuum launcher started
done
server started
.ERROR: new row for relation "cw_note" violates check constraint "cstr5d4368df8b262ced7e5256dea63170bb"
DETAIL: Failing row contains (null, nogood, null, null, 2016-03-08 08:41:08.689186+00, 1584, http://testing.fr/cubicweb/1584, 2016-03-08 08:41:08.689186+00, null, null, null, null).
STATEMENT: INSERT INTO cw_Note ( cw_creation_date, cw_cwuri, cw_eid, cw_modification_date, cw_type ) VALUES ( '2016-03-08T08:41:08.689186'::timestamp, 'http://testing.fr/cubicweb/1584', 1584, '2016-03-08T08:41:08.689186'::timestamp, 'nogood' )
....ERROR: canceling statement due to statement timeout
STATEMENT: select pg_sleep(0.3)
ERROR: canceling statement due to statement timeout
STATEMENT: select pg_sleep(0.3)
...waiting for server to shut down....LOG: received fast shutdown request
LOG: aborting any active transactions
FATAL: terminating connection due to administrator command
LOG: autovacuum launcher shutting down
LOG: shutting down
LOG: database system is shut down
done
server stopped
...........................
======================================================================
FAIL: test_deserialization_base (unittest_repository.SchemaDeserialTC)
Check the following deserialization
----------------------------------------------------------------------
Traceback (most recent call last):
File "/var/lib/jenkins/jobs/cubicweb-3.23/workspace/TOXENV/py27-server/cubicweb/server/test/unittest_repository.py", line 397, in test_deserialization_base
(u'TZDatetime',), (u'TZTime',), (u'Time',)])
AssertionError: Lists differ: [(u'B[140 chars], (u'Numeric',), (u'Password',), (u'String',),[39 chars]e',)] != [(u'B[140 chars], (u'Password',), (u'String',), (u'TZDatetime'[24 chars]e',)]

First differing element 10:
(u'Numeric',)
(u'Password',)

First list contains 1 additional elements.
First extra element 15:
(u'Time',)

[(u'BabarTestType',),
(u'BigInt',),
(u'Boolean',),
(u'Bytes',),
(u'Date',),
(u'Datetime',),
(u'Decimal',),
(u'Float',),
(u'Int',),
(u'Interval',),
- (u'Numeric',),
(u'Password',),
(u'String',),
(u'TZDatetime',),
(u'TZTime',),
(u'Time',)]

----------------------------------------------------------------------
Ran 599 tests in 734.485s

FAILED (failures=1, skipped=4)
ERROR: InvocationError: '/var/lib/jenkins/jobs/cubicweb-3.23/workspace/TOXENV/py27-server/.tox/py27-server/bin/python -m unittest discover -s /var/lib/jenkins/jobs/cubicweb-3.23/workspace/TOXENV/py27-server/cubicweb/server/test -p *test_*.py -b'
___________________________________ summary ____________________________________
ERROR: py27-server: commands failed
Build step 'Execute shell' marked build as failure
Sending e-mails to: dlaxalde@logilab.fr jcr@logilab.fr syt@logilab.fr david@logilab.fr
[PostBuildScript] - Execution post build scripts.
[py27-server] $ /bin/bash -xe /tmp/hudson7827506073309587324.sh
+ /var/lib/jenkins/scripts/notify_forge_apycot.py cwo cubicweb f3d220ff36fc http://jenkins.logilab.fr/job/cubicweb-3.23/TOXENV=py27-server/43/ --status failure
<br/>

log from execution
download