consoleText

download

20 Started by upstream project "cubicweb-3.23" build number 64
originally caused by:
Started by an SCM change
Building in workspace /var/lib/jenkins/jobs/cubicweb-3.23/workspace/TOXENV/py27-web
[py27-web] $ hg showconfig paths.default
[py27-web] $ hg pull
pulling from http://hg.logilab.org/review/cubicweb
searching for changes
adding changesets
adding manifests
adding file changes
added 1 changesets with 2 changes to 2 files (+1 heads)
6 new obsolescence markers
(run 'hg heads .' to see heads, 'hg merge' to merge)
[py27-web] $ hg update --clean --rev 2ce70e8f62b1a604b88847f929cb7f489955f72a
3 files updated, 0 files merged, 0 files removed, 0 files unresolved
[py27-web] $ hg --config extensions.purge= clean --all
[py27-web] $ hg log --rev . --template {node}
[py27-web] $ hg log --rev . --template {rev}
[py27-web] $ hg id --branch
[py27-web] $ /bin/bash -xe /tmp/hudson7477967906845267386.sh
+ find . '(' -name 'pgdb*' -o -name 'tmpdb*' ')' -print0
+ xargs -0 rm -rf
[py27-web] $ /bin/bash -xe /tmp/hudson9045893221429363102.sh
+ PATH=/usr/lib/postgresql/9.4/bin:/usr/local/bin:/usr/bin:/bin:/usr/local/games:/usr/games
+ tox --recreate
py27-web create: /var/lib/jenkins/jobs/cubicweb-3.23/workspace/TOXENV/py27-web/.tox/py27-web
py27-web installdeps: -r/var/lib/jenkins/jobs/cubicweb-3.23/workspace/TOXENV/py27-web/cubicweb/web/test/requirements.txt
py27-web develop-inst: /var/lib/jenkins/jobs/cubicweb-3.23/workspace/TOXENV/py27-web
py27-web installed: You are using pip version 7.1.2, however version 8.1.0 is available.,You should consider upgrading via the 'pip install --upgrade pip' command.,beautifulsoup4==4.3.2,boto==2.34.0,bzr-etckeeper==0.0.0,cffi==0.8.6,characteristic==0.1.0,chardet==2.3.0,Cheetah==2.4.4,cloud-init==0.7.6,colorama==0.3.2,configobj==5.0.6,coverage==3.7.1,croniter==0.3.4,cryptography==0.6.1,-e hg+http://hg.logilab.org/review/cubicweb@2ce70e8f62b1a604b88847f929cb7f489955f72a#egg=cubicweb-dev,cubicweb-blog==1.12.0,cubicweb-file==1.18.0,cubicweb-tag==1.8.3,cwclientlib==0.4.1,Cython==0.21.1,decorator==3.4.0,docutils==0.12,ecdsa==0.11,euca2ools==3.1.0,GDAL==1.10.1,hg-evolve==5.2.1,html2text==2016.1.8,html5lib==0.999,isodate==0.5.0,Jinja2==2.7.3,joblib==0.8.3,jsonpatch==1.3,jsonpointer==1.0,linecache2==1.0.0,logilab-common==1.2.0,logilab-constraint==0.6.0,logilab-database==1.15.0,logilab-mtconverter==0.9.0,lxml==3.4.0,M2Crypto==0.21.1,Mako==1.0.0,Markdown==2.5.1,MarkupSafe==0.23,matplotlib==1.4.2,mercurial==3.5.2,mock==1.0.1,msgpack-python==0.4.2,nose==1.3.4,numexpr==2.4,numpy==1.8.2,oauth==1.0.1,openpyxl==1.7.0,pandas==0.14.1,paramiko==1.15.1,passlib==1.6.5,pep8==1.5.7,Pillow==2.6.1,pluggy==0.3.1,ply==3.4,prettytable==0.7.2,psycopg2==2.5.4,py==1.4.31,pyasn1==0.1.7,pyasn1-modules==0.0.5,pycparser==2.10,pycrypto==2.6.1,Pygments==2.0.1,pyinotify==0.9.4,pyOpenSSL==0.14,pyparsing==2.0.3,pyserial==2.6,pysqlite==2.6.3,python-apt==0.9.3.12,python-augeas==0.4.1,python-dateutil==2.2,python-jenkins==0.2.1,python-ldap==2.4.10,python-yapps==2.1.1,python3-ldap==0.9.4.2,pytz==2012rc0,PyYAML==3.11,pyzmq==14.4.0,rdflib==4.1.2,requestbuilder==0.2.3,requests==2.4.3,roman==2.0.0,rql==0.34.0,rubber==1.1,salt==2015.5.3,scikit-learn==0.14.1,scipy==0.14.0,service-identity==1.0.0,Shapely==1.4.3,simplejson==3.6.5,SimpleTAL==4.1,six==1.8.0,SPARQLWrapper==1.6.0,statsmodels==0.4.2,tables==3.1.1,tox==2.3.1,traceback2==1.4.0,Twisted==16.0.0,unittest2==1.1.0,urllib3==1.9.1,virtualenv==13.1.2,waitress==0.8.10,WebOb==1.5.1,WebTest==2.0.20,wheel==0.24.0,xlrd==0.9.2,xlwt==0.7.5,yams==0.42.0,Yapps==2.2.0,Yapps2==2.2.0,zope.interface==4.1.3
py27-web runtests: PYTHONHASHSEED='781091267'
py27-web runtests: commands[0] | /var/lib/jenkins/jobs/cubicweb-3.23/workspace/TOXENV/py27-web/.tox/py27-web/bin/python -c from logilab.common import pytest; pytest.run() -t /var/lib/jenkins/jobs/cubicweb-3.23/workspace/TOXENV/py27-web/cubicweb/web/test
========================= unittest_http.py =========================
..............2016-03-15 11:33:13 - (cubicweb.appobject) WARNING: can't find any workflow for CWUser
2016-03-15 11:33:25 - (cubicweb.web) WARNING: [3.17] massmailing extracted to cube massmailing that was not found. try installing it.
2016-03-15 11:33:25 - (cubicweb.web) WARNING: [3.17] igeocoding extracted to cube geocoding that was not found. try installing it.
2016-03-15 11:33:25 - (cubicweb.web) WARNING: [3.17] embedding extracted to cube embed that was not found. try installing it.
2016-03-15 11:33:25 - (cubicweb.web) WARNING: [3.17] isioc extracted to cube sioc that was not found. try installing it.
.............
===================== unittest_views_forms.py ======================
...
===================== unittest_viewselector.py =====================
.......................
================= unittest_views_apacherewrite.py ==================
.
====================== unittest_views_json.py ======================
...2016-03-15 11:33:34 - (py.warnings) WARNING: /var/lib/jenkins/jobs/cubicweb-3.23/workspace/TOXENV/py27-web/cubicweb/devtools/__init__.py:111: RuntimeWarning: anon194c039c8a6246fea4de790b0da997f2 Open session found while turning repository off
%sessionid, RuntimeWarning)

.2016-03-15 11:33:34 - (cubicweb.web) WARNING: vid table can't be used with jsonp controller, falling back to jsonexport
2016-03-15 11:33:36 - (py.warnings) WARNING: /var/lib/jenkins/jobs/cubicweb-3.23/workspace/TOXENV/py27-web/cubicweb/devtools/__init__.py:111: RuntimeWarning: anon09f6f421e7744374beedabf6888504bb Open session found while turning repository off
%sessionid, RuntimeWarning)

.....2016-03-15 11:33:36 - (cubicweb.web) WARNING: vid table can't be used with jsonp controller, falling back to jsonexport
.
==================== unittest_views_actions.py =====================
..
========================= unittest_web.py ==========================
..127.0.0.1 - - [15/Mar/2016 11:33:39] "POST /ajax?fname=fileupload HTTP/1.1" 200 135
2016-03-15 11:33:40 - (py.warnings) WARNING: /var/lib/jenkins/jobs/cubicweb-3.23/workspace/TOXENV/py27-web/cubicweb/devtools/__init__.py:111: RuntimeWarning: anonebb2d8a002724a6b9925ac6d60c11837 Open session found while turning repository off
%sessionid, RuntimeWarning)

.127.0.0.1 - - [15/Mar/2016 11:33:41] "POST /ajax?fname=fileupload HTTP/1.1" 200 82
2016-03-15 11:33:41 - (py.warnings) WARNING: /var/lib/jenkins/jobs/cubicweb-3.23/workspace/TOXENV/py27-web/cubicweb/devtools/__init__.py:111: RuntimeWarning: anonc6ed20241b88415ea91e6d09e5a13a71 Open session found while turning repository off
%sessionid, RuntimeWarning)

.127.0.0.1 - - [15/Mar/2016 11:33:44] "GET / HTTP/1.1" 200 7786
127.0.0.1 - - [15/Mar/2016 11:33:46] "GET / HTTP/1.1" 200 7786
2016-03-15 11:33:46 - (py.warnings) WARNING: /var/lib/jenkins/jobs/cubicweb-3.23/workspace/TOXENV/py27-web/cubicweb/devtools/__init__.py:111: RuntimeWarning: anone10d4e387f894e24994d9c53fd06a765 Open session found while turning repository off
%sessionid, RuntimeWarning)

2016-03-15 11:33:46 - (py.warnings) WARNING: /var/lib/jenkins/jobs/cubicweb-3.23/workspace/TOXENV/py27-web/cubicweb/devtools/__init__.py:111: RuntimeWarning: anon7ff63bf6ced54faeaa395f6fbec039fb Open session found while turning repository off
%sessionid, RuntimeWarning)

.127.0.0.1 - - [15/Mar/2016 11:33:48] "GET //6 HTTP/1.1" 403 5581
127.0.0.1 - - [15/Mar/2016 11:33:50] "GET /login?__login=admin&__password=gingkow HTTP/1.1" 303 0
127.0.0.1 - - [15/Mar/2016 11:33:50] "GET //6 HTTP/1.1" 200 11845
2016-03-15 11:33:50 - (py.warnings) WARNING: /var/lib/jenkins/jobs/cubicweb-3.23/workspace/TOXENV/py27-web/cubicweb/devtools/__init__.py:111: RuntimeWarning: anon39ea9cc3437a4639ad0cbede244ab5e6 Open session found while turning repository off
%sessionid, RuntimeWarning)

2016-03-15 11:33:50 - (py.warnings) WARNING: /var/lib/jenkins/jobs/cubicweb-3.23/workspace/TOXENV/py27-web/cubicweb/devtools/__init__.py:111: RuntimeWarning: admin402945d74a3941f4b646d520ab984597 Open session found while turning repository off
%sessionid, RuntimeWarning)

.127.0.0.1 - - [15/Mar/2016 11:33:52] "GET / HTTP/1.1" 200 7786
2016-03-15 11:33:52 - (py.warnings) WARNING: /var/lib/jenkins/jobs/cubicweb-3.23/workspace/TOXENV/py27-web/cubicweb/devtools/__init__.py:111: RuntimeWarning: anonf37ae9c4d65241f7a42cdb83fc75485f Open session found while turning repository off
%sessionid, RuntimeWarning)

.127.0.0.1 - - [15/Mar/2016 11:33:54] "GET / HTTP/1.1" 200 7667
2016-03-15 11:33:54 - (py.warnings) WARNING: /var/lib/jenkins/jobs/cubicweb-3.23/workspace/TOXENV/py27-web/cubicweb/devtools/__init__.py:111: RuntimeWarning: anoncc3ab5d6d6cb4ad78dd7984dc898dcb8 Open session found while turning repository off
%sessionid, RuntimeWarning)

.127.0.0.1 - - [15/Mar/2016 11:33:55] "GET / HTTP/1.1" 200 7667
2016-03-15 11:33:55 - (py.warnings) WARNING: /var/lib/jenkins/jobs/cubicweb-3.23/workspace/TOXENV/py27-web/cubicweb/devtools/__init__.py:111: RuntimeWarning: anon50ea4d548d714311a08801d918864aef Open session found while turning repository off
%sessionid, RuntimeWarning)

.
====================== unittest_webconfig.py =======================
...
=================== unittest_views_baseviews.py ====================
.............
=============== unittest_views_searchrestriction.py ================
........
===================== unittest_application.py ======================
2016-03-15 11:34:00 - (cubicweb.web) ERROR: Exception('whatever',)
Traceback (most recent call last):
File "/var/lib/jenkins/jobs/cubicweb-3.23/workspace/TOXENV/py27-web/cubicweb/web/application.py", line 368, in core_handle
result = controller.publish(rset=rset)
File "/var/lib/jenkins/jobs/cubicweb-3.23/workspace/TOXENV/py27-web/cubicweb/web/views/basecontrollers.py", line 136, in publish
rset=rset, view=view)
File "/var/lib/jenkins/jobs/cubicweb-3.23/workspace/TOXENV/py27-web/cubicweb/cwvreg.py", line 225, in main_template
res = obj.render(**kwargs)
File "/var/lib/jenkins/jobs/cubicweb-3.23/workspace/TOXENV/py27-web/cubicweb/view.py", line 138, in render
view_func(**context)
File "/var/lib/jenkins/jobs/cubicweb-3.23/workspace/TOXENV/py27-web/cubicweb/web/views/basetemplates.py", line 163, in call
view.render(w=w)
File "/var/lib/jenkins/jobs/cubicweb-3.23/workspace/TOXENV/py27-web/cubicweb/view.py", line 138, in render
view_func(**context)
File "unittest_application.py", line 510, in call
raise Exception('whatever')
Exception: whatever
2016-03-15 11:34:00 - (py.warnings) WARNING: /var/lib/jenkins/jobs/cubicweb-3.23/workspace/TOXENV/py27-web/cubicweb/devtools/__init__.py:111: RuntimeWarning: anone3b04cbaf9164e7bbcb71940a3ac4f65 Open session found while turning repository off
%sessionid, RuntimeWarning)

.2016-03-15 11:34:01 - (py.warnings) WARNING: /var/lib/jenkins/jobs/cubicweb-3.23/workspace/TOXENV/py27-web/cubicweb/devtools/__init__.py:111: RuntimeWarning: anon8d73ab5e90f7404fbbebb5d076852790 Open session found while turning repository off
%sessionid, RuntimeWarning)

....2016-03-15 11:34:08 - (py.warnings) WARNING: /var/lib/jenkins/jobs/cubicweb-3.23/workspace/TOXENV/py27-web/cubicweb/web/formfields.py:1201: Warning: [yams 0.38] no targettype specified and there are several relation definitions for rtype parent: ['Directory', 'Filesystem']. Yet you get the first rdef.
rdef = eschema.rdef(rschema, role)

.......2016-03-15 11:34:15 - (cubicweb.web) WARNING: the view toto could not be found
................
====================== unittest_controller.py ======================
..
===================== unittest_magicsearch.py ======================
..................
==================== unittest_views_pyviews.py =====================
..
===================== unittest_urlpublisher.py =====================
.............
========================= test_jscript.py ==========================
2016-03-15 11:34:41 - (py.warnings) WARNING: /var/lib/jenkins/jobs/cubicweb-3.23/workspace/TOXENV/py27-web/cubicweb/devtools/__init__.py:111: RuntimeWarning: anona245e2718a384b9db2a87df9d76c3337 Open session found while turning repository off
%sessionid, RuntimeWarning)

2016-03-15 11:34:41 - (py.warnings) WARNING: /var/lib/jenkins/jobs/cubicweb-3.23/workspace/TOXENV/py27-web/cubicweb/devtools/__init__.py:111: RuntimeWarning: anon78e43d3d0036458fae1a611fb2c472ec Open session found while turning repository off
%sessionid, RuntimeWarning)

2016-03-15 11:34:41 - (py.warnings) WARNING: /var/lib/jenkins/jobs/cubicweb-3.23/workspace/TOXENV/py27-web/cubicweb/devtools/__init__.py:111: RuntimeWarning: anon4ca030b8a17b47ac9be90e6e3f0d73c0 Open session found while turning repository off
%sessionid, RuntimeWarning)

.
===================== unittest_formwidgets.py ======================
...
=================== unittest_views_cwsources.py ====================
.
==================== unittest_views_treeview.py ====================
.
====================== unittest_urlrewrite.py ======================
........
======================== unittest_facet.py =========================
....................
===================== unittest_views_xmlrss.py =====================
.
=============== unittest_views_staticcontrollers.py ================
.2016-03-15 11:34:51 - (cubicweb.web) ERROR: concatenated data url error: u'dummy.js' file does not exist
.2016-03-15 11:34:51 - (cubicweb.web) ERROR: concatenated data url error: u'dummy.js' file does not exist
....
=================== unittest_views_navigation.py ===================
...........
==================== unittest_idownloadable.py =====================
2016-03-15 11:34:55 - (cubicweb.web) ERROR: IOError()
Traceback (most recent call last):
File "/var/lib/jenkins/jobs/cubicweb-3.23/workspace/TOXENV/py27-web/cubicweb/web/application.py", line 368, in core_handle
result = controller.publish(rset=rset)
File "/var/lib/jenkins/jobs/cubicweb-3.23/workspace/TOXENV/py27-web/cubicweb/web/views/basecontrollers.py", line 136, in publish
rset=rset, view=view)
File "/var/lib/jenkins/jobs/cubicweb-3.23/workspace/TOXENV/py27-web/cubicweb/cwvreg.py", line 225, in main_template
res = obj.render(**kwargs)
File "/var/lib/jenkins/jobs/cubicweb-3.23/workspace/TOXENV/py27-web/cubicweb/view.py", line 138, in render
view_func(**context)
File "/var/lib/jenkins/jobs/cubicweb-3.23/workspace/TOXENV/py27-web/cubicweb/web/views/basetemplates.py", line 120, in call
view.render()
File "/var/lib/jenkins/jobs/cubicweb-3.23/workspace/TOXENV/py27-web/cubicweb/view.py", line 138, in render
view_func(**context)
File "/var/lib/jenkins/jobs/cubicweb-3.23/workspace/TOXENV/py27-web/cubicweb/web/views/idownloadable.py", line 94, in call
self.w(adapter.download_data())
File "unittest_idownloadable.py", line 56, in download_data
raise IOError()
IOError
......
==================== unittest_propertysheet.py =====================
.
================= unittest_views_basetemplates.py ==================
..
=================== unittest_views_errorform.py ====================
....
======================= unittest_request.py ========================
....
======================== unittest_uicfg.py =========================
.........
====================== unittest_formfields.py ======================
....2016-03-15 11:35:03 - (py.warnings) WARNING: /var/lib/jenkins/jobs/cubicweb-3.23/workspace/TOXENV/py27-web/cubicweb/web/formfields.py:1201: Warning: [yams 0.38] no targettype specified and there are several relation definitions for rtype owned_by: ['SubWorkflowExitPoint', 'File', 'CWProperty', 'MicroBlogEntry', 'State', 'Societe', 'Personne', 'CWDataImport', 'Transition', 'CWGroup', 'MicroBlog', 'DirectoryPermission', 'CWSourceSchemaConfig', 'CWRType', 'Tag', 'CWSource', 'Filesystem', 'CWAttribute', 'CWUser', 'WorkflowTransition', 'CWComputedRType', 'TreeNode', 'Version', 'BlogEntry', 'Bookmark', 'TrInfo', 'CWUniqueTogetherConstraint', 'CWSourceHostConfig', 'Workflow', 'Project', 'Blog', 'CWEType', 'Directory', 'ExternalUri', 'EmailAddress', 'CWCache', 'BaseTransition', 'CWConstraintType', 'Ticket', 'Folder', 'Salesterm', 'RQLExpression', 'CWConstraint', 'CWRelation', 'UserAccount']. Yet you get the first rdef.
rdef = eschema.rdef(rschema, role)

......
=================== unittest_views_editforms.py ====================
..................
===================== unittest_http_headers.py =====================
.
===================== unittest_breadcrumbs.py ======================
.
======================= unittest_reledit.py ========================
.S2016-03-15 11:35:10 - (cubicweb.rtags) WARNING: using explict subject type in <property object at 0x7fd4eb495940>.tag_object_of() has no effect, use ("*", concerns, Project) instead of (Ticket, concerns, Project)
.
======================================================================
SKIPPED: test_default_forms (unittest_reledit.ClickAndEditFormTC)
Need to check if this test should still run post reledit/doreledit merge
========================== test_views.py ===========================
2016-03-15 11:35:13 - (py.warnings) WARNING: /var/lib/jenkins/jobs/cubicweb-3.23/workspace/TOXENV/py27-web/cubicweb/devtools/__init__.py:111: RuntimeWarning: admin7c12d1588ac14de2a5cd0ad1610b92f0 Open session found while turning repository off
%sessionid, RuntimeWarning)

2016-03-15 11:35:15 - (py.warnings) WARNING: /var/lib/jenkins/jobs/cubicweb-3.23/workspace/TOXENV/py27-web/cubicweb/web/formfields.py:1201: Warning: [yams 0.38] no targettype specified and there are several relation definitions for rtype allowed_transition: ['BaseTransition', 'Transition', 'WorkflowTransition']. Yet you get the first rdef.
rdef = eschema.rdef(rschema, role)

2016-03-15 11:35:18 - (py.warnings) WARNING: /var/lib/jenkins/jobs/cubicweb-3.23/workspace/TOXENV/py27-web/cubicweb/web/formfields.py:1201: Warning: [yams 0.38] no targettype specified and there are several relation definitions for rtype constrained_by: ['CWAttribute', 'CWRelation']. Yet you get the first rdef.
rdef = eschema.rdef(rschema, role)

..2016-03-15 11:35:56 - (cubicweb.appobject) ERROR: cycle in breadcrumbs for entity <Entity TreeNode 1475 [u'name', u'modification_date'] at 140552012546384>
2016-03-15 11:35:56 - (cubicweb.appobject) ERROR: cycle in breadcrumbs for entity <Entity TreeNode 1475 ['creation_date', 'cwuri', u'name', u'modification_date'] at 140552012546384>
2016-03-15 11:35:56 - (cubicweb.appobject) ERROR: cycle in breadcrumbs for entity <Entity TreeNode 1475 ['creation_date', 'cwuri', u'name', u'modification_date'] at 140552012546384>
2016-03-15 11:35:56 - (cubicweb.appobject) ERROR: cycle in breadcrumbs for entity <Entity TreeNode 1475 ['creation_date', 'cwuri', u'name', u'modification_date'] at 140552012546384>
2016-03-15 11:35:56 - (cubicweb.appobject) ERROR: cycle in breadcrumbs for entity <Entity TreeNode 1475 ['creation_date', 'cwuri', u'name', u'modification_date'] at 140552012546384>
2016-03-15 11:35:56 - (cubicweb.appobject) ERROR: cycle in breadcrumbs for entity <Entity TreeNode 1475 ['creation_date', 'cwuri', u'name', u'modification_date'] at 140552012546384>
2016-03-15 11:35:56 - (cubicweb.appobject) ERROR: cycle in breadcrumbs for entity <Entity TreeNode 1475 ['creation_date', 'cwuri', u'name', u'modification_date'] at 140552012546384>
2016-03-15 11:35:57 - (cubicweb.appobject) ERROR: cycle in breadcrumbs for entity <Entity TreeNode 1475 ['creation_date', 'cwuri', u'name', u'modification_date'] at 140552012546384>
2016-03-15 11:35:57 - (cubicweb.appobject) ERROR: cycle in breadcrumbs for entity <Entity TreeNode 1475 ['creation_date', 'cwuri', u'name', u'modification_date'] at 140552012546384>
.....
====================== unittest_views_csv.py =======================
..
================ unittest_views_basecontrollers.py =================
.................2016-03-15 11:36:56 - (py.warnings) WARNING: /var/lib/jenkins/jobs/cubicweb-3.23/workspace/TOXENV/py27-web/cubicweb/web/formfields.py:1201: Warning: [yams 0.38] no targettype specified and there are several relation definitions for rtype to_entity: ['CWRelation', 'CWAttribute']. Yet you get the first rdef.
rdef = eschema.rdef(rschema, role)

.....2016-03-15 11:37:00 - (py.warnings) WARNING: /var/lib/jenkins/jobs/cubicweb-3.23/workspace/TOXENV/py27-web/cubicweb/web/formfields.py:1201: Warning: [yams 0.38] no targettype specified and there are several relation definitions for rtype read_permission: ['CWGroup', 'RQLExpression']. Yet you get the first rdef.
rdef = eschema.rdef(rschema, role)

2016-03-15 11:37:00 - (cubicweb.session) WARNING: no schema for 7
2016-03-15 11:37:00 - (cubicweb.session) WARNING: no schema for 7
..2016-03-15 11:37:01 - (cubicweb.web) WARNING: param login-subject mis-formatted
....................................FF.....2016-03-15 11:37:26 - (py.warnings) WARNING: /var/lib/jenkins/jobs/cubicweb-3.23/workspace/TOXENV/py27-web/cubicweb/devtools/__init__.py:111: RuntimeWarning: anon323dcfe1dc3a4592931f62d2e92363bb Open session found while turning repository off
%sessionid, RuntimeWarning)

.
======================================================================
FAIL: test_http_error_codes_auth_fail (unittest_views_basecontrollers.LoginControllerHTTPTC)
----------------------------------------------------------------------
Traceback (most recent call last)
File "/var/lib/jenkins/jobs/cubicweb-3.23/workspace/TOXENV/py27-web/.tox/py27-web/local/lib/python2.7/site-packages/unittest2/case.py", line 67, in testPartExecutor
yield
File "/var/lib/jenkins/jobs/cubicweb-3.23/workspace/TOXENV/py27-web/.tox/py27-web/local/lib/python2.7/site-packages/unittest2/case.py", line 625, in run
testMethod()
File "/var/lib/jenkins/jobs/cubicweb-3.23/workspace/TOXENV/py27-web/cubicweb/web/test/unittest_views_basecontrollers.py", line 1097, in test_http_error_codes_auth_fail
self.assertEqual(response.status, 403)
File "/var/lib/jenkins/jobs/cubicweb-3.23/workspace/TOXENV/py27-web/.tox/py27-web/local/lib/python2.7/site-packages/unittest2/case.py", line 836, in assertEqual
assertion_func(first, second, msg=msg)
File "/var/lib/jenkins/jobs/cubicweb-3.23/workspace/TOXENV/py27-web/.tox/py27-web/local/lib/python2.7/site-packages/unittest2/case.py", line 829, in _baseAssertEqual
raise self.failureException(msg)
AssertionError: 500 != 403

no stdout
no stderr
======================================================================
FAIL: test_http_error_codes_auth_succeed (unittest_views_basecontrollers.LoginControllerHTTPTC)
----------------------------------------------------------------------
Traceback (most recent call last)
File "/var/lib/jenkins/jobs/cubicweb-3.23/workspace/TOXENV/py27-web/.tox/py27-web/local/lib/python2.7/site-packages/unittest2/case.py", line 67, in testPartExecutor
yield
File "/var/lib/jenkins/jobs/cubicweb-3.23/workspace/TOXENV/py27-web/.tox/py27-web/local/lib/python2.7/site-packages/unittest2/case.py", line 625, in run
testMethod()
File "/var/lib/jenkins/jobs/cubicweb-3.23/workspace/TOXENV/py27-web/cubicweb/web/test/unittest_views_basecontrollers.py", line 1102, in test_http_error_codes_auth_succeed
self.assertEqual(response.status, 303)
File "/var/lib/jenkins/jobs/cubicweb-3.23/workspace/TOXENV/py27-web/.tox/py27-web/local/lib/python2.7/site-packages/unittest2/case.py", line 836, in assertEqual
assertion_func(first, second, msg=msg)
File "/var/lib/jenkins/jobs/cubicweb-3.23/workspace/TOXENV/py27-web/.tox/py27-web/local/lib/python2.7/site-packages/unittest2/case.py", line 829, in _baseAssertEqual
raise self.failureException(msg)
AssertionError: 500 != 303

no stdout
no stderr
========================= unittest_form.py =========================
....2016-03-15 11:37:27 - (py.warnings) WARNING: /var/lib/jenkins/jobs/cubicweb-3.23/workspace/TOXENV/py27-web/cubicweb/web/formfields.py:1201: Warning: [yams 0.38] no targettype specified and there are several relation definitions for rtype tags: ['Tag', 'BlogEntry', 'CWUser']. Yet you get the first rdef.
rdef = eschema.rdef(rschema, role)

...........
-> creating tables
-> inserting default user and default groups.
-> storing the schema in the database
-> database for instance data initialized.
Building autopopulate for database tmpdb
*******************************************************************************
Ran 365 test cases in 258.03s (246.49s CPU), 2 failures, 1 skipped
38 modules OK (1 failed)
failures: /var/lib/jenkins/jobs/cubicweb-3.23/workspace/TOXENV/py27-web/cubicweb/web/test/unittest_views_basecontrollers [2/68]
ERROR: InvocationError: '/var/lib/jenkins/jobs/cubicweb-3.23/workspace/TOXENV/py27-web/.tox/py27-web/bin/python -c from logilab.common import pytest; pytest.run() -t /var/lib/jenkins/jobs/cubicweb-3.23/workspace/TOXENV/py27-web/cubicweb/web/test'
___________________________________ summary ____________________________________
ERROR: py27-web: commands failed
Build step 'Execute shell' marked build as failure
Sending e-mails to: dlaxalde@logilab.fr jcr@logilab.fr syt@logilab.fr david@logilab.fr
[PostBuildScript] - Execution post build scripts.
[py27-web] $ /bin/bash -xe /tmp/hudson7553027348592255597.sh
+ /var/lib/jenkins/scripts/notify_forge_apycot.py cwo cubicweb 2ce70e8f62b1 http://jenkins.logilab.fr/job/cubicweb-3.23/TOXENV=py27-web/64/ --status failure
<br/>

log from execution
download