consoleText

download

20 Started by upstream project "cubicweb-3.23" build number 64
originally caused by:
Started by an SCM change
Building in workspace /var/lib/jenkins/jobs/cubicweb-3.23/workspace/TOXENV/py34-hooks
[py34-hooks] $ hg showconfig paths.default
[py34-hooks] $ hg pull
pulling from http://hg.logilab.org/review/cubicweb
searching for changes
adding changesets
adding manifests
adding file changes
added 2 changesets with 3 changes to 3 files (+2 heads)
11 new obsolescence markers
updating bookmark cubicweb-3.23
(run 'hg heads .' to see heads, 'hg merge' to merge)
[py34-hooks] $ hg update --clean --rev 2ce70e8f62b1a604b88847f929cb7f489955f72a
3 files updated, 0 files merged, 0 files removed, 0 files unresolved
[py34-hooks] $ hg --config extensions.purge= clean --all
[py34-hooks] $ hg log --rev . --template {node}
[py34-hooks] $ hg log --rev . --template {rev}
[py34-hooks] $ hg id --branch
[py34-hooks] $ /bin/bash -xe /tmp/hudson2421806056482988266.sh
+ find . '(' -name 'pgdb*' -o -name 'tmpdb*' ')' -print0
+ xargs -0 rm -rf
[py34-hooks] $ /bin/bash -xe /tmp/hudson8770078654670640009.sh
+ PATH=/usr/lib/postgresql/9.4/bin:/usr/local/bin:/usr/bin:/bin:/usr/local/games:/usr/games
+ tox --recreate
py34-hooks create: /var/lib/jenkins/jobs/cubicweb-3.23/workspace/TOXENV/py34-hooks/.tox/py34-hooks
py34-hooks installdeps: -e., -r/var/lib/jenkins/jobs/cubicweb-3.23/workspace/TOXENV/py34-hooks/cubicweb/hooks/test/requirements.txt
py34-hooks develop-inst: /var/lib/jenkins/jobs/cubicweb-3.23/workspace/TOXENV/py34-hooks
py34-hooks installed: You are using pip version 7.1.2, however version 8.1.0 is available.,You should consider upgrading via the 'pip install --upgrade pip' command.,chardet==2.3.0,colorama==0.3.2,-e hg+http://hg.logilab.org/review/cubicweb@2ce70e8f62b1a604b88847f929cb7f489955f72a#egg=cubicweb-dev,cwclientlib==0.4.1,html2text==2016.1.8,html5lib==0.999,linecache2==1.0.0,logilab-common==1.2.0,logilab-constraint==0.6.0,logilab-database==1.15.0,logilab-mtconverter==0.9.0,lxml==3.5.0,Markdown==2.6.5,passlib==1.6.5,psycopg2==2.5.4,py==1.4.25,pyasn1==0.1.7,python-apt==0.9.3.12,python-dateutil==2.5.0,python3-ldap==0.9.4.2,pytz==2016.1,requests==2.4.3,rql==0.34.0,six==1.8.0,tox==1.9.2,traceback2==1.4.0,unattended-upgrades==0.1,unittest2==1.1.0,urllib3==1.9.1,virtualenv==1.11.6,wheel==0.24.0,yams==0.42.0,Yapps==2.2.0,Yapps2==2.2.0
py34-hooks runtests: PYTHONHASHSEED='4198651716'
py34-hooks runtests: commands[0] | /var/lib/jenkins/jobs/cubicweb-3.23/workspace/TOXENV/py34-hooks/.tox/py34-hooks/bin/python -c from logilab.common import pytest; pytest.run() -t /var/lib/jenkins/jobs/cubicweb-3.23/workspace/TOXENV/py34-hooks/cubicweb/hooks/test
======================== unittest_hooks.py =========================
2016-03-15 11:41:07 - (cubicweb.appobject) WARNING: can't find any workflow for CWUser
ESSSSSSSSESESSS
======================================================================
ERROR: test_html_tidy_hook (unittest_hooks.CoreHooksTC)
----------------------------------------------------------------------
Traceback (most recent call last)
File "/usr/lib/python3.4/unittest/case.py", line 58, in testPartExecutor
yield
File "/usr/lib/python3.4/unittest/case.py", line 573, in run
self.setUp()
File "/var/lib/jenkins/jobs/cubicweb-3.23/workspace/TOXENV/py34-hooks/cubicweb/devtools/testlib.py", line 448, in setUp
self._init_repo()
File "/var/lib/jenkins/jobs/cubicweb-3.23/workspace/TOXENV/py34-hooks/cubicweb/devtools/testlib.py", line 357, in _init_repo
db_handler.restore_database(self.test_db_id)
File "/var/lib/jenkins/jobs/cubicweb-3.23/workspace/TOXENV/py34-hooks/cubicweb/devtools/__init__.py", line 378, in restore_database
self._restore_database(backup_coordinates, config)
File "/var/lib/jenkins/jobs/cubicweb-3.23/workspace/TOXENV/py34-hooks/cubicweb/devtools/__init__.py", line 815, in _restore_database
self.get_repo()
File "/var/lib/jenkins/jobs/cubicweb-3.23/workspace/TOXENV/py34-hooks/cubicweb/devtools/__init__.py", line 393, in get_repo
self._repo = self._new_repo(self.config)
File "/var/lib/jenkins/jobs/cubicweb-3.23/workspace/TOXENV/py34-hooks/cubicweb/devtools/__init__.py", line 407, in _new_repo
repo = config.repository()
File "/var/lib/jenkins/jobs/cubicweb-3.23/workspace/TOXENV/py34-hooks/cubicweb/cwconfig.py", line 1030, in repository
return Repository(self, TasksManager(), vreg=vreg)
File "/var/lib/jenkins/jobs/cubicweb-3.23/workspace/TOXENV/py34-hooks/cubicweb/server/repository.py", line 186, in __init__
self.init_cnxset_pool()
File "/var/lib/jenkins/jobs/cubicweb-3.23/workspace/TOXENV/py34-hooks/cubicweb/server/repository.py", line 228, in init_cnxset_pool
self.set_schema(config.load_schema(expand_cubes=True))
File "/var/lib/jenkins/jobs/cubicweb-3.23/workspace/TOXENV/py34-hooks/cubicweb/server/repository.py", line 315, in set_schema
self.vreg.set_schema(schema)
File "/var/lib/jenkins/jobs/cubicweb-3.23/workspace/TOXENV/py34-hooks/cubicweb/cwvreg.py", line 424, in set_schema
self.reload(self.config.appobjects_path(), force_reload=False)
File "/var/lib/jenkins/jobs/cubicweb-3.23/workspace/TOXENV/py34-hooks/cubicweb/cwvreg.py", line 474, in reload
self.register_objects(path)
File "/var/lib/jenkins/jobs/cubicweb-3.23/workspace/TOXENV/py34-hooks/cubicweb/cwvreg.py", line 519, in register_objects
path, self.config.extrapath)
File "/var/lib/jenkins/jobs/cubicweb-3.23/workspace/TOXENV/py34-hooks/.tox/py34-hooks/lib/python3.4/site-packages/logilab/common/registry.py", line 681, in register_objects
self.load_file(filepath, modname)
File "/var/lib/jenkins/jobs/cubicweb-3.23/workspace/TOXENV/py34-hooks/cubicweb/cwvreg.py", line 484, in load_file
return super(CWRegistryStore, self).load_file(filepath, modname)
File "/var/lib/jenkins/jobs/cubicweb-3.23/workspace/TOXENV/py34-hooks/.tox/py34-hooks/lib/python3.4/site-packages/logilab/common/registry.py", line 738, in load_file
module = load_module_from_name(modname)
File "/var/lib/jenkins/jobs/cubicweb-3.23/workspace/TOXENV/py34-hooks/.tox/py34-hooks/lib/python3.4/site-packages/logilab/common/modutils.py", line 125, in load_module_from_name
return load_module_from_modpath(dotted_name.split('.'), path, use_sys)
File "/var/lib/jenkins/jobs/cubicweb-3.23/workspace/TOXENV/py34-hooks/.tox/py34-hooks/lib/python3.4/site-packages/logilab/common/modutils.py", line 169, in load_module_from_modpath
module = load_module(curname, mp_file, mp_filename, mp_desc)
File "/var/lib/jenkins/jobs/cubicweb-3.23/workspace/TOXENV/py34-hooks/.tox/py34-hooks/lib/python3.4/imp.py", line 235, in load_module
return load_source(name, filename, file)
File "/var/lib/jenkins/jobs/cubicweb-3.23/workspace/TOXENV/py34-hooks/.tox/py34-hooks/lib/python3.4/imp.py", line 171, in load_source
module = methods.load()
File "/var/lib/jenkins/jobs/cubicweb-3.23/workspace/TOXENV/py34-hooks/cubicweb/hooks/test/<frozen importlib._bootstrap>", line 1220, in load
<no source available>
File "/var/lib/jenkins/jobs/cubicweb-3.23/workspace/TOXENV/py34-hooks/cubicweb/hooks/test/<frozen importlib._bootstrap>", line 1200, in _load_unlocked
<no source available>
File "/var/lib/jenkins/jobs/cubicweb-3.23/workspace/TOXENV/py34-hooks/cubicweb/hooks/test/<frozen importlib._bootstrap>", line 1129, in _exec
<no source available>
File "/var/lib/jenkins/jobs/cubicweb-3.23/workspace/TOXENV/py34-hooks/cubicweb/hooks/test/<frozen importlib._bootstrap>", line 1471, in exec_module
<no source available>
File "/var/lib/jenkins/jobs/cubicweb-3.23/workspace/TOXENV/py34-hooks/cubicweb/hooks/test/<frozen importlib._bootstrap>", line 321, in _call_with_frames_removed
<no source available>
File "/var/lib/jenkins/jobs/cubicweb-3.23/workspace/TOXENV/py34-hooks/cubicweb/web/views/ajaxcontroller.py", line 82, in <module>
from cubicweb.web.views import basecontrollers
File "/var/lib/jenkins/jobs/cubicweb-3.23/workspace/TOXENV/py34-hooks/cubicweb/web/views/basecontrollers.py", line 26, in <module>
import httplib
ImportError: No module named 'httplib'

no stdout
no stderr
======================================================================
ERROR: test_duplicate_etype_error (unittest_hooks.SchemaHooksTC)
----------------------------------------------------------------------
Traceback (most recent call last)
File "/usr/lib/python3.4/unittest/case.py", line 58, in testPartExecutor
yield
File "/usr/lib/python3.4/unittest/case.py", line 573, in run
self.setUp()
File "/var/lib/jenkins/jobs/cubicweb-3.23/workspace/TOXENV/py34-hooks/cubicweb/devtools/testlib.py", line 448, in setUp
self._init_repo()
File "/var/lib/jenkins/jobs/cubicweb-3.23/workspace/TOXENV/py34-hooks/cubicweb/devtools/testlib.py", line 357, in _init_repo
db_handler.restore_database(self.test_db_id)
File "/var/lib/jenkins/jobs/cubicweb-3.23/workspace/TOXENV/py34-hooks/cubicweb/devtools/__init__.py", line 378, in restore_database
self._restore_database(backup_coordinates, config)
File "/var/lib/jenkins/jobs/cubicweb-3.23/workspace/TOXENV/py34-hooks/cubicweb/devtools/__init__.py", line 815, in _restore_database
self.get_repo()
File "/var/lib/jenkins/jobs/cubicweb-3.23/workspace/TOXENV/py34-hooks/cubicweb/devtools/__init__.py", line 393, in get_repo
self._repo = self._new_repo(self.config)
File "/var/lib/jenkins/jobs/cubicweb-3.23/workspace/TOXENV/py34-hooks/cubicweb/devtools/__init__.py", line 407, in _new_repo
repo = config.repository()
File "/var/lib/jenkins/jobs/cubicweb-3.23/workspace/TOXENV/py34-hooks/cubicweb/cwconfig.py", line 1030, in repository
return Repository(self, TasksManager(), vreg=vreg)
File "/var/lib/jenkins/jobs/cubicweb-3.23/workspace/TOXENV/py34-hooks/cubicweb/server/repository.py", line 186, in __init__
self.init_cnxset_pool()
File "/var/lib/jenkins/jobs/cubicweb-3.23/workspace/TOXENV/py34-hooks/cubicweb/server/repository.py", line 228, in init_cnxset_pool
self.set_schema(config.load_schema(expand_cubes=True))
File "/var/lib/jenkins/jobs/cubicweb-3.23/workspace/TOXENV/py34-hooks/cubicweb/server/repository.py", line 315, in set_schema
self.vreg.set_schema(schema)
File "/var/lib/jenkins/jobs/cubicweb-3.23/workspace/TOXENV/py34-hooks/cubicweb/cwvreg.py", line 424, in set_schema
self.reload(self.config.appobjects_path(), force_reload=False)
File "/var/lib/jenkins/jobs/cubicweb-3.23/workspace/TOXENV/py34-hooks/cubicweb/cwvreg.py", line 474, in reload
self.register_objects(path)
File "/var/lib/jenkins/jobs/cubicweb-3.23/workspace/TOXENV/py34-hooks/cubicweb/cwvreg.py", line 519, in register_objects
path, self.config.extrapath)
File "/var/lib/jenkins/jobs/cubicweb-3.23/workspace/TOXENV/py34-hooks/.tox/py34-hooks/lib/python3.4/site-packages/logilab/common/registry.py", line 681, in register_objects
self.load_file(filepath, modname)
File "/var/lib/jenkins/jobs/cubicweb-3.23/workspace/TOXENV/py34-hooks/cubicweb/cwvreg.py", line 484, in load_file
return super(CWRegistryStore, self).load_file(filepath, modname)
File "/var/lib/jenkins/jobs/cubicweb-3.23/workspace/TOXENV/py34-hooks/.tox/py34-hooks/lib/python3.4/site-packages/logilab/common/registry.py", line 738, in load_file
module = load_module_from_name(modname)
File "/var/lib/jenkins/jobs/cubicweb-3.23/workspace/TOXENV/py34-hooks/.tox/py34-hooks/lib/python3.4/site-packages/logilab/common/modutils.py", line 125, in load_module_from_name
return load_module_from_modpath(dotted_name.split('.'), path, use_sys)
File "/var/lib/jenkins/jobs/cubicweb-3.23/workspace/TOXENV/py34-hooks/.tox/py34-hooks/lib/python3.4/site-packages/logilab/common/modutils.py", line 169, in load_module_from_modpath
module = load_module(curname, mp_file, mp_filename, mp_desc)
File "/var/lib/jenkins/jobs/cubicweb-3.23/workspace/TOXENV/py34-hooks/.tox/py34-hooks/lib/python3.4/imp.py", line 235, in load_module
return load_source(name, filename, file)
File "/var/lib/jenkins/jobs/cubicweb-3.23/workspace/TOXENV/py34-hooks/.tox/py34-hooks/lib/python3.4/imp.py", line 171, in load_source
module = methods.load()
File "/var/lib/jenkins/jobs/cubicweb-3.23/workspace/TOXENV/py34-hooks/cubicweb/hooks/test/<frozen importlib._bootstrap>", line 1220, in load
<no source available>
File "/var/lib/jenkins/jobs/cubicweb-3.23/workspace/TOXENV/py34-hooks/cubicweb/hooks/test/<frozen importlib._bootstrap>", line 1200, in _load_unlocked
<no source available>
File "/var/lib/jenkins/jobs/cubicweb-3.23/workspace/TOXENV/py34-hooks/cubicweb/hooks/test/<frozen importlib._bootstrap>", line 1129, in _exec
<no source available>
File "/var/lib/jenkins/jobs/cubicweb-3.23/workspace/TOXENV/py34-hooks/cubicweb/hooks/test/<frozen importlib._bootstrap>", line 1471, in exec_module
<no source available>
File "/var/lib/jenkins/jobs/cubicweb-3.23/workspace/TOXENV/py34-hooks/cubicweb/hooks/test/<frozen importlib._bootstrap>", line 321, in _call_with_frames_removed
<no source available>
File "/var/lib/jenkins/jobs/cubicweb-3.23/workspace/TOXENV/py34-hooks/cubicweb/web/views/ajaxcontroller.py", line 82, in <module>
from cubicweb.web.views import basecontrollers
File "/var/lib/jenkins/jobs/cubicweb-3.23/workspace/TOXENV/py34-hooks/cubicweb/web/views/basecontrollers.py", line 26, in <module>
import httplib
ImportError: No module named 'httplib'

no stdout
no stderr
======================================================================
ERROR: test_no_created_by_on_deleted_entity (unittest_hooks.UserGroupHooksTC)
----------------------------------------------------------------------
Traceback (most recent call last)
File "/usr/lib/python3.4/unittest/case.py", line 58, in testPartExecutor
yield
File "/usr/lib/python3.4/unittest/case.py", line 573, in run
self.setUp()
File "/var/lib/jenkins/jobs/cubicweb-3.23/workspace/TOXENV/py34-hooks/cubicweb/devtools/testlib.py", line 448, in setUp
self._init_repo()
File "/var/lib/jenkins/jobs/cubicweb-3.23/workspace/TOXENV/py34-hooks/cubicweb/devtools/testlib.py", line 357, in _init_repo
db_handler.restore_database(self.test_db_id)
File "/var/lib/jenkins/jobs/cubicweb-3.23/workspace/TOXENV/py34-hooks/cubicweb/devtools/__init__.py", line 378, in restore_database
self._restore_database(backup_coordinates, config)
File "/var/lib/jenkins/jobs/cubicweb-3.23/workspace/TOXENV/py34-hooks/cubicweb/devtools/__init__.py", line 815, in _restore_database
self.get_repo()
File "/var/lib/jenkins/jobs/cubicweb-3.23/workspace/TOXENV/py34-hooks/cubicweb/devtools/__init__.py", line 393, in get_repo
self._repo = self._new_repo(self.config)
File "/var/lib/jenkins/jobs/cubicweb-3.23/workspace/TOXENV/py34-hooks/cubicweb/devtools/__init__.py", line 407, in _new_repo
repo = config.repository()
File "/var/lib/jenkins/jobs/cubicweb-3.23/workspace/TOXENV/py34-hooks/cubicweb/cwconfig.py", line 1030, in repository
return Repository(self, TasksManager(), vreg=vreg)
File "/var/lib/jenkins/jobs/cubicweb-3.23/workspace/TOXENV/py34-hooks/cubicweb/server/repository.py", line 186, in __init__
self.init_cnxset_pool()
File "/var/lib/jenkins/jobs/cubicweb-3.23/workspace/TOXENV/py34-hooks/cubicweb/server/repository.py", line 228, in init_cnxset_pool
self.set_schema(config.load_schema(expand_cubes=True))
File "/var/lib/jenkins/jobs/cubicweb-3.23/workspace/TOXENV/py34-hooks/cubicweb/server/repository.py", line 315, in set_schema
self.vreg.set_schema(schema)
File "/var/lib/jenkins/jobs/cubicweb-3.23/workspace/TOXENV/py34-hooks/cubicweb/cwvreg.py", line 424, in set_schema
self.reload(self.config.appobjects_path(), force_reload=False)
File "/var/lib/jenkins/jobs/cubicweb-3.23/workspace/TOXENV/py34-hooks/cubicweb/cwvreg.py", line 474, in reload
self.register_objects(path)
File "/var/lib/jenkins/jobs/cubicweb-3.23/workspace/TOXENV/py34-hooks/cubicweb/cwvreg.py", line 519, in register_objects
path, self.config.extrapath)
File "/var/lib/jenkins/jobs/cubicweb-3.23/workspace/TOXENV/py34-hooks/.tox/py34-hooks/lib/python3.4/site-packages/logilab/common/registry.py", line 681, in register_objects
self.load_file(filepath, modname)
File "/var/lib/jenkins/jobs/cubicweb-3.23/workspace/TOXENV/py34-hooks/cubicweb/cwvreg.py", line 484, in load_file
return super(CWRegistryStore, self).load_file(filepath, modname)
File "/var/lib/jenkins/jobs/cubicweb-3.23/workspace/TOXENV/py34-hooks/.tox/py34-hooks/lib/python3.4/site-packages/logilab/common/registry.py", line 738, in load_file
module = load_module_from_name(modname)
File "/var/lib/jenkins/jobs/cubicweb-3.23/workspace/TOXENV/py34-hooks/.tox/py34-hooks/lib/python3.4/site-packages/logilab/common/modutils.py", line 125, in load_module_from_name
return load_module_from_modpath(dotted_name.split('.'), path, use_sys)
File "/var/lib/jenkins/jobs/cubicweb-3.23/workspace/TOXENV/py34-hooks/.tox/py34-hooks/lib/python3.4/site-packages/logilab/common/modutils.py", line 169, in load_module_from_modpath
module = load_module(curname, mp_file, mp_filename, mp_desc)
File "/var/lib/jenkins/jobs/cubicweb-3.23/workspace/TOXENV/py34-hooks/.tox/py34-hooks/lib/python3.4/imp.py", line 235, in load_module
return load_source(name, filename, file)
File "/var/lib/jenkins/jobs/cubicweb-3.23/workspace/TOXENV/py34-hooks/.tox/py34-hooks/lib/python3.4/imp.py", line 171, in load_source
module = methods.load()
File "/var/lib/jenkins/jobs/cubicweb-3.23/workspace/TOXENV/py34-hooks/cubicweb/hooks/test/<frozen importlib._bootstrap>", line 1220, in load
<no source available>
File "/var/lib/jenkins/jobs/cubicweb-3.23/workspace/TOXENV/py34-hooks/cubicweb/hooks/test/<frozen importlib._bootstrap>", line 1200, in _load_unlocked
<no source available>
File "/var/lib/jenkins/jobs/cubicweb-3.23/workspace/TOXENV/py34-hooks/cubicweb/hooks/test/<frozen importlib._bootstrap>", line 1129, in _exec
<no source available>
File "/var/lib/jenkins/jobs/cubicweb-3.23/workspace/TOXENV/py34-hooks/cubicweb/hooks/test/<frozen importlib._bootstrap>", line 1471, in exec_module
<no source available>
File "/var/lib/jenkins/jobs/cubicweb-3.23/workspace/TOXENV/py34-hooks/cubicweb/hooks/test/<frozen importlib._bootstrap>", line 321, in _call_with_frames_removed
<no source available>
File "/var/lib/jenkins/jobs/cubicweb-3.23/workspace/TOXENV/py34-hooks/cubicweb/web/views/ajaxcontroller.py", line 82, in <module>
from cubicweb.web.views import basecontrollers
File "/var/lib/jenkins/jobs/cubicweb-3.23/workspace/TOXENV/py34-hooks/cubicweb/web/views/basecontrollers.py", line 26, in <module>
import httplib
ImportError: No module named 'httplib'

no stdout
no stderr
======================================================================
SKIPPED: test_inlined (unittest_hooks.CoreHooksTC)
repository is not initialised: ImportError("No module named 'httplib'",)
======================================================================
SKIPPED: test_metadata_created_by (unittest_hooks.CoreHooksTC)
repository is not initialised: ImportError("No module named 'httplib'",)
======================================================================
SKIPPED: test_metadata_creation_modification_date (unittest_hooks.CoreHooksTC)
repository is not initialised: ImportError("No module named 'httplib'",)
======================================================================
SKIPPED: test_metadata_cwuri (unittest_hooks.CoreHooksTC)
repository is not initialised: ImportError("No module named 'httplib'",)
======================================================================
SKIPPED: test_metadata_owned_by (unittest_hooks.CoreHooksTC)
repository is not initialised: ImportError("No module named 'httplib'",)
======================================================================
SKIPPED: test_nonregr_html_tidy_hook_no_update (unittest_hooks.CoreHooksTC)
repository is not initialised: ImportError("No module named 'httplib'",)
======================================================================
SKIPPED: test_symmetric (unittest_hooks.CoreHooksTC)
repository is not initialised: ImportError("No module named 'httplib'",)
======================================================================
SKIPPED: test_user_login_stripped (unittest_hooks.CoreHooksTC)
repository is not initialised: ImportError("No module named 'httplib'",)
======================================================================
SKIPPED: test_validation_unique_constraint (unittest_hooks.SchemaHooksTC)
repository is not initialised: ImportError("No module named 'httplib'",)
======================================================================
SKIPPED: test_user_composite_no_owner_on_deleted_entity (unittest_hooks.UserGroupHooksTC)
repository is not initialised: ImportError("No module named 'httplib'",)
======================================================================
SKIPPED: test_user_composite_owner (unittest_hooks.UserGroupHooksTC)
repository is not initialised: ImportError("No module named 'httplib'",)
======================================================================
SKIPPED: test_user_group_synchronization (unittest_hooks.UserGroupHooksTC)
repository is not initialised: ImportError("No module named 'httplib'",)
======================= unittest_security.py =======================
E
======================================================================
ERROR: test_inlined_cw_edited_relation (unittest_security.SecurityHooksTC)
modification of cw_edited to add an inlined relation shouldn't trigger a security error.
----------------------------------------------------------------------
Traceback (most recent call last)
File "/usr/lib/python3.4/unittest/case.py", line 58, in testPartExecutor
yield
File "/usr/lib/python3.4/unittest/case.py", line 573, in run
self.setUp()
File "/var/lib/jenkins/jobs/cubicweb-3.23/workspace/TOXENV/py34-hooks/cubicweb/devtools/testlib.py", line 448, in setUp
self._init_repo()
File "/var/lib/jenkins/jobs/cubicweb-3.23/workspace/TOXENV/py34-hooks/cubicweb/devtools/testlib.py", line 357, in _init_repo
db_handler.restore_database(self.test_db_id)
File "/var/lib/jenkins/jobs/cubicweb-3.23/workspace/TOXENV/py34-hooks/cubicweb/devtools/__init__.py", line 378, in restore_database
self._restore_database(backup_coordinates, config)
File "/var/lib/jenkins/jobs/cubicweb-3.23/workspace/TOXENV/py34-hooks/cubicweb/devtools/__init__.py", line 815, in _restore_database
self.get_repo()
File "/var/lib/jenkins/jobs/cubicweb-3.23/workspace/TOXENV/py34-hooks/cubicweb/devtools/__init__.py", line 393, in get_repo
self._repo = self._new_repo(self.config)
File "/var/lib/jenkins/jobs/cubicweb-3.23/workspace/TOXENV/py34-hooks/cubicweb/devtools/__init__.py", line 407, in _new_repo
repo = config.repository()
File "/var/lib/jenkins/jobs/cubicweb-3.23/workspace/TOXENV/py34-hooks/cubicweb/cwconfig.py", line 1030, in repository
return Repository(self, TasksManager(), vreg=vreg)
File "/var/lib/jenkins/jobs/cubicweb-3.23/workspace/TOXENV/py34-hooks/cubicweb/server/repository.py", line 186, in __init__
self.init_cnxset_pool()
File "/var/lib/jenkins/jobs/cubicweb-3.23/workspace/TOXENV/py34-hooks/cubicweb/server/repository.py", line 228, in init_cnxset_pool
self.set_schema(config.load_schema(expand_cubes=True))
File "/var/lib/jenkins/jobs/cubicweb-3.23/workspace/TOXENV/py34-hooks/cubicweb/server/repository.py", line 315, in set_schema
self.vreg.set_schema(schema)
File "/var/lib/jenkins/jobs/cubicweb-3.23/workspace/TOXENV/py34-hooks/cubicweb/cwvreg.py", line 424, in set_schema
self.reload(self.config.appobjects_path(), force_reload=False)
File "/var/lib/jenkins/jobs/cubicweb-3.23/workspace/TOXENV/py34-hooks/cubicweb/cwvreg.py", line 474, in reload
self.register_objects(path)
File "/var/lib/jenkins/jobs/cubicweb-3.23/workspace/TOXENV/py34-hooks/cubicweb/cwvreg.py", line 519, in register_objects
path, self.config.extrapath)
File "/var/lib/jenkins/jobs/cubicweb-3.23/workspace/TOXENV/py34-hooks/.tox/py34-hooks/lib/python3.4/site-packages/logilab/common/registry.py", line 681, in register_objects
self.load_file(filepath, modname)
File "/var/lib/jenkins/jobs/cubicweb-3.23/workspace/TOXENV/py34-hooks/cubicweb/cwvreg.py", line 484, in load_file
return super(CWRegistryStore, self).load_file(filepath, modname)
File "/var/lib/jenkins/jobs/cubicweb-3.23/workspace/TOXENV/py34-hooks/.tox/py34-hooks/lib/python3.4/site-packages/logilab/common/registry.py", line 738, in load_file
module = load_module_from_name(modname)
File "/var/lib/jenkins/jobs/cubicweb-3.23/workspace/TOXENV/py34-hooks/.tox/py34-hooks/lib/python3.4/site-packages/logilab/common/modutils.py", line 125, in load_module_from_name
return load_module_from_modpath(dotted_name.split('.'), path, use_sys)
File "/var/lib/jenkins/jobs/cubicweb-3.23/workspace/TOXENV/py34-hooks/.tox/py34-hooks/lib/python3.4/site-packages/logilab/common/modutils.py", line 169, in load_module_from_modpath
module = load_module(curname, mp_file, mp_filename, mp_desc)
File "/var/lib/jenkins/jobs/cubicweb-3.23/workspace/TOXENV/py34-hooks/.tox/py34-hooks/lib/python3.4/imp.py", line 235, in load_module
return load_source(name, filename, file)
File "/var/lib/jenkins/jobs/cubicweb-3.23/workspace/TOXENV/py34-hooks/.tox/py34-hooks/lib/python3.4/imp.py", line 171, in load_source
module = methods.load()
File "/var/lib/jenkins/jobs/cubicweb-3.23/workspace/TOXENV/py34-hooks/cubicweb/hooks/test/<frozen importlib._bootstrap>", line 1220, in load
<no source available>
File "/var/lib/jenkins/jobs/cubicweb-3.23/workspace/TOXENV/py34-hooks/cubicweb/hooks/test/<frozen importlib._bootstrap>", line 1200, in _load_unlocked
<no source available>
File "/var/lib/jenkins/jobs/cubicweb-3.23/workspace/TOXENV/py34-hooks/cubicweb/hooks/test/<frozen importlib._bootstrap>", line 1129, in _exec
<no source available>
File "/var/lib/jenkins/jobs/cubicweb-3.23/workspace/TOXENV/py34-hooks/cubicweb/hooks/test/<frozen importlib._bootstrap>", line 1471, in exec_module
<no source available>
File "/var/lib/jenkins/jobs/cubicweb-3.23/workspace/TOXENV/py34-hooks/cubicweb/hooks/test/<frozen importlib._bootstrap>", line 321, in _call_with_frames_removed
<no source available>
File "/var/lib/jenkins/jobs/cubicweb-3.23/workspace/TOXENV/py34-hooks/cubicweb/web/views/ajaxcontroller.py", line 82, in <module>
from cubicweb.web.views import basecontrollers
File "/var/lib/jenkins/jobs/cubicweb-3.23/workspace/TOXENV/py34-hooks/cubicweb/web/views/basecontrollers.py", line 26, in <module>
import httplib
ImportError: No module named 'httplib'

no stdout
no stderr
====================== unittest_bookmarks.py =======================
E
======================================================================
ERROR: test_auto_delete_bookmarks (unittest_bookmarks.BookmarkHooksTC)
----------------------------------------------------------------------
Traceback (most recent call last)
File "/usr/lib/python3.4/unittest/case.py", line 58, in testPartExecutor
yield
File "/usr/lib/python3.4/unittest/case.py", line 573, in run
self.setUp()
File "/var/lib/jenkins/jobs/cubicweb-3.23/workspace/TOXENV/py34-hooks/cubicweb/devtools/testlib.py", line 448, in setUp
self._init_repo()
File "/var/lib/jenkins/jobs/cubicweb-3.23/workspace/TOXENV/py34-hooks/cubicweb/devtools/testlib.py", line 357, in _init_repo
db_handler.restore_database(self.test_db_id)
File "/var/lib/jenkins/jobs/cubicweb-3.23/workspace/TOXENV/py34-hooks/cubicweb/devtools/__init__.py", line 378, in restore_database
self._restore_database(backup_coordinates, config)
File "/var/lib/jenkins/jobs/cubicweb-3.23/workspace/TOXENV/py34-hooks/cubicweb/devtools/__init__.py", line 815, in _restore_database
self.get_repo()
File "/var/lib/jenkins/jobs/cubicweb-3.23/workspace/TOXENV/py34-hooks/cubicweb/devtools/__init__.py", line 393, in get_repo
self._repo = self._new_repo(self.config)
File "/var/lib/jenkins/jobs/cubicweb-3.23/workspace/TOXENV/py34-hooks/cubicweb/devtools/__init__.py", line 407, in _new_repo
repo = config.repository()
File "/var/lib/jenkins/jobs/cubicweb-3.23/workspace/TOXENV/py34-hooks/cubicweb/cwconfig.py", line 1030, in repository
return Repository(self, TasksManager(), vreg=vreg)
File "/var/lib/jenkins/jobs/cubicweb-3.23/workspace/TOXENV/py34-hooks/cubicweb/server/repository.py", line 186, in __init__
self.init_cnxset_pool()
File "/var/lib/jenkins/jobs/cubicweb-3.23/workspace/TOXENV/py34-hooks/cubicweb/server/repository.py", line 228, in init_cnxset_pool
self.set_schema(config.load_schema(expand_cubes=True))
File "/var/lib/jenkins/jobs/cubicweb-3.23/workspace/TOXENV/py34-hooks/cubicweb/server/repository.py", line 315, in set_schema
self.vreg.set_schema(schema)
File "/var/lib/jenkins/jobs/cubicweb-3.23/workspace/TOXENV/py34-hooks/cubicweb/cwvreg.py", line 424, in set_schema
self.reload(self.config.appobjects_path(), force_reload=False)
File "/var/lib/jenkins/jobs/cubicweb-3.23/workspace/TOXENV/py34-hooks/cubicweb/cwvreg.py", line 474, in reload
self.register_objects(path)
File "/var/lib/jenkins/jobs/cubicweb-3.23/workspace/TOXENV/py34-hooks/cubicweb/cwvreg.py", line 519, in register_objects
path, self.config.extrapath)
File "/var/lib/jenkins/jobs/cubicweb-3.23/workspace/TOXENV/py34-hooks/.tox/py34-hooks/lib/python3.4/site-packages/logilab/common/registry.py", line 681, in register_objects
self.load_file(filepath, modname)
File "/var/lib/jenkins/jobs/cubicweb-3.23/workspace/TOXENV/py34-hooks/cubicweb/cwvreg.py", line 484, in load_file
return super(CWRegistryStore, self).load_file(filepath, modname)
File "/var/lib/jenkins/jobs/cubicweb-3.23/workspace/TOXENV/py34-hooks/.tox/py34-hooks/lib/python3.4/site-packages/logilab/common/registry.py", line 738, in load_file
module = load_module_from_name(modname)
File "/var/lib/jenkins/jobs/cubicweb-3.23/workspace/TOXENV/py34-hooks/.tox/py34-hooks/lib/python3.4/site-packages/logilab/common/modutils.py", line 125, in load_module_from_name
return load_module_from_modpath(dotted_name.split('.'), path, use_sys)
File "/var/lib/jenkins/jobs/cubicweb-3.23/workspace/TOXENV/py34-hooks/.tox/py34-hooks/lib/python3.4/site-packages/logilab/common/modutils.py", line 169, in load_module_from_modpath
module = load_module(curname, mp_file, mp_filename, mp_desc)
File "/var/lib/jenkins/jobs/cubicweb-3.23/workspace/TOXENV/py34-hooks/.tox/py34-hooks/lib/python3.4/imp.py", line 235, in load_module
return load_source(name, filename, file)
File "/var/lib/jenkins/jobs/cubicweb-3.23/workspace/TOXENV/py34-hooks/.tox/py34-hooks/lib/python3.4/imp.py", line 171, in load_source
module = methods.load()
File "/var/lib/jenkins/jobs/cubicweb-3.23/workspace/TOXENV/py34-hooks/cubicweb/hooks/test/<frozen importlib._bootstrap>", line 1220, in load
<no source available>
File "/var/lib/jenkins/jobs/cubicweb-3.23/workspace/TOXENV/py34-hooks/cubicweb/hooks/test/<frozen importlib._bootstrap>", line 1200, in _load_unlocked
<no source available>
File "/var/lib/jenkins/jobs/cubicweb-3.23/workspace/TOXENV/py34-hooks/cubicweb/hooks/test/<frozen importlib._bootstrap>", line 1129, in _exec
<no source available>
File "/var/lib/jenkins/jobs/cubicweb-3.23/workspace/TOXENV/py34-hooks/cubicweb/hooks/test/<frozen importlib._bootstrap>", line 1471, in exec_module
<no source available>
File "/var/lib/jenkins/jobs/cubicweb-3.23/workspace/TOXENV/py34-hooks/cubicweb/hooks/test/<frozen importlib._bootstrap>", line 321, in _call_with_frames_removed
<no source available>
File "/var/lib/jenkins/jobs/cubicweb-3.23/workspace/TOXENV/py34-hooks/cubicweb/web/views/ajaxcontroller.py", line 82, in <module>
from cubicweb.web.views import basecontrollers
File "/var/lib/jenkins/jobs/cubicweb-3.23/workspace/TOXENV/py34-hooks/cubicweb/web/views/basecontrollers.py", line 26, in <module>
import httplib
ImportError: No module named 'httplib'

no stdout
no stderr
===================== unittest_syncsession.py ======================
ESSSS
======================================================================
ERROR: test_bad_type_cwproperty (unittest_syncsession.CWPropertyHooksTC)
----------------------------------------------------------------------
Traceback (most recent call last)
File "/usr/lib/python3.4/unittest/case.py", line 58, in testPartExecutor
yield
File "/usr/lib/python3.4/unittest/case.py", line 573, in run
self.setUp()
File "/var/lib/jenkins/jobs/cubicweb-3.23/workspace/TOXENV/py34-hooks/cubicweb/devtools/testlib.py", line 448, in setUp
self._init_repo()
File "/var/lib/jenkins/jobs/cubicweb-3.23/workspace/TOXENV/py34-hooks/cubicweb/devtools/testlib.py", line 357, in _init_repo
db_handler.restore_database(self.test_db_id)
File "/var/lib/jenkins/jobs/cubicweb-3.23/workspace/TOXENV/py34-hooks/cubicweb/devtools/__init__.py", line 378, in restore_database
self._restore_database(backup_coordinates, config)
File "/var/lib/jenkins/jobs/cubicweb-3.23/workspace/TOXENV/py34-hooks/cubicweb/devtools/__init__.py", line 815, in _restore_database
self.get_repo()
File "/var/lib/jenkins/jobs/cubicweb-3.23/workspace/TOXENV/py34-hooks/cubicweb/devtools/__init__.py", line 393, in get_repo
self._repo = self._new_repo(self.config)
File "/var/lib/jenkins/jobs/cubicweb-3.23/workspace/TOXENV/py34-hooks/cubicweb/devtools/__init__.py", line 407, in _new_repo
repo = config.repository()
File "/var/lib/jenkins/jobs/cubicweb-3.23/workspace/TOXENV/py34-hooks/cubicweb/cwconfig.py", line 1030, in repository
return Repository(self, TasksManager(), vreg=vreg)
File "/var/lib/jenkins/jobs/cubicweb-3.23/workspace/TOXENV/py34-hooks/cubicweb/server/repository.py", line 186, in __init__
self.init_cnxset_pool()
File "/var/lib/jenkins/jobs/cubicweb-3.23/workspace/TOXENV/py34-hooks/cubicweb/server/repository.py", line 228, in init_cnxset_pool
self.set_schema(config.load_schema(expand_cubes=True))
File "/var/lib/jenkins/jobs/cubicweb-3.23/workspace/TOXENV/py34-hooks/cubicweb/server/repository.py", line 315, in set_schema
self.vreg.set_schema(schema)
File "/var/lib/jenkins/jobs/cubicweb-3.23/workspace/TOXENV/py34-hooks/cubicweb/cwvreg.py", line 424, in set_schema
self.reload(self.config.appobjects_path(), force_reload=False)
File "/var/lib/jenkins/jobs/cubicweb-3.23/workspace/TOXENV/py34-hooks/cubicweb/cwvreg.py", line 474, in reload
self.register_objects(path)
File "/var/lib/jenkins/jobs/cubicweb-3.23/workspace/TOXENV/py34-hooks/cubicweb/cwvreg.py", line 519, in register_objects
path, self.config.extrapath)
File "/var/lib/jenkins/jobs/cubicweb-3.23/workspace/TOXENV/py34-hooks/.tox/py34-hooks/lib/python3.4/site-packages/logilab/common/registry.py", line 681, in register_objects
self.load_file(filepath, modname)
File "/var/lib/jenkins/jobs/cubicweb-3.23/workspace/TOXENV/py34-hooks/cubicweb/cwvreg.py", line 484, in load_file
return super(CWRegistryStore, self).load_file(filepath, modname)
File "/var/lib/jenkins/jobs/cubicweb-3.23/workspace/TOXENV/py34-hooks/.tox/py34-hooks/lib/python3.4/site-packages/logilab/common/registry.py", line 738, in load_file
module = load_module_from_name(modname)
File "/var/lib/jenkins/jobs/cubicweb-3.23/workspace/TOXENV/py34-hooks/.tox/py34-hooks/lib/python3.4/site-packages/logilab/common/modutils.py", line 125, in load_module_from_name
return load_module_from_modpath(dotted_name.split('.'), path, use_sys)
File "/var/lib/jenkins/jobs/cubicweb-3.23/workspace/TOXENV/py34-hooks/.tox/py34-hooks/lib/python3.4/site-packages/logilab/common/modutils.py", line 169, in load_module_from_modpath
module = load_module(curname, mp_file, mp_filename, mp_desc)
File "/var/lib/jenkins/jobs/cubicweb-3.23/workspace/TOXENV/py34-hooks/.tox/py34-hooks/lib/python3.4/imp.py", line 235, in load_module
return load_source(name, filename, file)
File "/var/lib/jenkins/jobs/cubicweb-3.23/workspace/TOXENV/py34-hooks/.tox/py34-hooks/lib/python3.4/imp.py", line 171, in load_source
module = methods.load()
File "/var/lib/jenkins/jobs/cubicweb-3.23/workspace/TOXENV/py34-hooks/cubicweb/hooks/test/<frozen importlib._bootstrap>", line 1220, in load
<no source available>
File "/var/lib/jenkins/jobs/cubicweb-3.23/workspace/TOXENV/py34-hooks/cubicweb/hooks/test/<frozen importlib._bootstrap>", line 1200, in _load_unlocked
<no source available>
File "/var/lib/jenkins/jobs/cubicweb-3.23/workspace/TOXENV/py34-hooks/cubicweb/hooks/test/<frozen importlib._bootstrap>", line 1129, in _exec
<no source available>
File "/var/lib/jenkins/jobs/cubicweb-3.23/workspace/TOXENV/py34-hooks/cubicweb/hooks/test/<frozen importlib._bootstrap>", line 1471, in exec_module
<no source available>
File "/var/lib/jenkins/jobs/cubicweb-3.23/workspace/TOXENV/py34-hooks/cubicweb/hooks/test/<frozen importlib._bootstrap>", line 321, in _call_with_frames_removed
<no source available>
File "/var/lib/jenkins/jobs/cubicweb-3.23/workspace/TOXENV/py34-hooks/cubicweb/web/views/ajaxcontroller.py", line 82, in <module>
from cubicweb.web.views import basecontrollers
File "/var/lib/jenkins/jobs/cubicweb-3.23/workspace/TOXENV/py34-hooks/cubicweb/web/views/basecontrollers.py", line 26, in <module>
import httplib
ImportError: No module named 'httplib'

no stdout
no stderr
======================================================================
SKIPPED: test_site_wide_cwproperty (unittest_syncsession.CWPropertyHooksTC)
repository is not initialised: ImportError("No module named 'httplib'",)
======================================================================
SKIPPED: test_system_cwproperty (unittest_syncsession.CWPropertyHooksTC)
repository is not initialised: ImportError("No module named 'httplib'",)
======================================================================
SKIPPED: test_unexistant_cwproperty (unittest_syncsession.CWPropertyHooksTC)
repository is not initialised: ImportError("No module named 'httplib'",)
======================================================================
SKIPPED: test_vreg_propertyvalues_update (unittest_syncsession.CWPropertyHooksTC)
repository is not initialised: ImportError("No module named 'httplib'",)
===================== unittest_notification.py =====================
E
======================================================================
ERROR: test_entity_update (unittest_notification.NotificationHooksTC)
Check transaction_data['changes'] filled by "notifentityupdated" hook.
----------------------------------------------------------------------
Traceback (most recent call last)
File "/usr/lib/python3.4/unittest/case.py", line 58, in testPartExecutor
yield
File "/usr/lib/python3.4/unittest/case.py", line 573, in run
self.setUp()
File "/var/lib/jenkins/jobs/cubicweb-3.23/workspace/TOXENV/py34-hooks/cubicweb/devtools/testlib.py", line 448, in setUp
self._init_repo()
File "/var/lib/jenkins/jobs/cubicweb-3.23/workspace/TOXENV/py34-hooks/cubicweb/devtools/testlib.py", line 357, in _init_repo
db_handler.restore_database(self.test_db_id)
File "/var/lib/jenkins/jobs/cubicweb-3.23/workspace/TOXENV/py34-hooks/cubicweb/devtools/__init__.py", line 378, in restore_database
self._restore_database(backup_coordinates, config)
File "/var/lib/jenkins/jobs/cubicweb-3.23/workspace/TOXENV/py34-hooks/cubicweb/devtools/__init__.py", line 815, in _restore_database
self.get_repo()
File "/var/lib/jenkins/jobs/cubicweb-3.23/workspace/TOXENV/py34-hooks/cubicweb/devtools/__init__.py", line 393, in get_repo
self._repo = self._new_repo(self.config)
File "/var/lib/jenkins/jobs/cubicweb-3.23/workspace/TOXENV/py34-hooks/cubicweb/devtools/__init__.py", line 407, in _new_repo
repo = config.repository()
File "/var/lib/jenkins/jobs/cubicweb-3.23/workspace/TOXENV/py34-hooks/cubicweb/cwconfig.py", line 1030, in repository
return Repository(self, TasksManager(), vreg=vreg)
File "/var/lib/jenkins/jobs/cubicweb-3.23/workspace/TOXENV/py34-hooks/cubicweb/server/repository.py", line 186, in __init__
self.init_cnxset_pool()
File "/var/lib/jenkins/jobs/cubicweb-3.23/workspace/TOXENV/py34-hooks/cubicweb/server/repository.py", line 228, in init_cnxset_pool
self.set_schema(config.load_schema(expand_cubes=True))
File "/var/lib/jenkins/jobs/cubicweb-3.23/workspace/TOXENV/py34-hooks/cubicweb/server/repository.py", line 315, in set_schema
self.vreg.set_schema(schema)
File "/var/lib/jenkins/jobs/cubicweb-3.23/workspace/TOXENV/py34-hooks/cubicweb/cwvreg.py", line 424, in set_schema
self.reload(self.config.appobjects_path(), force_reload=False)
File "/var/lib/jenkins/jobs/cubicweb-3.23/workspace/TOXENV/py34-hooks/cubicweb/cwvreg.py", line 474, in reload
self.register_objects(path)
File "/var/lib/jenkins/jobs/cubicweb-3.23/workspace/TOXENV/py34-hooks/cubicweb/cwvreg.py", line 519, in register_objects
path, self.config.extrapath)
File "/var/lib/jenkins/jobs/cubicweb-3.23/workspace/TOXENV/py34-hooks/.tox/py34-hooks/lib/python3.4/site-packages/logilab/common/registry.py", line 681, in register_objects
self.load_file(filepath, modname)
File "/var/lib/jenkins/jobs/cubicweb-3.23/workspace/TOXENV/py34-hooks/cubicweb/cwvreg.py", line 484, in load_file
return super(CWRegistryStore, self).load_file(filepath, modname)
File "/var/lib/jenkins/jobs/cubicweb-3.23/workspace/TOXENV/py34-hooks/.tox/py34-hooks/lib/python3.4/site-packages/logilab/common/registry.py", line 738, in load_file
module = load_module_from_name(modname)
File "/var/lib/jenkins/jobs/cubicweb-3.23/workspace/TOXENV/py34-hooks/.tox/py34-hooks/lib/python3.4/site-packages/logilab/common/modutils.py", line 125, in load_module_from_name
return load_module_from_modpath(dotted_name.split('.'), path, use_sys)
File "/var/lib/jenkins/jobs/cubicweb-3.23/workspace/TOXENV/py34-hooks/.tox/py34-hooks/lib/python3.4/site-packages/logilab/common/modutils.py", line 169, in load_module_from_modpath
module = load_module(curname, mp_file, mp_filename, mp_desc)
File "/var/lib/jenkins/jobs/cubicweb-3.23/workspace/TOXENV/py34-hooks/.tox/py34-hooks/lib/python3.4/imp.py", line 235, in load_module
return load_source(name, filename, file)
File "/var/lib/jenkins/jobs/cubicweb-3.23/workspace/TOXENV/py34-hooks/.tox/py34-hooks/lib/python3.4/imp.py", line 171, in load_source
module = methods.load()
File "/var/lib/jenkins/jobs/cubicweb-3.23/workspace/TOXENV/py34-hooks/cubicweb/hooks/test/<frozen importlib._bootstrap>", line 1220, in load
<no source available>
File "/var/lib/jenkins/jobs/cubicweb-3.23/workspace/TOXENV/py34-hooks/cubicweb/hooks/test/<frozen importlib._bootstrap>", line 1200, in _load_unlocked
<no source available>
File "/var/lib/jenkins/jobs/cubicweb-3.23/workspace/TOXENV/py34-hooks/cubicweb/hooks/test/<frozen importlib._bootstrap>", line 1129, in _exec
<no source available>
File "/var/lib/jenkins/jobs/cubicweb-3.23/workspace/TOXENV/py34-hooks/cubicweb/hooks/test/<frozen importlib._bootstrap>", line 1471, in exec_module
<no source available>
File "/var/lib/jenkins/jobs/cubicweb-3.23/workspace/TOXENV/py34-hooks/cubicweb/hooks/test/<frozen importlib._bootstrap>", line 321, in _call_with_frames_removed
<no source available>
File "/var/lib/jenkins/jobs/cubicweb-3.23/workspace/TOXENV/py34-hooks/cubicweb/web/views/ajaxcontroller.py", line 82, in <module>
from cubicweb.web.views import basecontrollers
File "/var/lib/jenkins/jobs/cubicweb-3.23/workspace/TOXENV/py34-hooks/cubicweb/web/views/basecontrollers.py", line 26, in <module>
import httplib
ImportError: No module named 'httplib'

no stdout
no stderr
===================== unittest_synccomputed.py =====================
2016-03-15 11:41:22 - (cubicweb.appobject) WARNING: can't find any workflow for CWUser
ESSS...The files belonging to this database system will be owned by user "jenkins".
This user must also own the server process.

The database cluster will be initialized with locale "C".
The default text search configuration will be set to "english".

Data page checksums are disabled.

creating directory /var/lib/jenkins/jobs/cubicweb-3.23/workspace/TOXENV/py34-hooks/cubicweb/hooks/test/data/database/pgdb-unittest_syncschema ... ok
creating subdirectories ... ok
selecting default max_connections ... 100
selecting default shared_buffers ... 128MB
selecting dynamic shared memory implementation ... posix
creating configuration files ... ok
creating template1 database in /var/lib/jenkins/jobs/cubicweb-3.23/workspace/TOXENV/py34-hooks/cubicweb/hooks/test/data/database/pgdb-unittest_syncschema/base/1 ... ok
initializing pg_authid ... ok
initializing dependencies ... ok
creating system views ... ok
loading system objects' descriptions ... ok
creating collations ... ok
creating conversions ... ok
creating dictionaries ... ok
setting privileges on built-in objects ... ok
creating information schema ... ok
loading PL/pgSQL server-side language ... ok
vacuuming database template1 ... ok
copying template1 to template0 ... ok
copying template1 to postgres ... ok
syncing data to disk ... ok

WARNING: enabling "trust" authentication for local connections
You can change this by editing pg_hba.conf or using the option -A, or
--auth-local and --auth-host, the next time you run initdb.

Success. You can now start the database server using:

postgres -D /var/lib/jenkins/jobs/cubicweb-3.23/workspace/TOXENV/py34-hooks/cubicweb/hooks/test/data/database/pgdb-unittest_syncschema
or
pg_ctl -D /var/lib/jenkins/jobs/cubicweb-3.23/workspace/TOXENV/py34-hooks/cubicweb/hooks/test/data/database/pgdb-unittest_syncschema -l logfile start

waiting for server to start....LOG: database system was shut down at 2016-03-15 11:41:35 CET
LOG: MultiXact member wraparound protections are now enabled
LOG: database system is ready to accept connections
LOG: autovacuum launcher started
done
server started

======================================================================
ERROR: test_init_on_entity_creation (unittest_synccomputed.ComputedAttributeTC)
check the computed attribute is initialized on entity creation
----------------------------------------------------------------------
Traceback (most recent call last)
File "/usr/lib/python3.4/unittest/case.py", line 58, in testPartExecutor
yield
File "/usr/lib/python3.4/unittest/case.py", line 573, in run
self.setUp()
File "/var/lib/jenkins/jobs/cubicweb-3.23/workspace/TOXENV/py34-hooks/cubicweb/devtools/testlib.py", line 448, in setUp
self._init_repo()
File "/var/lib/jenkins/jobs/cubicweb-3.23/workspace/TOXENV/py34-hooks/cubicweb/devtools/testlib.py", line 357, in _init_repo
db_handler.restore_database(self.test_db_id)
File "/var/lib/jenkins/jobs/cubicweb-3.23/workspace/TOXENV/py34-hooks/cubicweb/devtools/__init__.py", line 378, in restore_database
self._restore_database(backup_coordinates, config)
File "/var/lib/jenkins/jobs/cubicweb-3.23/workspace/TOXENV/py34-hooks/cubicweb/devtools/__init__.py", line 815, in _restore_database
self.get_repo()
File "/var/lib/jenkins/jobs/cubicweb-3.23/workspace/TOXENV/py34-hooks/cubicweb/devtools/__init__.py", line 393, in get_repo
self._repo = self._new_repo(self.config)
File "/var/lib/jenkins/jobs/cubicweb-3.23/workspace/TOXENV/py34-hooks/cubicweb/devtools/__init__.py", line 407, in _new_repo
repo = config.repository()
File "/var/lib/jenkins/jobs/cubicweb-3.23/workspace/TOXENV/py34-hooks/cubicweb/cwconfig.py", line 1030, in repository
return Repository(self, TasksManager(), vreg=vreg)
File "/var/lib/jenkins/jobs/cubicweb-3.23/workspace/TOXENV/py34-hooks/cubicweb/server/repository.py", line 186, in __init__
self.init_cnxset_pool()
File "/var/lib/jenkins/jobs/cubicweb-3.23/workspace/TOXENV/py34-hooks/cubicweb/server/repository.py", line 228, in init_cnxset_pool
self.set_schema(config.load_schema(expand_cubes=True))
File "/var/lib/jenkins/jobs/cubicweb-3.23/workspace/TOXENV/py34-hooks/cubicweb/server/repository.py", line 315, in set_schema
self.vreg.set_schema(schema)
File "/var/lib/jenkins/jobs/cubicweb-3.23/workspace/TOXENV/py34-hooks/cubicweb/cwvreg.py", line 424, in set_schema
self.reload(self.config.appobjects_path(), force_reload=False)
File "/var/lib/jenkins/jobs/cubicweb-3.23/workspace/TOXENV/py34-hooks/cubicweb/cwvreg.py", line 474, in reload
self.register_objects(path)
File "/var/lib/jenkins/jobs/cubicweb-3.23/workspace/TOXENV/py34-hooks/cubicweb/cwvreg.py", line 519, in register_objects
path, self.config.extrapath)
File "/var/lib/jenkins/jobs/cubicweb-3.23/workspace/TOXENV/py34-hooks/.tox/py34-hooks/lib/python3.4/site-packages/logilab/common/registry.py", line 681, in register_objects
self.load_file(filepath, modname)
File "/var/lib/jenkins/jobs/cubicweb-3.23/workspace/TOXENV/py34-hooks/cubicweb/cwvreg.py", line 484, in load_file
return super(CWRegistryStore, self).load_file(filepath, modname)
File "/var/lib/jenkins/jobs/cubicweb-3.23/workspace/TOXENV/py34-hooks/.tox/py34-hooks/lib/python3.4/site-packages/logilab/common/registry.py", line 738, in load_file
module = load_module_from_name(modname)
File "/var/lib/jenkins/jobs/cubicweb-3.23/workspace/TOXENV/py34-hooks/.tox/py34-hooks/lib/python3.4/site-packages/logilab/common/modutils.py", line 125, in load_module_from_name
return load_module_from_modpath(dotted_name.split('.'), path, use_sys)
File "/var/lib/jenkins/jobs/cubicweb-3.23/workspace/TOXENV/py34-hooks/.tox/py34-hooks/lib/python3.4/site-packages/logilab/common/modutils.py", line 169, in load_module_from_modpath
module = load_module(curname, mp_file, mp_filename, mp_desc)
File "/var/lib/jenkins/jobs/cubicweb-3.23/workspace/TOXENV/py34-hooks/.tox/py34-hooks/lib/python3.4/imp.py", line 235, in load_module
return load_source(name, filename, file)
File "/var/lib/jenkins/jobs/cubicweb-3.23/workspace/TOXENV/py34-hooks/.tox/py34-hooks/lib/python3.4/imp.py", line 171, in load_source
module = methods.load()
File "/var/lib/jenkins/jobs/cubicweb-3.23/workspace/TOXENV/py34-hooks/cubicweb/hooks/test/<frozen importlib._bootstrap>", line 1220, in load
<no source available>
File "/var/lib/jenkins/jobs/cubicweb-3.23/workspace/TOXENV/py34-hooks/cubicweb/hooks/test/<frozen importlib._bootstrap>", line 1200, in _load_unlocked
<no source available>
File "/var/lib/jenkins/jobs/cubicweb-3.23/workspace/TOXENV/py34-hooks/cubicweb/hooks/test/<frozen importlib._bootstrap>", line 1129, in _exec
<no source available>
File "/var/lib/jenkins/jobs/cubicweb-3.23/workspace/TOXENV/py34-hooks/cubicweb/hooks/test/<frozen importlib._bootstrap>", line 1471, in exec_module
<no source available>
File "/var/lib/jenkins/jobs/cubicweb-3.23/workspace/TOXENV/py34-hooks/cubicweb/hooks/test/<frozen importlib._bootstrap>", line 321, in _call_with_frames_removed
<no source available>
File "/var/lib/jenkins/jobs/cubicweb-3.23/workspace/TOXENV/py34-hooks/cubicweb/web/views/ajaxcontroller.py", line 82, in <module>
from cubicweb.web.views import basecontrollers
File "/var/lib/jenkins/jobs/cubicweb-3.23/workspace/TOXENV/py34-hooks/cubicweb/web/views/basecontrollers.py", line 26, in <module>
import httplib
ImportError: No module named 'httplib'

no stdout
no stderr
======================================================================
SKIPPED: test_recompute_on_ambiguous_relation (unittest_synccomputed.ComputedAttributeTC)
repository is not initialised: ImportError("No module named 'httplib'",)
======================================================================
SKIPPED: test_recompute_on_attribute_update (unittest_synccomputed.ComputedAttributeTC)
check the modification of an attribute triggers the update of the
repository is not initialised: ImportError("No module named 'httplib'",)
======================================================================
SKIPPED: test_update_on_add_remove_relation (unittest_synccomputed.ComputedAttributeTC)
check the rewriting of a computed attribute
repository is not initialised: ImportError("No module named 'httplib'",)
====================== unittest_syncschema.py ======================
2016-03-15 11:41:36 - (logilab.database) WARNING: plpgsql language already installed
2016-03-15 11:41:38 - (cubicweb.appobject) WARNING: can't find any workflow for CWUser
ELOG: received fast shutdown request
LOG: aborting any active transactions
FATAL: terminating connection due to administrator command
LOG: autovacuum launcher shutting down
waiting for server to shut down....FATAL: terminating connection due to administrator command
LOG: shutting down
LOG: database system is shut down
done
server stopped
SSSSSSSSSSSSSSSSE
======================================================================
ERROR: test_add_attribute_to_base_class (unittest_syncschema.SchemaModificationHooksTC)
----------------------------------------------------------------------
Traceback (most recent call last)
File "/usr/lib/python3.4/unittest/case.py", line 58, in testPartExecutor
yield
File "/usr/lib/python3.4/unittest/case.py", line 573, in run
self.setUp()
File "/var/lib/jenkins/jobs/cubicweb-3.23/workspace/TOXENV/py34-hooks/cubicweb/hooks/test/unittest_syncschema.py", line 44, in setUp
super(SchemaModificationHooksTC, self).setUp()
File "/var/lib/jenkins/jobs/cubicweb-3.23/workspace/TOXENV/py34-hooks/cubicweb/devtools/testlib.py", line 448, in setUp
self._init_repo()
File "/var/lib/jenkins/jobs/cubicweb-3.23/workspace/TOXENV/py34-hooks/cubicweb/devtools/testlib.py", line 358, in _init_repo
self.repo = db_handler.get_repo(startup=True)
File "/var/lib/jenkins/jobs/cubicweb-3.23/workspace/TOXENV/py34-hooks/cubicweb/devtools/__init__.py", line 393, in get_repo
self._repo = self._new_repo(self.config)
File "/var/lib/jenkins/jobs/cubicweb-3.23/workspace/TOXENV/py34-hooks/cubicweb/devtools/__init__.py", line 407, in _new_repo
repo = config.repository()
File "/var/lib/jenkins/jobs/cubicweb-3.23/workspace/TOXENV/py34-hooks/cubicweb/cwconfig.py", line 1030, in repository
return Repository(self, TasksManager(), vreg=vreg)
File "/var/lib/jenkins/jobs/cubicweb-3.23/workspace/TOXENV/py34-hooks/cubicweb/server/repository.py", line 186, in __init__
self.init_cnxset_pool()
File "/var/lib/jenkins/jobs/cubicweb-3.23/workspace/TOXENV/py34-hooks/cubicweb/server/repository.py", line 228, in init_cnxset_pool
self.set_schema(config.load_schema(expand_cubes=True))
File "/var/lib/jenkins/jobs/cubicweb-3.23/workspace/TOXENV/py34-hooks/cubicweb/server/repository.py", line 315, in set_schema
self.vreg.set_schema(schema)
File "/var/lib/jenkins/jobs/cubicweb-3.23/workspace/TOXENV/py34-hooks/cubicweb/cwvreg.py", line 424, in set_schema
self.reload(self.config.appobjects_path(), force_reload=False)
File "/var/lib/jenkins/jobs/cubicweb-3.23/workspace/TOXENV/py34-hooks/cubicweb/cwvreg.py", line 474, in reload
self.register_objects(path)
File "/var/lib/jenkins/jobs/cubicweb-3.23/workspace/TOXENV/py34-hooks/cubicweb/cwvreg.py", line 519, in register_objects
path, self.config.extrapath)
File "/var/lib/jenkins/jobs/cubicweb-3.23/workspace/TOXENV/py34-hooks/.tox/py34-hooks/lib/python3.4/site-packages/logilab/common/registry.py", line 681, in register_objects
self.load_file(filepath, modname)
File "/var/lib/jenkins/jobs/cubicweb-3.23/workspace/TOXENV/py34-hooks/cubicweb/cwvreg.py", line 484, in load_file
return super(CWRegistryStore, self).load_file(filepath, modname)
File "/var/lib/jenkins/jobs/cubicweb-3.23/workspace/TOXENV/py34-hooks/.tox/py34-hooks/lib/python3.4/site-packages/logilab/common/registry.py", line 738, in load_file
module = load_module_from_name(modname)
File "/var/lib/jenkins/jobs/cubicweb-3.23/workspace/TOXENV/py34-hooks/.tox/py34-hooks/lib/python3.4/site-packages/logilab/common/modutils.py", line 125, in load_module_from_name
return load_module_from_modpath(dotted_name.split('.'), path, use_sys)
File "/var/lib/jenkins/jobs/cubicweb-3.23/workspace/TOXENV/py34-hooks/.tox/py34-hooks/lib/python3.4/site-packages/logilab/common/modutils.py", line 169, in load_module_from_modpath
module = load_module(curname, mp_file, mp_filename, mp_desc)
File "/var/lib/jenkins/jobs/cubicweb-3.23/workspace/TOXENV/py34-hooks/.tox/py34-hooks/lib/python3.4/imp.py", line 235, in load_module
return load_source(name, filename, file)
File "/var/lib/jenkins/jobs/cubicweb-3.23/workspace/TOXENV/py34-hooks/.tox/py34-hooks/lib/python3.4/imp.py", line 171, in load_source
module = methods.load()
File "/var/lib/jenkins/jobs/cubicweb-3.23/workspace/TOXENV/py34-hooks/cubicweb/hooks/test/<frozen importlib._bootstrap>", line 1220, in load
<no source available>
File "/var/lib/jenkins/jobs/cubicweb-3.23/workspace/TOXENV/py34-hooks/cubicweb/hooks/test/<frozen importlib._bootstrap>", line 1200, in _load_unlocked
<no source available>
File "/var/lib/jenkins/jobs/cubicweb-3.23/workspace/TOXENV/py34-hooks/cubicweb/hooks/test/<frozen importlib._bootstrap>", line 1129, in _exec
<no source available>
File "/var/lib/jenkins/jobs/cubicweb-3.23/workspace/TOXENV/py34-hooks/cubicweb/hooks/test/<frozen importlib._bootstrap>", line 1471, in exec_module
<no source available>
File "/var/lib/jenkins/jobs/cubicweb-3.23/workspace/TOXENV/py34-hooks/cubicweb/hooks/test/<frozen importlib._bootstrap>", line 321, in _call_with_frames_removed
<no source available>
File "/var/lib/jenkins/jobs/cubicweb-3.23/workspace/TOXENV/py34-hooks/cubicweb/web/views/ajaxcontroller.py", line 82, in <module>
from cubicweb.web.views import basecontrollers
File "/var/lib/jenkins/jobs/cubicweb-3.23/workspace/TOXENV/py34-hooks/cubicweb/web/views/basecontrollers.py", line 26, in <module>
import httplib
ImportError: No module named 'httplib'

no stdout
no stderr
======================================================================
ERROR: tearDownModule (unittest_syncschema)
----------------------------------------------------------------------
Traceback (most recent call last)
File "/usr/lib/python3.4/unittest/suite.py", line 237, in _handleModuleTearDown
tearDownModule()
File "/var/lib/jenkins/jobs/cubicweb-3.23/workspace/TOXENV/py34-hooks/cubicweb/hooks/test/unittest_syncschema.py", line 37, in tearDownModule
del SchemaModificationHooksTC.schema_eids
AttributeError: schema_eids

no stdout
no stderr
======================================================================
SKIPPED: test_add_constraint (unittest_syncschema.SchemaModificationHooksTC)
repository is not initialised: ImportError("No module named 'httplib'",)
======================================================================
SKIPPED: test_base (unittest_syncschema.SchemaModificationHooksTC)
repository is not initialised: ImportError("No module named 'httplib'",)
======================================================================
SKIPPED: test_change_fulltext_container (unittest_syncschema.SchemaModificationHooksTC)
repository is not initialised: ImportError("No module named 'httplib'",)
======================================================================
SKIPPED: test_change_fulltextindexed (unittest_syncschema.SchemaModificationHooksTC)
repository is not initialised: ImportError("No module named 'httplib'",)
======================================================================
SKIPPED: test_indexed_change (unittest_syncschema.SchemaModificationHooksTC)
repository is not initialised: ImportError("No module named 'httplib'",)
======================================================================
SKIPPED: test_is_instance_of_insertions (unittest_syncschema.SchemaModificationHooksTC)
repository is not initialised: ImportError("No module named 'httplib'",)
======================================================================
SKIPPED: test_metartype_with_nordefs (unittest_syncschema.SchemaModificationHooksTC)
repository is not initialised: ImportError("No module named 'httplib'",)
======================================================================
SKIPPED: test_metartype_with_somerdefs (unittest_syncschema.SchemaModificationHooksTC)
repository is not initialised: ImportError("No module named 'httplib'",)
======================================================================
SKIPPED: test_nonregr_user_edit_itself (unittest_syncschema.SchemaModificationHooksTC)
repository is not initialised: ImportError("No module named 'httplib'",)
======================================================================
SKIPPED: test_perms_synchronization_1 (unittest_syncschema.SchemaModificationHooksTC)
repository is not initialised: ImportError("No module named 'httplib'",)
======================================================================
SKIPPED: test_perms_synchronization_2 (unittest_syncschema.SchemaModificationHooksTC)
repository is not initialised: ImportError("No module named 'httplib'",)
======================================================================
SKIPPED: test_required_change_1 (unittest_syncschema.SchemaModificationHooksTC)
repository is not initialised: ImportError("No module named 'httplib'",)
======================================================================
SKIPPED: test_required_change_2 (unittest_syncschema.SchemaModificationHooksTC)
repository is not initialised: ImportError("No module named 'httplib'",)
======================================================================
SKIPPED: test_uninline_relation (unittest_syncschema.SchemaModificationHooksTC)
repository is not initialised: ImportError("No module named 'httplib'",)
======================================================================
SKIPPED: test_unique_change (unittest_syncschema.SchemaModificationHooksTC)
repository is not initialised: ImportError("No module named 'httplib'",)
======================================================================
SKIPPED: test_update_constraint (unittest_syncschema.SchemaModificationHooksTC)
repository is not initialised: ImportError("No module named 'httplib'",)
====================== unittest_integrity.py =======================
ESSSSSSSSSS
======================================================================
ERROR: test_composite_1 (unittest_integrity.CoreHooksTC)
----------------------------------------------------------------------
Traceback (most recent call last)
File "/usr/lib/python3.4/unittest/case.py", line 58, in testPartExecutor
yield
File "/usr/lib/python3.4/unittest/case.py", line 573, in run
self.setUp()
File "/var/lib/jenkins/jobs/cubicweb-3.23/workspace/TOXENV/py34-hooks/cubicweb/devtools/testlib.py", line 448, in setUp
self._init_repo()
File "/var/lib/jenkins/jobs/cubicweb-3.23/workspace/TOXENV/py34-hooks/cubicweb/devtools/testlib.py", line 357, in _init_repo
db_handler.restore_database(self.test_db_id)
File "/var/lib/jenkins/jobs/cubicweb-3.23/workspace/TOXENV/py34-hooks/cubicweb/devtools/__init__.py", line 378, in restore_database
self._restore_database(backup_coordinates, config)
File "/var/lib/jenkins/jobs/cubicweb-3.23/workspace/TOXENV/py34-hooks/cubicweb/devtools/__init__.py", line 815, in _restore_database
self.get_repo()
File "/var/lib/jenkins/jobs/cubicweb-3.23/workspace/TOXENV/py34-hooks/cubicweb/devtools/__init__.py", line 393, in get_repo
self._repo = self._new_repo(self.config)
File "/var/lib/jenkins/jobs/cubicweb-3.23/workspace/TOXENV/py34-hooks/cubicweb/devtools/__init__.py", line 407, in _new_repo
repo = config.repository()
File "/var/lib/jenkins/jobs/cubicweb-3.23/workspace/TOXENV/py34-hooks/cubicweb/cwconfig.py", line 1030, in repository
return Repository(self, TasksManager(), vreg=vreg)
File "/var/lib/jenkins/jobs/cubicweb-3.23/workspace/TOXENV/py34-hooks/cubicweb/server/repository.py", line 186, in __init__
self.init_cnxset_pool()
File "/var/lib/jenkins/jobs/cubicweb-3.23/workspace/TOXENV/py34-hooks/cubicweb/server/repository.py", line 228, in init_cnxset_pool
self.set_schema(config.load_schema(expand_cubes=True))
File "/var/lib/jenkins/jobs/cubicweb-3.23/workspace/TOXENV/py34-hooks/cubicweb/server/repository.py", line 315, in set_schema
self.vreg.set_schema(schema)
File "/var/lib/jenkins/jobs/cubicweb-3.23/workspace/TOXENV/py34-hooks/cubicweb/cwvreg.py", line 424, in set_schema
self.reload(self.config.appobjects_path(), force_reload=False)
File "/var/lib/jenkins/jobs/cubicweb-3.23/workspace/TOXENV/py34-hooks/cubicweb/cwvreg.py", line 474, in reload
self.register_objects(path)
File "/var/lib/jenkins/jobs/cubicweb-3.23/workspace/TOXENV/py34-hooks/cubicweb/cwvreg.py", line 519, in register_objects
path, self.config.extrapath)
File "/var/lib/jenkins/jobs/cubicweb-3.23/workspace/TOXENV/py34-hooks/.tox/py34-hooks/lib/python3.4/site-packages/logilab/common/registry.py", line 681, in register_objects
self.load_file(filepath, modname)
File "/var/lib/jenkins/jobs/cubicweb-3.23/workspace/TOXENV/py34-hooks/cubicweb/cwvreg.py", line 484, in load_file
return super(CWRegistryStore, self).load_file(filepath, modname)
File "/var/lib/jenkins/jobs/cubicweb-3.23/workspace/TOXENV/py34-hooks/.tox/py34-hooks/lib/python3.4/site-packages/logilab/common/registry.py", line 738, in load_file
module = load_module_from_name(modname)
File "/var/lib/jenkins/jobs/cubicweb-3.23/workspace/TOXENV/py34-hooks/.tox/py34-hooks/lib/python3.4/site-packages/logilab/common/modutils.py", line 125, in load_module_from_name
return load_module_from_modpath(dotted_name.split('.'), path, use_sys)
File "/var/lib/jenkins/jobs/cubicweb-3.23/workspace/TOXENV/py34-hooks/.tox/py34-hooks/lib/python3.4/site-packages/logilab/common/modutils.py", line 169, in load_module_from_modpath
module = load_module(curname, mp_file, mp_filename, mp_desc)
File "/var/lib/jenkins/jobs/cubicweb-3.23/workspace/TOXENV/py34-hooks/.tox/py34-hooks/lib/python3.4/imp.py", line 235, in load_module
return load_source(name, filename, file)
File "/var/lib/jenkins/jobs/cubicweb-3.23/workspace/TOXENV/py34-hooks/.tox/py34-hooks/lib/python3.4/imp.py", line 171, in load_source
module = methods.load()
File "/var/lib/jenkins/jobs/cubicweb-3.23/workspace/TOXENV/py34-hooks/cubicweb/hooks/test/<frozen importlib._bootstrap>", line 1220, in load
<no source available>
File "/var/lib/jenkins/jobs/cubicweb-3.23/workspace/TOXENV/py34-hooks/cubicweb/hooks/test/<frozen importlib._bootstrap>", line 1200, in _load_unlocked
<no source available>
File "/var/lib/jenkins/jobs/cubicweb-3.23/workspace/TOXENV/py34-hooks/cubicweb/hooks/test/<frozen importlib._bootstrap>", line 1129, in _exec
<no source available>
File "/var/lib/jenkins/jobs/cubicweb-3.23/workspace/TOXENV/py34-hooks/cubicweb/hooks/test/<frozen importlib._bootstrap>", line 1471, in exec_module
<no source available>
File "/var/lib/jenkins/jobs/cubicweb-3.23/workspace/TOXENV/py34-hooks/cubicweb/hooks/test/<frozen importlib._bootstrap>", line 321, in _call_with_frames_removed
<no source available>
File "/var/lib/jenkins/jobs/cubicweb-3.23/workspace/TOXENV/py34-hooks/cubicweb/web/views/ajaxcontroller.py", line 82, in <module>
from cubicweb.web.views import basecontrollers
File "/var/lib/jenkins/jobs/cubicweb-3.23/workspace/TOXENV/py34-hooks/cubicweb/web/views/basecontrollers.py", line 26, in <module>
import httplib
ImportError: No module named 'httplib'

no stdout
no stderr
======================================================================
SKIPPED: test_composite_2 (unittest_integrity.CoreHooksTC)
repository is not initialised: ImportError("No module named 'httplib'",)
======================================================================
SKIPPED: test_composite_object_relation_deletion (unittest_integrity.CoreHooksTC)
repository is not initialised: ImportError("No module named 'httplib'",)
======================================================================
SKIPPED: test_composite_redirection (unittest_integrity.CoreHooksTC)
repository is not initialised: ImportError("No module named 'httplib'",)
======================================================================
SKIPPED: test_composite_subject_relation_deletion (unittest_integrity.CoreHooksTC)
repository is not initialised: ImportError("No module named 'httplib'",)
======================================================================
SKIPPED: test_delete_internal_entities (unittest_integrity.CoreHooksTC)
repository is not initialised: ImportError("No module named 'httplib'",)
======================================================================
SKIPPED: test_delete_required_relations_subject (unittest_integrity.CoreHooksTC)
repository is not initialised: ImportError("No module named 'httplib'",)
======================================================================
SKIPPED: test_missing_required_relations_subject_inline (unittest_integrity.CoreHooksTC)
repository is not initialised: ImportError("No module named 'httplib'",)
======================================================================
SKIPPED: test_static_vocabulary_check (unittest_integrity.CoreHooksTC)
repository is not initialised: ImportError("No module named 'httplib'",)
======================================================================
SKIPPED: test_unique_constraint (unittest_integrity.CoreHooksTC)
repository is not initialised: ImportError("No module named 'httplib'",)
======================================================================
SKIPPED: test_unsatisfied_constraints (unittest_integrity.CoreHooksTC)
repository is not initialised: ImportError("No module named 'httplib'",)
-> creating tables
-> inserting default user and default groups.
-> storing the schema in the database
-> database for instance data initialized.
-> creating tables
-> inserting default user and default groups.
-> storing the schema in the database
-> database for instance data-computed initialized.
-> installing /var/lib/jenkins/jobs/cubicweb-3.23/workspace/TOXENV/py34-hooks/cubicweb/schemas/_regproc.postgres.sql
-> creating tables
-> inserting default user and default groups.
-> storing the schema in the database
-> database for instance data initialized.
*******************************************************************************
Ran 58 test cases in 48.28s (38.52s CPU), 11 errors, 45 skipped
0 modules OK (8 failed)
failures: /var/lib/jenkins/jobs/cubicweb-3.23/workspace/TOXENV/py34-hooks/cubicweb/hooks/test/unittest_hooks [3/15], /var/lib/jenkins/jobs/cubicweb-3.23/workspace/TOXENV/py34-hooks/cubicweb/hooks/test/unittest_security [1/1], /var/lib/jenkins/jobs/cubicweb-3.23/workspace/TOXENV/py34-hooks/cubicweb/hooks/test/unittest_bookmarks [1/1], /var/lib/jenkins/jobs/cubicweb-3.23/workspace/TOXENV/py34-hooks/cubicweb/hooks/test/unittest_syncsession [1/5], /var/lib/jenkins/jobs/cubicweb-3.23/workspace/TOXENV/py34-hooks/cubicweb/hooks/test/unittest_notification [1/1], /var/lib/jenkins/jobs/cubicweb-3.23/workspace/TOXENV/py34-hooks/cubicweb/hooks/test/unittest_synccomputed [1/7], /var/lib/jenkins/jobs/cubicweb-3.23/workspace/TOXENV/py34-hooks/cubicweb/hooks/test/unittest_syncschema [2/17], /var/lib/jenkins/jobs/cubicweb-3.23/workspace/TOXENV/py34-hooks/cubicweb/hooks/test/unittest_integrity [1/11]
ERROR: InvocationError: '/var/lib/jenkins/jobs/cubicweb-3.23/workspace/TOXENV/py34-hooks/.tox/py34-hooks/bin/python -c from logilab.common import pytest; pytest.run() -t /var/lib/jenkins/jobs/cubicweb-3.23/workspace/TOXENV/py34-hooks/cubicweb/hooks/test'
___________________________________ summary ____________________________________
ERROR: py34-hooks: commands failed
Build step 'Execute shell' marked build as failure
Sending e-mails to: dlaxalde@logilab.fr jcr@logilab.fr syt@logilab.fr david@logilab.fr
[PostBuildScript] - Execution post build scripts.
[py34-hooks] $ /bin/bash -xe /tmp/hudson2432787215064915652.sh
+ /var/lib/jenkins/scripts/notify_forge_apycot.py cwo cubicweb 2ce70e8f62b1 http://jenkins.logilab.fr/job/cubicweb-3.23/TOXENV=py34-hooks/64/ --status failure
<br/>

log from execution
download