consoleText

download

20 Started by upstream project "cubicweb-3.23" build number 66
originally caused by:
Started by an SCM change
Building in workspace /var/lib/jenkins/jobs/cubicweb-3.23/workspace/TOXENV/py27-web
[py27-web] $ hg showconfig paths.default
[py27-web] $ hg pull
pulling from http://hg.logilab.org/review/cubicweb
searching for changes
adding changesets
adding manifests
adding file changes
added 2 changesets with 2 changes to 3 files (+1 heads)
9 new obsolescence markers
(run 'hg heads .' to see heads, 'hg merge' to merge)
[py27-web] $ hg update --clean --rev 211223ac81701ca411a6bf64efb45ef2df61946a
4 files updated, 0 files merged, 0 files removed, 0 files unresolved
[py27-web] $ hg --config extensions.purge= clean --all
[py27-web] $ hg log --rev . --template {node}
[py27-web] $ hg log --rev . --template {rev}
[py27-web] $ hg id --branch
[py27-web] $ /bin/bash -xe /tmp/hudson6304086580100370536.sh
+ find . '(' -name 'pgdb*' -o -name 'tmpdb*' ')' -print0
+ xargs -0 rm -rf
[py27-web] $ /bin/bash -xe /tmp/hudson1422741200907571575.sh
+ PATH=/usr/lib/postgresql/9.4/bin:/usr/local/bin:/usr/bin:/bin:/usr/local/games:/usr/games
+ tox --recreate
py27-web create: /var/lib/jenkins/jobs/cubicweb-3.23/workspace/TOXENV/py27-web/.tox/py27-web
py27-web installdeps: -r/var/lib/jenkins/jobs/cubicweb-3.23/workspace/TOXENV/py27-web/cubicweb/web/test/requirements.txt
py27-web develop-inst: /var/lib/jenkins/jobs/cubicweb-3.23/workspace/TOXENV/py27-web
py27-web installed: You are using pip version 7.1.2, however version 8.1.0 is available.,You should consider upgrading via the 'pip install --upgrade pip' command.,beautifulsoup4==4.3.2,boto==2.34.0,bzr-etckeeper==0.0.0,cffi==0.8.6,characteristic==0.1.0,chardet==2.3.0,Cheetah==2.4.4,cloud-init==0.7.6,colorama==0.3.2,configobj==5.0.6,coverage==3.7.1,croniter==0.3.4,cryptography==0.6.1,-e hg+http://hg.logilab.org/review/cubicweb@211223ac81701ca411a6bf64efb45ef2df61946a#egg=cubicweb-dev,cubicweb-blog==1.12.0,cubicweb-file==1.18.0,cubicweb-tag==1.8.3,cwclientlib==0.4.1,Cython==0.21.1,decorator==3.4.0,docutils==0.12,ecdsa==0.11,euca2ools==3.1.0,GDAL==1.10.1,hg-evolve==5.2.1,html2text==2016.1.8,html5lib==0.999,isodate==0.5.0,Jinja2==2.7.3,joblib==0.8.3,jsonpatch==1.3,jsonpointer==1.0,linecache2==1.0.0,logilab-common==1.2.0,logilab-constraint==0.6.0,logilab-database==1.15.0,logilab-mtconverter==0.9.0,lxml==3.4.0,M2Crypto==0.21.1,Mako==1.0.0,Markdown==2.5.1,MarkupSafe==0.23,matplotlib==1.4.2,mercurial==3.5.2,mock==1.0.1,msgpack-python==0.4.2,nose==1.3.4,numexpr==2.4,numpy==1.8.2,oauth==1.0.1,openpyxl==1.7.0,pandas==0.14.1,paramiko==1.15.1,passlib==1.6.5,pep8==1.5.7,Pillow==2.6.1,pluggy==0.3.1,ply==3.4,prettytable==0.7.2,psycopg2==2.5.4,py==1.4.31,pyasn1==0.1.7,pyasn1-modules==0.0.5,pycparser==2.10,pycrypto==2.6.1,Pygments==2.0.1,pyinotify==0.9.4,pyOpenSSL==0.14,pyparsing==2.0.3,pyserial==2.6,pysqlite==2.6.3,python-apt==0.9.3.12,python-augeas==0.4.1,python-dateutil==2.2,python-jenkins==0.2.1,python-ldap==2.4.10,python-yapps==2.1.1,python3-ldap==0.9.4.2,pytz==2012rc0,PyYAML==3.11,pyzmq==14.4.0,rdflib==4.1.2,requestbuilder==0.2.3,requests==2.4.3,roman==2.0.0,rql==0.34.0,rubber==1.1,salt==2015.5.3,scikit-learn==0.14.1,scipy==0.14.0,service-identity==1.0.0,Shapely==1.4.3,simplejson==3.6.5,SimpleTAL==4.1,six==1.8.0,SPARQLWrapper==1.6.0,statsmodels==0.4.2,tables==3.1.1,tox==2.3.1,traceback2==1.4.0,Twisted==16.0.0,unittest2==1.1.0,urllib3==1.9.1,virtualenv==13.1.2,waitress==0.8.10,WebOb==1.5.1,WebTest==2.0.20,wheel==0.24.0,xlrd==0.9.2,xlwt==0.7.5,yams==0.42.0,Yapps==2.2.0,Yapps2==2.2.0,zope.interface==4.1.3
py27-web runtests: PYTHONHASHSEED='121047761'
py27-web runtests: commands[0] | /var/lib/jenkins/jobs/cubicweb-3.23/workspace/TOXENV/py27-web/.tox/py27-web/bin/python -c from logilab.common import pytest; pytest.run() -t /var/lib/jenkins/jobs/cubicweb-3.23/workspace/TOXENV/py27-web/cubicweb/web/test
===================== unittest_views_forms.py ======================
2016-03-15 12:20:42 - (cubicweb.appobject) WARNING: can't find any workflow for CWUser
2016-03-15 12:20:57 - (cubicweb.web) WARNING: [3.17] massmailing extracted to cube massmailing that was not found. try installing it.
2016-03-15 12:20:57 - (cubicweb.web) WARNING: [3.17] igeocoding extracted to cube geocoding that was not found. try installing it.
2016-03-15 12:20:57 - (cubicweb.web) WARNING: [3.17] embedding extracted to cube embed that was not found. try installing it.
2016-03-15 12:20:57 - (cubicweb.web) WARNING: [3.17] isioc extracted to cube sioc that was not found. try installing it.
...
===================== unittest_formwidgets.py ======================
...
========================= unittest_form.py =========================
....2016-03-15 12:20:58 - (py.warnings) WARNING: /var/lib/jenkins/jobs/cubicweb-3.23/workspace/TOXENV/py27-web/cubicweb/web/formfields.py:1201: Warning: [yams 0.38] no targettype specified and there are several relation definitions for rtype tags: ['BlogEntry', 'CWUser', 'Tag']. Yet you get the first rdef.
rdef = eschema.rdef(rschema, role)

...........
=================== unittest_views_baseviews.py ====================
.............
=================== unittest_views_navigation.py ===================
...........
=================== unittest_views_editforms.py ====================
..................
=================== unittest_views_cwsources.py ====================
.
===================== unittest_application.py ======================
2016-03-15 12:21:09 - (cubicweb.web) ERROR: Exception('whatever',)
Traceback (most recent call last):
File "/var/lib/jenkins/jobs/cubicweb-3.23/workspace/TOXENV/py27-web/cubicweb/web/application.py", line 368, in core_handle
result = controller.publish(rset=rset)
File "/var/lib/jenkins/jobs/cubicweb-3.23/workspace/TOXENV/py27-web/cubicweb/web/views/basecontrollers.py", line 136, in publish
rset=rset, view=view)
File "/var/lib/jenkins/jobs/cubicweb-3.23/workspace/TOXENV/py27-web/cubicweb/cwvreg.py", line 225, in main_template
res = obj.render(**kwargs)
File "/var/lib/jenkins/jobs/cubicweb-3.23/workspace/TOXENV/py27-web/cubicweb/view.py", line 138, in render
view_func(**context)
File "/var/lib/jenkins/jobs/cubicweb-3.23/workspace/TOXENV/py27-web/cubicweb/web/views/basetemplates.py", line 163, in call
view.render(w=w)
File "/var/lib/jenkins/jobs/cubicweb-3.23/workspace/TOXENV/py27-web/cubicweb/view.py", line 138, in render
view_func(**context)
File "unittest_application.py", line 510, in call
raise Exception('whatever')
Exception: whatever
2016-03-15 12:21:09 - (py.warnings) WARNING: /var/lib/jenkins/jobs/cubicweb-3.23/workspace/TOXENV/py27-web/cubicweb/devtools/__init__.py:111: RuntimeWarning: anonad6c8db25ce340358e60e557ec5a1b4a Open session found while turning repository off
%sessionid, RuntimeWarning)

.2016-03-15 12:21:11 - (py.warnings) WARNING: /var/lib/jenkins/jobs/cubicweb-3.23/workspace/TOXENV/py27-web/cubicweb/devtools/__init__.py:111: RuntimeWarning: anonf2eef89caec641a58cd257a693862505 Open session found while turning repository off
%sessionid, RuntimeWarning)

....2016-03-15 12:21:18 - (py.warnings) WARNING: /var/lib/jenkins/jobs/cubicweb-3.23/workspace/TOXENV/py27-web/cubicweb/web/formfields.py:1201: Warning: [yams 0.38] no targettype specified and there are several relation definitions for rtype parent: ['Directory', 'Filesystem']. Yet you get the first rdef.
rdef = eschema.rdef(rschema, role)

.......2016-03-15 12:21:25 - (cubicweb.web) WARNING: the view toto could not be found
................
==================== unittest_idownloadable.py =====================
2016-03-15 12:21:28 - (cubicweb.web) ERROR: IOError()
Traceback (most recent call last):
File "/var/lib/jenkins/jobs/cubicweb-3.23/workspace/TOXENV/py27-web/cubicweb/web/application.py", line 368, in core_handle
result = controller.publish(rset=rset)
File "/var/lib/jenkins/jobs/cubicweb-3.23/workspace/TOXENV/py27-web/cubicweb/web/views/basecontrollers.py", line 136, in publish
rset=rset, view=view)
File "/var/lib/jenkins/jobs/cubicweb-3.23/workspace/TOXENV/py27-web/cubicweb/cwvreg.py", line 225, in main_template
res = obj.render(**kwargs)
File "/var/lib/jenkins/jobs/cubicweb-3.23/workspace/TOXENV/py27-web/cubicweb/view.py", line 138, in render
view_func(**context)
File "/var/lib/jenkins/jobs/cubicweb-3.23/workspace/TOXENV/py27-web/cubicweb/web/views/basetemplates.py", line 120, in call
view.render()
File "/var/lib/jenkins/jobs/cubicweb-3.23/workspace/TOXENV/py27-web/cubicweb/view.py", line 138, in render
view_func(**context)
File "/var/lib/jenkins/jobs/cubicweb-3.23/workspace/TOXENV/py27-web/cubicweb/web/views/idownloadable.py", line 94, in call
self.w(adapter.download_data())
File "unittest_idownloadable.py", line 56, in download_data
raise IOError()
IOError
......
====================== unittest_formfields.py ======================
....2016-03-15 12:21:33 - (py.warnings) WARNING: /var/lib/jenkins/jobs/cubicweb-3.23/workspace/TOXENV/py27-web/cubicweb/web/formfields.py:1201: Warning: [yams 0.38] no targettype specified and there are several relation definitions for rtype owned_by: ['RQLExpression', 'CWDataImport', 'Directory', 'Workflow', 'Project', 'CWConstraint', 'CWSourceHostConfig', 'Bookmark', 'CWConstraintType', 'CWGroup', 'CWUniqueTogetherConstraint', 'Personne', 'CWEType', 'CWUser', 'Folder', 'MicroBlog', 'DirectoryPermission', 'ExternalUri', 'CWProperty', 'EmailAddress', 'TrInfo', 'SubWorkflowExitPoint', 'UserAccount', 'BaseTransition', 'CWSourceSchemaConfig', 'CWComputedRType', 'MicroBlogEntry', 'File', 'State', 'CWRelation', 'Transition', 'Salesterm', 'CWAttribute', 'CWCache', 'Filesystem', 'CWSource', 'WorkflowTransition', 'CWRType', 'BlogEntry', 'Societe', 'Tag', 'Ticket', 'TreeNode', 'Version', 'Blog']. Yet you get the first rdef.
rdef = eschema.rdef(rschema, role)

......
====================== unittest_views_json.py ======================
...2016-03-15 12:21:36 - (py.warnings) WARNING: /var/lib/jenkins/jobs/cubicweb-3.23/workspace/TOXENV/py27-web/cubicweb/devtools/__init__.py:111: RuntimeWarning: anond33d032fc31e4e8299687c4a18b08fc7 Open session found while turning repository off
%sessionid, RuntimeWarning)

.2016-03-15 12:21:36 - (cubicweb.web) WARNING: vid table can't be used with jsonp controller, falling back to jsonexport
2016-03-15 12:21:37 - (py.warnings) WARNING: /var/lib/jenkins/jobs/cubicweb-3.23/workspace/TOXENV/py27-web/cubicweb/devtools/__init__.py:111: RuntimeWarning: anonf54e8a18bfb0442d949a12f4135a3c45 Open session found while turning repository off
%sessionid, RuntimeWarning)

.....2016-03-15 12:21:38 - (cubicweb.web) WARNING: vid table can't be used with jsonp controller, falling back to jsonexport
.
====================== unittest_views_csv.py =======================
..
==================== unittest_propertysheet.py =====================
.
======================= unittest_reledit.py ========================
.S2016-03-15 12:21:40 - (cubicweb.rtags) WARNING: using explict subject type in <property object at 0x7fa885f052b8>.tag_object_of() has no effect, use ("*", concerns, Project) instead of (Ticket, concerns, Project)
.
======================================================================
SKIPPED: test_default_forms (unittest_reledit.ClickAndEditFormTC)
Need to check if this test should still run post reledit/doreledit merge
================ unittest_views_basecontrollers.py =================
.................2016-03-15 12:21:53 - (py.warnings) WARNING: /var/lib/jenkins/jobs/cubicweb-3.23/workspace/TOXENV/py27-web/cubicweb/web/formfields.py:1201: Warning: [yams 0.38] no targettype specified and there are several relation definitions for rtype to_entity: ['CWAttribute', 'CWRelation']. Yet you get the first rdef.
rdef = eschema.rdef(rschema, role)

.....2016-03-15 12:21:57 - (py.warnings) WARNING: /var/lib/jenkins/jobs/cubicweb-3.23/workspace/TOXENV/py27-web/cubicweb/web/formfields.py:1201: Warning: [yams 0.38] no targettype specified and there are several relation definitions for rtype read_permission: ['RQLExpression', 'CWGroup']. Yet you get the first rdef.
rdef = eschema.rdef(rschema, role)

2016-03-15 12:21:57 - (cubicweb.session) WARNING: no schema for 7
2016-03-15 12:21:58 - (cubicweb.session) WARNING: no schema for 7
..2016-03-15 12:21:59 - (cubicweb.web) WARNING: param login-subject mis-formatted
....................................FF.....2016-03-15 12:22:27 - (py.warnings) WARNING: /var/lib/jenkins/jobs/cubicweb-3.23/workspace/TOXENV/py27-web/cubicweb/devtools/__init__.py:111: RuntimeWarning: anona9919d7824944f95aa324c077f603c18 Open session found while turning repository off
%sessionid, RuntimeWarning)

.
======================================================================
FAIL: test_http_error_codes_auth_fail (unittest_views_basecontrollers.LoginControllerHTTPTC)
----------------------------------------------------------------------
Traceback (most recent call last)
File "/var/lib/jenkins/jobs/cubicweb-3.23/workspace/TOXENV/py27-web/.tox/py27-web/local/lib/python2.7/site-packages/unittest2/case.py", line 67, in testPartExecutor
yield
File "/var/lib/jenkins/jobs/cubicweb-3.23/workspace/TOXENV/py27-web/.tox/py27-web/local/lib/python2.7/site-packages/unittest2/case.py", line 625, in run
testMethod()
File "/var/lib/jenkins/jobs/cubicweb-3.23/workspace/TOXENV/py27-web/cubicweb/web/test/unittest_views_basecontrollers.py", line 1097, in test_http_error_codes_auth_fail
self.assertEqual(response.status, 403)
File "/var/lib/jenkins/jobs/cubicweb-3.23/workspace/TOXENV/py27-web/.tox/py27-web/local/lib/python2.7/site-packages/unittest2/case.py", line 836, in assertEqual
assertion_func(first, second, msg=msg)
File "/var/lib/jenkins/jobs/cubicweb-3.23/workspace/TOXENV/py27-web/.tox/py27-web/local/lib/python2.7/site-packages/unittest2/case.py", line 829, in _baseAssertEqual
raise self.failureException(msg)
AssertionError: 500 != 403

no stdout
no stderr
======================================================================
FAIL: test_http_error_codes_auth_succeed (unittest_views_basecontrollers.LoginControllerHTTPTC)
----------------------------------------------------------------------
Traceback (most recent call last)
File "/var/lib/jenkins/jobs/cubicweb-3.23/workspace/TOXENV/py27-web/.tox/py27-web/local/lib/python2.7/site-packages/unittest2/case.py", line 67, in testPartExecutor
yield
File "/var/lib/jenkins/jobs/cubicweb-3.23/workspace/TOXENV/py27-web/.tox/py27-web/local/lib/python2.7/site-packages/unittest2/case.py", line 625, in run
testMethod()
File "/var/lib/jenkins/jobs/cubicweb-3.23/workspace/TOXENV/py27-web/cubicweb/web/test/unittest_views_basecontrollers.py", line 1102, in test_http_error_codes_auth_succeed
self.assertEqual(response.status, 303)
File "/var/lib/jenkins/jobs/cubicweb-3.23/workspace/TOXENV/py27-web/.tox/py27-web/local/lib/python2.7/site-packages/unittest2/case.py", line 836, in assertEqual
assertion_func(first, second, msg=msg)
File "/var/lib/jenkins/jobs/cubicweb-3.23/workspace/TOXENV/py27-web/.tox/py27-web/local/lib/python2.7/site-packages/unittest2/case.py", line 829, in _baseAssertEqual
raise self.failureException(msg)
AssertionError: 500 != 303

no stdout
no stderr
===================== unittest_urlpublisher.py =====================
.............
====================== unittest_webconfig.py =======================
...
================= unittest_views_basetemplates.py ==================
..
=============== unittest_views_searchrestriction.py ================
........
======================= unittest_request.py ========================
....
====================== unittest_urlrewrite.py ======================
........
==================== unittest_views_pyviews.py =====================
..
====================== unittest_controller.py ======================
..
=============== unittest_views_staticcontrollers.py ================
.2016-03-15 12:22:45 - (cubicweb.web) ERROR: concatenated data url error: u'dummy.js' file does not exist
.2016-03-15 12:22:45 - (cubicweb.web) ERROR: concatenated data url error: u'dummy.js' file does not exist
....
==================== unittest_views_actions.py =====================
..
========================= unittest_http.py =========================
...........................
==================== unittest_views_treeview.py ====================
.
=================== unittest_views_errorform.py ====================
....
========================= test_jscript.py ==========================
2016-03-15 12:23:01 - (py.warnings) WARNING: /var/lib/jenkins/jobs/cubicweb-3.23/workspace/TOXENV/py27-web/cubicweb/devtools/__init__.py:111: RuntimeWarning: anone452359cbb0149b5b68f4629505e74e8 Open session found while turning repository off
%sessionid, RuntimeWarning)

2016-03-15 12:23:01 - (py.warnings) WARNING: /var/lib/jenkins/jobs/cubicweb-3.23/workspace/TOXENV/py27-web/cubicweb/devtools/__init__.py:111: RuntimeWarning: anon3efd2ded298f420da2c189d845fd2b53 Open session found while turning repository off
%sessionid, RuntimeWarning)

2016-03-15 12:23:01 - (py.warnings) WARNING: /var/lib/jenkins/jobs/cubicweb-3.23/workspace/TOXENV/py27-web/cubicweb/devtools/__init__.py:111: RuntimeWarning: anon66246c015b0249cba99a7e10b07053d9 Open session found while turning repository off
%sessionid, RuntimeWarning)

.
===================== unittest_views_xmlrss.py =====================
.
======================== unittest_uicfg.py =========================
.........
===================== unittest_breadcrumbs.py ======================
.
===================== unittest_viewselector.py =====================
.......................
===================== unittest_magicsearch.py ======================
..................
================= unittest_views_apacherewrite.py ==================
.
========================= unittest_web.py ==========================
..127.0.0.1 - - [15/Mar/2016 12:23:18] "POST /ajax?fname=fileupload HTTP/1.1" 200 135
2016-03-15 12:23:19 - (py.warnings) WARNING: /var/lib/jenkins/jobs/cubicweb-3.23/workspace/TOXENV/py27-web/cubicweb/devtools/__init__.py:111: RuntimeWarning: anonb2174387cdb54118a8af6858f477c0c2 Open session found while turning repository off
%sessionid, RuntimeWarning)

.127.0.0.1 - - [15/Mar/2016 12:23:20] "POST /ajax?fname=fileupload HTTP/1.1" 200 82
2016-03-15 12:23:20 - (py.warnings) WARNING: /var/lib/jenkins/jobs/cubicweb-3.23/workspace/TOXENV/py27-web/cubicweb/devtools/__init__.py:111: RuntimeWarning: anon9b48ff006d044c39ae5e5e3fde634239 Open session found while turning repository off
%sessionid, RuntimeWarning)

.127.0.0.1 - - [15/Mar/2016 12:23:22] "GET / HTTP/1.1" 200 7786
127.0.0.1 - - [15/Mar/2016 12:23:23] "GET / HTTP/1.1" 200 7786
2016-03-15 12:23:23 - (py.warnings) WARNING: /var/lib/jenkins/jobs/cubicweb-3.23/workspace/TOXENV/py27-web/cubicweb/devtools/__init__.py:111: RuntimeWarning: anonb001c3a35fe2433b8bbdbd9d9280228e Open session found while turning repository off
%sessionid, RuntimeWarning)

2016-03-15 12:23:23 - (py.warnings) WARNING: /var/lib/jenkins/jobs/cubicweb-3.23/workspace/TOXENV/py27-web/cubicweb/devtools/__init__.py:111: RuntimeWarning: anondf2d3a8042b54ff4ba61a7ee3e1731f5 Open session found while turning repository off
%sessionid, RuntimeWarning)

.127.0.0.1 - - [15/Mar/2016 12:23:24] "GET //6 HTTP/1.1" 403 5581
127.0.0.1 - - [15/Mar/2016 12:23:25] "GET /login?__login=admin&__password=gingkow HTTP/1.1" 303 0
127.0.0.1 - - [15/Mar/2016 12:23:25] "GET //6 HTTP/1.1" 200 11845
2016-03-15 12:23:25 - (py.warnings) WARNING: /var/lib/jenkins/jobs/cubicweb-3.23/workspace/TOXENV/py27-web/cubicweb/devtools/__init__.py:111: RuntimeWarning: adminca959a42a8474b6a9dd9a1e951f727c9 Open session found while turning repository off
%sessionid, RuntimeWarning)

2016-03-15 12:23:25 - (py.warnings) WARNING: /var/lib/jenkins/jobs/cubicweb-3.23/workspace/TOXENV/py27-web/cubicweb/devtools/__init__.py:111: RuntimeWarning: anon965f83d53b6749e48d504bba05d79f04 Open session found while turning repository off
%sessionid, RuntimeWarning)

.127.0.0.1 - - [15/Mar/2016 12:23:26] "GET / HTTP/1.1" 200 7786
2016-03-15 12:23:26 - (py.warnings) WARNING: /var/lib/jenkins/jobs/cubicweb-3.23/workspace/TOXENV/py27-web/cubicweb/devtools/__init__.py:111: RuntimeWarning: anon568ce27dc7f94e95b9c8b1d927a6d8d9 Open session found while turning repository off
%sessionid, RuntimeWarning)

.127.0.0.1 - - [15/Mar/2016 12:23:28] "GET / HTTP/1.1" 200 7667
2016-03-15 12:23:28 - (py.warnings) WARNING: /var/lib/jenkins/jobs/cubicweb-3.23/workspace/TOXENV/py27-web/cubicweb/devtools/__init__.py:111: RuntimeWarning: anonc32fc115edad4dbdb02b9b98ad814ba0 Open session found while turning repository off
%sessionid, RuntimeWarning)

.127.0.0.1 - - [15/Mar/2016 12:23:29] "GET / HTTP/1.1" 200 7667
2016-03-15 12:23:29 - (py.warnings) WARNING: /var/lib/jenkins/jobs/cubicweb-3.23/workspace/TOXENV/py27-web/cubicweb/devtools/__init__.py:111: RuntimeWarning: anon71f9907627504281ac9556f114f7cd1f Open session found while turning repository off
%sessionid, RuntimeWarning)

.
======================== unittest_facet.py =========================
....................
===================== unittest_http_headers.py =====================
.
========================== test_views.py ===========================
2016-03-15 12:23:34 - (py.warnings) WARNING: /var/lib/jenkins/jobs/cubicweb-3.23/workspace/TOXENV/py27-web/cubicweb/devtools/__init__.py:111: RuntimeWarning: adminb1328add71a54e7d861b57e7fbffe111 Open session found while turning repository off
%sessionid, RuntimeWarning)

2016-03-15 12:23:36 - (py.warnings) WARNING: /var/lib/jenkins/jobs/cubicweb-3.23/workspace/TOXENV/py27-web/cubicweb/web/formfields.py:1201: Warning: [yams 0.38] no targettype specified and there are several relation definitions for rtype constrained_by: ['CWRelation', 'CWAttribute']. Yet you get the first rdef.
rdef = eschema.rdef(rschema, role)

2016-03-15 12:23:48 - (py.warnings) WARNING: /var/lib/jenkins/jobs/cubicweb-3.23/workspace/TOXENV/py27-web/cubicweb/web/formfields.py:1201: Warning: [yams 0.38] no targettype specified and there are several relation definitions for rtype allowed_transition: ['BaseTransition', 'Transition', 'WorkflowTransition']. Yet you get the first rdef.
rdef = eschema.rdef(rschema, role)

..2016-03-15 12:24:39 - (cubicweb.appobject) ERROR: cycle in breadcrumbs for entity <Entity TreeNode 1482 ['cwuri', u'modification_date', u'name'] at 140361172794960>
2016-03-15 12:24:39 - (cubicweb.appobject) ERROR: cycle in breadcrumbs for entity <Entity TreeNode 1482 ['cwuri', u'modification_date', u'name'] at 140361172794960>
2016-03-15 12:24:39 - (cubicweb.appobject) ERROR: cycle in breadcrumbs for entity <Entity TreeNode 1482 ['cwuri', 'creation_date', u'modification_date', u'name'] at 140361172794960>
2016-03-15 12:24:39 - (cubicweb.appobject) ERROR: cycle in breadcrumbs for entity <Entity TreeNode 1482 ['cwuri', 'creation_date', u'modification_date', u'name'] at 140361172794960>
2016-03-15 12:24:39 - (cubicweb.appobject) ERROR: cycle in breadcrumbs for entity <Entity TreeNode 1482 ['cwuri', 'creation_date', u'modification_date', u'name'] at 140361172794960>
2016-03-15 12:24:40 - (cubicweb.appobject) ERROR: cycle in breadcrumbs for entity <Entity TreeNode 1482 ['cwuri', 'creation_date', u'modification_date', u'name'] at 140361172794960>
2016-03-15 12:24:40 - (cubicweb.appobject) ERROR: cycle in breadcrumbs for entity <Entity TreeNode 1482 ['cwuri', 'creation_date', u'modification_date', u'name'] at 140361172794960>
2016-03-15 12:24:40 - (cubicweb.appobject) ERROR: cycle in breadcrumbs for entity <Entity TreeNode 1482 ['cwuri', 'creation_date', u'modification_date', u'name'] at 140361172794960>
2016-03-15 12:24:40 - (cubicweb.appobject) ERROR: cycle in breadcrumbs for entity <Entity TreeNode 1482 ['cwuri', 'creation_date', u'modification_date', u'name'] at 140361172794960>
.....
-> creating tables
-> inserting default user and default groups.
-> storing the schema in the database
-> database for instance data initialized.
Building autopopulate for database tmpdb
*******************************************************************************
Ran 365 test cases in 257.45s (245.37s CPU), 2 failures, 1 skipped
38 modules OK (1 failed)
failures: /var/lib/jenkins/jobs/cubicweb-3.23/workspace/TOXENV/py27-web/cubicweb/web/test/unittest_views_basecontrollers [2/68]
ERROR: InvocationError: '/var/lib/jenkins/jobs/cubicweb-3.23/workspace/TOXENV/py27-web/.tox/py27-web/bin/python -c from logilab.common import pytest; pytest.run() -t /var/lib/jenkins/jobs/cubicweb-3.23/workspace/TOXENV/py27-web/cubicweb/web/test'
___________________________________ summary ____________________________________
ERROR: py27-web: commands failed
Build step 'Execute shell' marked build as failure
Sending e-mails to: dlaxalde@logilab.fr jcr@logilab.fr syt@logilab.fr david@logilab.fr
[PostBuildScript] - Execution post build scripts.
[py27-web] $ /bin/bash -xe /tmp/hudson213020699578854523.sh
+ /var/lib/jenkins/scripts/notify_forge_apycot.py cwo cubicweb 211223ac8170 http://jenkins.logilab.fr/job/cubicweb-3.23/TOXENV=py27-web/66/ --status failure
<br/>

log from execution
download