consoleText

download

20 Started by upstream project "cubicweb-3.23" build number 68
originally caused by:
Started by an SCM change
Building in workspace /var/lib/jenkins/jobs/cubicweb-3.23/workspace/TOXENV/py27-devtools
[py27-devtools] $ hg showconfig paths.default
[py27-devtools] $ hg pull
pulling from http://hg.logilab.org/review/cubicweb
searching for changes
adding changesets
adding manifests
adding file changes
added 3 changesets with 1 changes to 3 files (+1 heads)
5 new obsolescence markers
updating bookmark cubicweb-3.23
(run 'hg heads .' to see heads, 'hg merge' to merge)
[py27-devtools] $ hg update --clean --rev 9b3a4ceff06a8b61966f55206f7e648309268b3f
4 files updated, 0 files merged, 0 files removed, 0 files unresolved
[py27-devtools] $ hg --config extensions.purge= clean --all
[py27-devtools] $ hg log --rev . --template {node}
[py27-devtools] $ hg log --rev . --template {rev}
[py27-devtools] $ hg id --branch
[py27-devtools] $ /bin/bash -xe /tmp/hudson4438809155765252492.sh
+ find . '(' -name 'pgdb*' -o -name 'tmpdb*' ')' -print0
+ xargs -0 rm -rf
[py27-devtools] $ /bin/bash -xe /tmp/hudson6387642374953510887.sh
+ PATH=/usr/lib/postgresql/9.4/bin:/usr/local/bin:/usr/bin:/bin:/usr/local/games:/usr/games
+ tox --recreate
py27-devtools create: /var/lib/jenkins/jobs/cubicweb-3.23/workspace/TOXENV/py27-devtools/.tox/py27-devtools
py27-devtools installdeps: -r/var/lib/jenkins/jobs/cubicweb-3.23/workspace/TOXENV/py27-devtools/cubicweb/devtools/test/requirements.txt
py27-devtools develop-inst: /var/lib/jenkins/jobs/cubicweb-3.23/workspace/TOXENV/py27-devtools
py27-devtools installed: You are using pip version 7.1.2, however version 8.1.0 is available.,You should consider upgrading via the 'pip install --upgrade pip' command.,beautifulsoup4==4.3.2,boto==2.34.0,bzr-etckeeper==0.0.0,cffi==0.8.6,characteristic==0.1.0,chardet==2.3.0,Cheetah==2.4.4,cloud-init==0.7.6,colorama==0.3.2,configobj==5.0.6,coverage==3.7.1,croniter==0.3.4,cryptography==0.6.1,-e hg+http://hg.logilab.org/review/cubicweb@9b3a4ceff06a8b61966f55206f7e648309268b3f#egg=cubicweb-dev,cwclientlib==0.4.1,Cython==0.21.1,decorator==3.4.0,docutils==0.12,ecdsa==0.11,euca2ools==3.1.0,flake8==2.5.4,GDAL==1.10.1,hg-evolve==5.2.1,html2text==2016.1.8,html5lib==0.999,isodate==0.5.0,Jinja2==2.7.3,joblib==0.8.3,jsonpatch==1.3,jsonpointer==1.0,linecache2==1.0.0,logilab-common==1.2.0,logilab-constraint==0.6.0,logilab-database==1.15.0,logilab-mtconverter==0.9.0,lxml==3.4.0,M2Crypto==0.21.1,Mako==1.0.0,Markdown==2.5.1,MarkupSafe==0.23,matplotlib==1.4.2,mccabe==0.4.0,mercurial==3.5.2,mock==1.0.1,msgpack-python==0.4.2,nose==1.3.4,numexpr==2.4,numpy==1.8.2,oauth==1.0.1,openpyxl==1.7.0,pandas==0.14.1,paramiko==1.15.1,passlib==1.6.5,pep8==1.5.7,Pillow==2.6.1,pluggy==0.3.1,ply==3.4,prettytable==0.7.2,psycopg2==2.5.4,py==1.4.31,pyasn1==0.1.7,pyasn1-modules==0.0.5,pycparser==2.10,pycrypto==2.6.1,pyflakes==1.0.0,Pygments==2.0.1,pyinotify==0.9.4,pyOpenSSL==0.14,pyparsing==2.0.3,pyserial==2.6,pysqlite==2.6.3,python-apt==0.9.3.12,python-augeas==0.4.1,python-dateutil==2.2,python-jenkins==0.2.1,python-ldap==2.4.10,python-yapps==2.1.1,python3-ldap==0.9.4.2,pytz==2012rc0,PyYAML==3.11,pyzmq==14.4.0,rdflib==4.1.2,requestbuilder==0.2.3,requests==2.4.3,roman==2.0.0,rql==0.34.0,rubber==1.1,salt==2015.5.3,scikit-learn==0.14.1,scipy==0.14.0,service-identity==1.0.0,Shapely==1.4.3,simplejson==3.6.5,SimpleTAL==4.1,six==1.8.0,SPARQLWrapper==1.6.0,statsmodels==0.4.2,tables==3.1.1,tox==2.3.1,traceback2==1.4.0,Twisted==16.0.0,unittest2==1.1.0,urllib3==1.9.1,virtualenv==13.1.2,waitress==0.8.10,WebOb==1.5.1,WebTest==2.0.20,wheel==0.24.0,xlrd==0.9.2,xlwt==0.7.5,yams==0.42.0,Yapps==2.2.0,Yapps2==2.2.0,zope.interface==4.1.3
py27-devtools runtests: PYTHONHASHSEED='874861828'
py27-devtools runtests: commands[0] | /var/lib/jenkins/jobs/cubicweb-3.23/workspace/TOXENV/py27-devtools/.tox/py27-devtools/bin/python -c from logilab.common import pytest; pytest.run() -t /var/lib/jenkins/jobs/cubicweb-3.23/workspace/TOXENV/py27-devtools/cubicweb/devtools/test
========================= unittest_fill.py =========================
...
======================== unittest_qunit.py =========================
2016-03-15 14:54:15 - (cubicweb.appobject) WARNING: can't find any workflow for CWUser
2016-03-15 14:54:24 - (cubicweb.web) WARNING: [3.17] massmailing extracted to cube massmailing that was not found. try installing it.
2016-03-15 14:54:24 - (cubicweb.web) WARNING: [3.17] igeocoding extracted to cube geocoding that was not found. try installing it.
2016-03-15 14:54:24 - (cubicweb.web) WARNING: [3.17] embedding extracted to cube embed that was not found. try installing it.
2016-03-15 14:54:24 - (cubicweb.web) WARNING: [3.17] isioc extracted to cube sioc that was not found. try installing it.
2016-03-15 14:54:34 - (py.warnings) WARNING: /var/lib/jenkins/jobs/cubicweb-3.23/workspace/TOXENV/py27-devtools/cubicweb/devtools/__init__.py:111: RuntimeWarning: anonf9ddf5b5bdff4e68801ec91fe5e23844 Open session found while turning repository off
%sessionid, RuntimeWarning)

2016-03-15 14:54:34 - (py.warnings) WARNING: /var/lib/jenkins/jobs/cubicweb-3.23/workspace/TOXENV/py27-devtools/cubicweb/devtools/__init__.py:111: RuntimeWarning: anon5c47e5eb0fbe48cc8e4dc83397d7807a Open session found while turning repository off
%sessionid, RuntimeWarning)

2016-03-15 14:54:34 - (py.warnings) WARNING: /var/lib/jenkins/jobs/cubicweb-3.23/workspace/TOXENV/py27-devtools/cubicweb/devtools/__init__.py:111: RuntimeWarning: anon1df810bfbac34b43a4d10b5db232d60f Open session found while turning repository off
%sessionid, RuntimeWarning)

.2016-03-15 14:54:38 - (py.warnings) WARNING: /var/lib/jenkins/jobs/cubicweb-3.23/workspace/TOXENV/py27-devtools/cubicweb/devtools/__init__.py:111: RuntimeWarning: anon670511f973cb4b4a8937b3404a60dfcd Open session found while turning repository off
%sessionid, RuntimeWarning)

.
======================== unittest_dbfill.py ========================
S........
======================================================================
SKIPPED: test_writeme (unittest_dbfill.ConstraintInsertionTC)
Test automatic insertion / Schema Constraints
======================= unittest_testlib.py ========================
....................2016-03-15 14:54:45 - (py.warnings) WARNING: /var/lib/jenkins/jobs/cubicweb-3.23/workspace/TOXENV/py27-devtools/cubicweb/devtools/__init__.py:111: RuntimeWarning: admine2e9773191134353838484d867cf8100 Open session found while turning repository off
%sessionid, RuntimeWarning)

..
========================= unittest_i18n.py =========================
.
======================= unittest_httptest.py =======================
F.F2016-03-15 14:54:51 - (py.warnings) WARNING: /var/lib/jenkins/jobs/cubicweb-3.23/workspace/TOXENV/py27-devtools/cubicweb/devtools/__init__.py:111: RuntimeWarning: adminf7f4b6f5928d44b7aa822299cc8aa758 Open session found while turning repository off
%sessionid, RuntimeWarning)

SF127.0.0.1 - - [15/Mar/2016 14:54:53] "GET / HTTP/1.1" 200 6169
2016-03-15 14:54:53 - (py.warnings) WARNING: /var/lib/jenkins/jobs/cubicweb-3.23/workspace/TOXENV/py27-devtools/cubicweb/devtools/__init__.py:111: RuntimeWarning: anona554ada554b74562a82a525325506c05 Open session found while turning repository off
%sessionid, RuntimeWarning)

.127.0.0.1 - - [15/Mar/2016 14:54:54] "GET / HTTP/1.1" 200 6169
2016-03-15 14:54:54 - (py.warnings) WARNING: /var/lib/jenkins/jobs/cubicweb-3.23/workspace/TOXENV/py27-devtools/cubicweb/devtools/__init__.py:111: RuntimeWarning: anon5956f0a4b1a448119262e8612a631797 Open session found while turning repository off
%sessionid, RuntimeWarning)

.127.0.0.1 - - [15/Mar/2016 14:54:55] "GET / HTTP/1.1" 200 6169
2016-03-15 14:54:55 - (py.warnings) WARNING: /var/lib/jenkins/jobs/cubicweb-3.23/workspace/TOXENV/py27-devtools/cubicweb/devtools/__init__.py:111: RuntimeWarning: anona37d542f90f544acba86a3c3530a783f Open session found while turning repository off
%sessionid, RuntimeWarning)

.127.0.0.1 - - [15/Mar/2016 14:54:55] "GET / HTTP/1.1" 403 3887
127.0.0.1 - - [15/Mar/2016 14:54:57] "GET /login?__login=admin&__password=gingkow HTTP/1.1" 303 0
127.0.0.1 - - [15/Mar/2016 14:54:58] "GET / HTTP/1.1" 200 5964
127.0.0.1 - - [15/Mar/2016 14:54:58] "GET /logout HTTP/1.1" 303 0
127.0.0.1 - - [15/Mar/2016 14:54:58] "GET / HTTP/1.1" 403 3887
.127.0.0.1 - - [15/Mar/2016 14:54:58] "GET / HTTP/1.1" 403 3887
.
======================================================================
FAIL: test_base_url (unittest_httptest.TwistedCWAnonTC)
----------------------------------------------------------------------
Traceback (most recent call last)
File "/var/lib/jenkins/jobs/cubicweb-3.23/workspace/TOXENV/py27-devtools/.tox/py27-devtools/local/lib/python2.7/site-packages/unittest2/case.py", line 67, in testPartExecutor
yield
File "/var/lib/jenkins/jobs/cubicweb-3.23/workspace/TOXENV/py27-devtools/.tox/py27-devtools/local/lib/python2.7/site-packages/unittest2/case.py", line 625, in run
testMethod()
File "/var/lib/jenkins/jobs/cubicweb-3.23/workspace/TOXENV/py27-devtools/cubicweb/devtools/test/unittest_httptest.py", line 40, in test_base_url
self.fail('no mention of base url in retrieved page')
File "/var/lib/jenkins/jobs/cubicweb-3.23/workspace/TOXENV/py27-devtools/.tox/py27-devtools/local/lib/python2.7/site-packages/unittest2/case.py", line 690, in fail
raise self.failureException(msg)
AssertionError: no mention of base url in retrieved page

no stdout
no stderr
======================================================================
FAIL: test_response_anon (unittest_httptest.TwistedCWAnonTC)
----------------------------------------------------------------------
Traceback (most recent call last)
File "/var/lib/jenkins/jobs/cubicweb-3.23/workspace/TOXENV/py27-devtools/.tox/py27-devtools/local/lib/python2.7/site-packages/unittest2/case.py", line 67, in testPartExecutor
yield
File "/var/lib/jenkins/jobs/cubicweb-3.23/workspace/TOXENV/py27-devtools/.tox/py27-devtools/local/lib/python2.7/site-packages/unittest2/case.py", line 625, in run
testMethod()
File "/var/lib/jenkins/jobs/cubicweb-3.23/workspace/TOXENV/py27-devtools/cubicweb/devtools/test/unittest_httptest.py", line 36, in test_response_anon
self.assertEqual(response.status, http_client.OK)
File "/var/lib/jenkins/jobs/cubicweb-3.23/workspace/TOXENV/py27-devtools/.tox/py27-devtools/local/lib/python2.7/site-packages/unittest2/case.py", line 836, in assertEqual
assertion_func(first, second, msg=msg)
File "/var/lib/jenkins/jobs/cubicweb-3.23/workspace/TOXENV/py27-devtools/.tox/py27-devtools/local/lib/python2.7/site-packages/unittest2/case.py", line 829, in _baseAssertEqual
raise self.failureException(msg)
AssertionError: 500 != 200

no stdout
no stderr
======================================================================
FAIL: test_response_denied (unittest_httptest.TwistedCWIdentTC)
----------------------------------------------------------------------
Traceback (most recent call last)
File "/var/lib/jenkins/jobs/cubicweb-3.23/workspace/TOXENV/py27-devtools/.tox/py27-devtools/local/lib/python2.7/site-packages/unittest2/case.py", line 67, in testPartExecutor
yield
File "/var/lib/jenkins/jobs/cubicweb-3.23/workspace/TOXENV/py27-devtools/.tox/py27-devtools/local/lib/python2.7/site-packages/unittest2/case.py", line 625, in run
testMethod()
File "/var/lib/jenkins/jobs/cubicweb-3.23/workspace/TOXENV/py27-devtools/cubicweb/devtools/test/unittest_httptest.py", line 50, in test_response_denied
self.assertEqual(response.status, http_client.FORBIDDEN)
File "/var/lib/jenkins/jobs/cubicweb-3.23/workspace/TOXENV/py27-devtools/.tox/py27-devtools/local/lib/python2.7/site-packages/unittest2/case.py", line 836, in assertEqual
assertion_func(first, second, msg=msg)
File "/var/lib/jenkins/jobs/cubicweb-3.23/workspace/TOXENV/py27-devtools/.tox/py27-devtools/local/lib/python2.7/site-packages/unittest2/case.py", line 829, in _baseAssertEqual
raise self.failureException(msg)
AssertionError: 500 != 403

no stdout
no stderr
======================================================================
SKIPPED: test_login (unittest_httptest.TwistedCWIdentTC)
Already authenticated, "test_response_denied" must have failed
======================= unittest_webtest.py ========================
2016-03-15 14:55:00 - (py.warnings) WARNING: /var/lib/jenkins/jobs/cubicweb-3.23/workspace/TOXENV/py27-devtools/cubicweb/devtools/__init__.py:111: RuntimeWarning: adminc305a07d70cd403382b115c18fdc201b Open session found while turning repository off
%sessionid, RuntimeWarning)

..2016-03-15 14:55:05 - (py.warnings) WARNING: /var/lib/jenkins/jobs/cubicweb-3.23/workspace/TOXENV/py27-devtools/cubicweb/devtools/__init__.py:111: RuntimeWarning: anond5b9817387d34cf79e13e40179877fdf Open session found while turning repository off
%sessionid, RuntimeWarning)

.2016-03-15 14:55:06 - (py.warnings) WARNING: /var/lib/jenkins/jobs/cubicweb-3.23/workspace/TOXENV/py27-devtools/cubicweb/devtools/__init__.py:111: RuntimeWarning: anon637bde1eeb8d4bc7a12f68276e0340ca Open session found while turning repository off
%sessionid, RuntimeWarning)

.
======================== unittest_devctl.py ========================
..
-> creating tables
-> inserting default user and default groups.
-> storing the schema in the database
-> database for instance data initialized.
Building RepoInstancesConsistencyTC for database tmpdb
Building httptest-cwident for database tmpdb
Building webtest-ident for database tmpdb
*******************************************************************************
Ran 52 test cases in 55.29s (42.82s CPU), 3 failures, 2 skipped
7 modules OK (1 failed)
failures: /var/lib/jenkins/jobs/cubicweb-3.23/workspace/TOXENV/py27-devtools/cubicweb/devtools/test/unittest_httptest [3/10]
ERROR: InvocationError: '/var/lib/jenkins/jobs/cubicweb-3.23/workspace/TOXENV/py27-devtools/.tox/py27-devtools/bin/python -c from logilab.common import pytest; pytest.run() -t /var/lib/jenkins/jobs/cubicweb-3.23/workspace/TOXENV/py27-devtools/cubicweb/devtools/test'
___________________________________ summary ____________________________________
ERROR: py27-devtools: commands failed
Build step 'Execute shell' marked build as failure
Sending e-mails to: dlaxalde@logilab.fr jcr@logilab.fr syt@logilab.fr david@logilab.fr
[PostBuildScript] - Execution post build scripts.
[py27-devtools] $ /bin/bash -xe /tmp/hudson6598476268351614350.sh
+ /var/lib/jenkins/scripts/notify_forge_apycot.py cwo cubicweb 9b3a4ceff06a http://jenkins.logilab.fr/job/cubicweb-3.23/TOXENV=py27-devtools/68/ --status failure
<br/>

log from execution
download