consoleText

download

20 Started by upstream project "cubicweb-3.23" build number 70
originally caused by:
Started by an SCM change
Building in workspace /var/lib/jenkins/jobs/cubicweb-3.23/workspace/TOXENV/py27-etwist
[py27-etwist] $ hg showconfig paths.default
[py27-etwist] $ hg pull
pulling from http://hg.logilab.org/review/cubicweb
searching for changes
adding changesets
adding manifests
adding file changes
added 4 changesets with 3 changes to 5 files
4 new obsolescence markers
updating bookmark cubicweb-3.23
(run 'hg update' to get a working copy)
[py27-etwist] $ hg update --clean --rev bd3b032c00bd9a2c4c49c7efc02892b85b1c4ddd
5 files updated, 0 files merged, 0 files removed, 0 files unresolved
[py27-etwist] $ hg --config extensions.purge= clean --all
[py27-etwist] $ hg log --rev . --template {node}
[py27-etwist] $ hg log --rev . --template {rev}
[py27-etwist] $ hg id --branch
[py27-etwist] $ /bin/bash -xe /tmp/hudson8879443516174829193.sh
+ find . '(' -name 'pgdb*' -o -name 'tmpdb*' ')' -print0
+ xargs -0 rm -rf
[py27-etwist] $ /bin/bash -xe /tmp/hudson2327767744685765931.sh
+ PATH=/usr/lib/postgresql/9.4/bin:/usr/local/bin:/usr/bin:/bin:/usr/local/games:/usr/games
+ tox --recreate
py27-etwist create: /var/lib/jenkins/jobs/cubicweb-3.23/workspace/TOXENV/py27-etwist/.tox/py27-etwist
py27-etwist installdeps: -r/var/lib/jenkins/jobs/cubicweb-3.23/workspace/TOXENV/py27-etwist/cubicweb/etwist/test/requirements.txt
py27-etwist develop-inst: /var/lib/jenkins/jobs/cubicweb-3.23/workspace/TOXENV/py27-etwist
py27-etwist installed: You are using pip version 7.1.2, however version 8.1.0 is available.,You should consider upgrading via the 'pip install --upgrade pip' command.,beautifulsoup4==4.3.2,boto==2.34.0,bzr-etckeeper==0.0.0,cffi==0.8.6,characteristic==0.1.0,chardet==2.3.0,Cheetah==2.4.4,cloud-init==0.7.6,colorama==0.3.2,configobj==5.0.6,coverage==3.7.1,croniter==0.3.4,cryptography==0.6.1,-e hg+http://hg.logilab.org/review/cubicweb@bd3b032c00bd9a2c4c49c7efc02892b85b1c4ddd#egg=cubicweb-dev,cwclientlib==0.4.1,Cython==0.21.1,decorator==3.4.0,docutils==0.12,ecdsa==0.11,euca2ools==3.1.0,GDAL==1.10.1,hg-evolve==5.2.1,html2text==2016.1.8,html5lib==0.999,isodate==0.5.0,Jinja2==2.7.3,joblib==0.8.3,jsonpatch==1.3,jsonpointer==1.0,linecache2==1.0.0,logilab-common==1.2.0,logilab-constraint==0.6.0,logilab-database==1.15.0,logilab-mtconverter==0.9.0,lxml==3.4.0,M2Crypto==0.21.1,Mako==1.0.0,Markdown==2.5.1,MarkupSafe==0.23,matplotlib==1.4.2,mercurial==3.5.2,mock==1.0.1,msgpack-python==0.4.2,nose==1.3.4,numexpr==2.4,numpy==1.8.2,oauth==1.0.1,openpyxl==1.7.0,pandas==0.14.1,paramiko==1.15.1,passlib==1.6.5,pep8==1.5.7,Pillow==2.6.1,pluggy==0.3.1,ply==3.4,prettytable==0.7.2,psycopg2==2.5.4,py==1.4.31,pyasn1==0.1.7,pyasn1-modules==0.0.5,pycparser==2.10,pycrypto==2.6.1,Pygments==2.0.1,pyinotify==0.9.4,pyOpenSSL==0.14,pyparsing==2.0.3,pyserial==2.6,pysqlite==2.6.3,python-apt==0.9.3.12,python-augeas==0.4.1,python-dateutil==2.2,python-jenkins==0.2.1,python-ldap==2.4.10,python-yapps==2.1.1,python3-ldap==0.9.4.2,pytz==2012rc0,PyYAML==3.11,pyzmq==14.4.0,rdflib==4.1.2,requestbuilder==0.2.3,requests==2.4.3,roman==2.0.0,rql==0.34.0,rubber==1.1,salt==2015.5.3,scikit-learn==0.14.1,scipy==0.14.0,service-identity==1.0.0,Shapely==1.4.3,simplejson==3.6.5,SimpleTAL==4.1,six==1.8.0,SPARQLWrapper==1.6.0,statsmodels==0.4.2,tables==3.1.1,tox==2.3.1,traceback2==1.4.0,Twisted==16.0.0,unittest2==1.1.0,urllib3==1.9.1,virtualenv==13.1.2,wheel==0.24.0,xlrd==0.9.2,xlwt==0.7.5,yams==0.42.0,Yapps==2.2.0,Yapps2==2.2.0,zope.interface==4.1.3
py27-etwist runtests: PYTHONHASHSEED='1995571365'
py27-etwist runtests: commands[0] | /var/lib/jenkins/jobs/cubicweb-3.23/workspace/TOXENV/py27-etwist/.tox/py27-etwist/bin/python -c from logilab.common import pytest; pytest.run() -t /var/lib/jenkins/jobs/cubicweb-3.23/workspace/TOXENV/py27-etwist/cubicweb/etwist/test
======================== unittest_server.py ========================
2016-03-15 15:44:29 - (cubicweb.appobject) WARNING: can't find any workflow for CWUser
2016-03-15 15:44:38 - (cubicweb.web) WARNING: [3.17] massmailing extracted to cube massmailing that was not found. try installing it.
2016-03-15 15:44:38 - (cubicweb.web) WARNING: [3.17] igeocoding extracted to cube geocoding that was not found. try installing it.
2016-03-15 15:44:38 - (cubicweb.web) WARNING: [3.17] embedding extracted to cube embed that was not found. try installing it.
2016-03-15 15:44:38 - (cubicweb.web) WARNING: [3.17] isioc extracted to cube sioc that was not found. try installing it.
F
======================================================================
FAIL: test_put_content (unittest_server.ETwistHTTPTC)
----------------------------------------------------------------------
Traceback (most recent call last)
File "/var/lib/jenkins/jobs/cubicweb-3.23/workspace/TOXENV/py27-etwist/.tox/py27-etwist/local/lib/python2.7/site-packages/unittest2/case.py", line 67, in testPartExecutor
yield
File "/var/lib/jenkins/jobs/cubicweb-3.23/workspace/TOXENV/py27-etwist/.tox/py27-etwist/local/lib/python2.7/site-packages/unittest2/case.py", line 625, in run
testMethod()
File "/var/lib/jenkins/jobs/cubicweb-3.23/workspace/TOXENV/py27-etwist/cubicweb/etwist/test/unittest_server.py", line 31, in test_put_content
self.assertEqual(body, response.body)
File "/var/lib/jenkins/jobs/cubicweb-3.23/workspace/TOXENV/py27-etwist/.tox/py27-etwist/local/lib/python2.7/site-packages/unittest2/case.py", line 836, in assertEqual
assertion_func(first, second, msg=msg)
File "/var/lib/jenkins/jobs/cubicweb-3.23/workspace/TOXENV/py27-etwist/.tox/py27-etwist/local/lib/python2.7/site-packages/unittest2/case.py", line 1215, in assertMultiLineEqual
self.fail(self._formatMessage(msg, standardMsg))
File "/var/lib/jenkins/jobs/cubicweb-3.23/workspace/TOXENV/py27-etwist/.tox/py27-etwist/local/lib/python2.7/site-packages/unittest2/case.py", line 690, in fail
raise self.failureException(msg)
AssertionError: 'hip=hop' != '<pre>Traceback (most recent call last):\n[669 chars]pre>'
Diff is 720 characters long. Set self.maxDiff to None to see it.

no stdout
no stderr
-> creating tables
-> inserting default user and default groups.
-> storing the schema in the database
-> database for instance data initialized.
*******************************************************************************
Ran 1 test cases in 13.65s (12.08s CPU), 1 failures
0 modules OK (1 failed)
failures: /var/lib/jenkins/jobs/cubicweb-3.23/workspace/TOXENV/py27-etwist/cubicweb/etwist/test/unittest_server [1/1]
ERROR: InvocationError: '/var/lib/jenkins/jobs/cubicweb-3.23/workspace/TOXENV/py27-etwist/.tox/py27-etwist/bin/python -c from logilab.common import pytest; pytest.run() -t /var/lib/jenkins/jobs/cubicweb-3.23/workspace/TOXENV/py27-etwist/cubicweb/etwist/test'
___________________________________ summary ____________________________________
ERROR: py27-etwist: commands failed
Build step 'Execute shell' marked build as failure
Sending e-mails to: dlaxalde@logilab.fr jcr@logilab.fr syt@logilab.fr david@logilab.fr
[PostBuildScript] - Execution post build scripts.
[py27-etwist] $ /bin/bash -xe /tmp/hudson7314252054369014133.sh
+ /var/lib/jenkins/scripts/notify_forge_apycot.py cwo cubicweb bd3b032c00bd http://jenkins.logilab.fr/job/cubicweb-3.23/TOXENV=py27-etwist/70/ --status failure
<br/>

log from execution
download