consoleText

download

20 Started by upstream project "cubicweb-3.23" build number 72
originally caused by:
Started by an SCM change
Building in workspace /var/lib/jenkins/jobs/cubicweb-3.23/workspace/TOXENV/py27-sobjects
[py27-sobjects] $ hg showconfig paths.default
[py27-sobjects] $ hg pull
pulling from http://hg.logilab.org/review/cubicweb
searching for changes
adding changesets
adding manifests
adding file changes
added 1 changesets with 2 changes to 2 files (+1 heads)
(run 'hg heads .' to see heads, 'hg merge' to merge)
[py27-sobjects] $ hg update --clean --rev ed0da4d57b5a9d10971460c7c6d196733f1046fe
12 files updated, 0 files merged, 0 files removed, 0 files unresolved
[py27-sobjects] $ hg --config extensions.purge= clean --all
[py27-sobjects] $ hg log --rev . --template {node}
[py27-sobjects] $ hg log --rev . --template {rev}
[py27-sobjects] $ hg id --branch
[py27-sobjects] $ /bin/bash -xe /tmp/hudson7266308148955236432.sh
+ find . '(' -name 'pgdb*' -o -name 'tmpdb*' ')' -print0
+ xargs -0 rm -rf
[py27-sobjects] $ /bin/bash -xe /tmp/hudson5588194755416360345.sh
+ PATH=/usr/lib/postgresql/9.4/bin:/usr/local/bin:/usr/bin:/bin:/usr/local/games:/usr/games
+ tox --recreate
py27-sobjects create: /var/lib/jenkins/jobs/cubicweb-3.23/workspace/TOXENV/py27-sobjects/.tox/py27-sobjects
py27-sobjects installdeps: -r/var/lib/jenkins/jobs/cubicweb-3.23/workspace/TOXENV/py27-sobjects/cubicweb/sobjects/test/requirements.txt
py27-sobjects develop-inst: /var/lib/jenkins/jobs/cubicweb-3.23/workspace/TOXENV/py27-sobjects
py27-sobjects installed: You are using pip version 7.1.2, however version 8.1.0 is available.,You should consider upgrading via the 'pip install --upgrade pip' command.,beautifulsoup4==4.3.2,boto==2.34.0,bzr-etckeeper==0.0.0,cffi==0.8.6,characteristic==0.1.0,chardet==2.3.0,Cheetah==2.4.4,cloud-init==0.7.6,colorama==0.3.2,configobj==5.0.6,coverage==3.7.1,croniter==0.3.4,cryptography==0.6.1,-e hg+http://hg.logilab.org/review/cubicweb@ed0da4d57b5a9d10971460c7c6d196733f1046fe#egg=cubicweb-dev,cubicweb-card==0.5.8,cubicweb-comment==1.12.1,cwclientlib==0.4.1,Cython==0.21.1,decorator==3.4.0,docutils==0.12,ecdsa==0.11,euca2ools==3.1.0,GDAL==1.10.1,hg-evolve==5.2.1,html2text==2016.1.8,html5lib==0.999,isodate==0.5.0,Jinja2==2.7.3,joblib==0.8.3,jsonpatch==1.3,jsonpointer==1.0,linecache2==1.0.0,logilab-common==1.2.0,logilab-constraint==0.6.0,logilab-database==1.15.0,logilab-mtconverter==0.9.0,lxml==3.4.0,M2Crypto==0.21.1,Mako==1.0.0,Markdown==2.5.1,MarkupSafe==0.23,matplotlib==1.4.2,mercurial==3.5.2,mock==1.0.1,msgpack-python==0.4.2,nose==1.3.4,numexpr==2.4,numpy==1.8.2,oauth==1.0.1,openpyxl==1.7.0,pandas==0.14.1,paramiko==1.15.1,passlib==1.6.5,pep8==1.5.7,Pillow==2.6.1,pluggy==0.3.1,ply==3.4,prettytable==0.7.2,psycopg2==2.5.4,py==1.4.31,pyasn1==0.1.7,pyasn1-modules==0.0.5,pycparser==2.10,pycrypto==2.6.1,Pygments==2.0.1,pyinotify==0.9.4,pyOpenSSL==0.14,pyparsing==2.0.3,pyserial==2.6,pysqlite==2.6.3,python-apt==0.9.3.12,python-augeas==0.4.1,python-dateutil==2.2,python-jenkins==0.2.1,python-ldap==2.4.10,python-yapps==2.1.1,python3-ldap==0.9.4.2,pytz==2012rc0,PyYAML==3.11,pyzmq==14.4.0,rdflib==4.1.2,requestbuilder==0.2.3,requests==2.4.3,roman==2.0.0,rql==0.34.0,rubber==1.1,salt==2015.5.3,scikit-learn==0.14.1,scipy==0.14.0,service-identity==1.0.0,Shapely==1.4.3,simplejson==3.6.5,SimpleTAL==4.1,six==1.8.0,SPARQLWrapper==1.6.0,statsmodels==0.4.2,tables==3.1.1,tox==2.3.1,traceback2==1.4.0,unittest2==1.1.0,urllib3==1.9.1,virtualenv==13.1.2,wheel==0.24.0,xlrd==0.9.2,xlwt==0.7.5,yams==0.42.0,Yapps==2.2.0,Yapps2==2.2.0
py27-sobjects runtests: PYTHONHASHSEED='3461973245'
py27-sobjects runtests: commands[0] | /var/lib/jenkins/jobs/cubicweb-3.23/workspace/TOXENV/py27-sobjects/.tox/py27-sobjects/bin/python -c from logilab.common import pytest; pytest.run() -t /var/lib/jenkins/jobs/cubicweb-3.23/workspace/TOXENV/py27-sobjects/cubicweb/sobjects/test
==================== unittest_register_user.py =====================
2016-03-15 17:04:33 - (cubicweb.appobject) WARNING: can't find any workflow for CWUser
ESS
======================================================================
ERROR: test_register_user_attributes (unittest_register_user.RegisterUserTC)
----------------------------------------------------------------------
Traceback (most recent call last)
File "/var/lib/jenkins/jobs/cubicweb-3.23/workspace/TOXENV/py27-sobjects/.tox/py27-sobjects/local/lib/python2.7/site-packages/unittest2/case.py", line 67, in testPartExecutor
yield
File "/var/lib/jenkins/jobs/cubicweb-3.23/workspace/TOXENV/py27-sobjects/.tox/py27-sobjects/local/lib/python2.7/site-packages/unittest2/case.py", line 621, in run
self.setUp()
File "/var/lib/jenkins/jobs/cubicweb-3.23/workspace/TOXENV/py27-sobjects/cubicweb/devtools/testlib.py", line 448, in setUp
self._init_repo()
File "/var/lib/jenkins/jobs/cubicweb-3.23/workspace/TOXENV/py27-sobjects/cubicweb/devtools/testlib.py", line 357, in _init_repo
db_handler.restore_database(self.test_db_id)
File "/var/lib/jenkins/jobs/cubicweb-3.23/workspace/TOXENV/py27-sobjects/cubicweb/devtools/__init__.py", line 378, in restore_database
self._restore_database(backup_coordinates, config)
File "/var/lib/jenkins/jobs/cubicweb-3.23/workspace/TOXENV/py27-sobjects/cubicweb/devtools/__init__.py", line 815, in _restore_database
self.get_repo()
File "/var/lib/jenkins/jobs/cubicweb-3.23/workspace/TOXENV/py27-sobjects/cubicweb/devtools/__init__.py", line 393, in get_repo
self._repo = self._new_repo(self.config)
File "/var/lib/jenkins/jobs/cubicweb-3.23/workspace/TOXENV/py27-sobjects/cubicweb/devtools/__init__.py", line 407, in _new_repo
repo = config.repository()
File "/var/lib/jenkins/jobs/cubicweb-3.23/workspace/TOXENV/py27-sobjects/cubicweb/cwconfig.py", line 1030, in repository
return Repository(self, TasksManager(), vreg=vreg)
File "/var/lib/jenkins/jobs/cubicweb-3.23/workspace/TOXENV/py27-sobjects/cubicweb/server/repository.py", line 186, in __init__
self.init_cnxset_pool()
File "/var/lib/jenkins/jobs/cubicweb-3.23/workspace/TOXENV/py27-sobjects/cubicweb/server/repository.py", line 228, in init_cnxset_pool
self.set_schema(config.load_schema(expand_cubes=True))
File "/var/lib/jenkins/jobs/cubicweb-3.23/workspace/TOXENV/py27-sobjects/cubicweb/server/repository.py", line 315, in set_schema
self.vreg.set_schema(schema)
File "/var/lib/jenkins/jobs/cubicweb-3.23/workspace/TOXENV/py27-sobjects/cubicweb/cwvreg.py", line 424, in set_schema
self.reload(self.config.appobjects_path(), force_reload=False)
File "/var/lib/jenkins/jobs/cubicweb-3.23/workspace/TOXENV/py27-sobjects/cubicweb/cwvreg.py", line 474, in reload
self.register_objects(path)
File "/var/lib/jenkins/jobs/cubicweb-3.23/workspace/TOXENV/py27-sobjects/cubicweb/cwvreg.py", line 519, in register_objects
path, self.config.extrapath)
File "/var/lib/jenkins/jobs/cubicweb-3.23/workspace/TOXENV/py27-sobjects/.tox/py27-sobjects/local/lib/python2.7/site-packages/logilab/common/registry.py", line 681, in register_objects
self.load_file(filepath, modname)
File "/var/lib/jenkins/jobs/cubicweb-3.23/workspace/TOXENV/py27-sobjects/cubicweb/cwvreg.py", line 484, in load_file
return super(CWRegistryStore, self).load_file(filepath, modname)
File "/var/lib/jenkins/jobs/cubicweb-3.23/workspace/TOXENV/py27-sobjects/.tox/py27-sobjects/local/lib/python2.7/site-packages/logilab/common/registry.py", line 738, in load_file
module = load_module_from_name(modname)
File "/var/lib/jenkins/jobs/cubicweb-3.23/workspace/TOXENV/py27-sobjects/.tox/py27-sobjects/local/lib/python2.7/site-packages/logilab/common/modutils.py", line 125, in load_module_from_name
return load_module_from_modpath(dotted_name.split('.'), path, use_sys)
File "/var/lib/jenkins/jobs/cubicweb-3.23/workspace/TOXENV/py27-sobjects/.tox/py27-sobjects/local/lib/python2.7/site-packages/logilab/common/modutils.py", line 169, in load_module_from_modpath
module = load_module(curname, mp_file, mp_filename, mp_desc)
File "/var/lib/jenkins/jobs/cubicweb-3.23/workspace/TOXENV/py27-sobjects/cubicweb/web/views/workflow.py", line 82, in <module>
class ChangeStateForm(forms.CompositeEntityForm):
File "/var/lib/jenkins/jobs/cubicweb-3.23/workspace/TOXENV/py27-sobjects/cubicweb/web/views/workflow.py", line 90, in ChangeStateForm
{'class': fw.Button.css_class + ' cwjs-edition-cancel'})]
NameError: name 'fw' is not defined

no stdout
no stderr
======================================================================
SKIPPED: test_register_user_groups (unittest_register_user.RegisterUserTC)
repository is not initialised: NameError("name 'fw' is not defined",)
======================================================================
SKIPPED: test_register_user_service (unittest_register_user.RegisterUserTC)
repository is not initialised: NameError("name 'fw' is not defined",)
===================== unittest_cwxmlparser.py ======================
ESSSS
======================================================================
ERROR: test_actions (unittest_cwxmlparser.CWEntityXMLParserTC)
----------------------------------------------------------------------
Traceback (most recent call last)
File "/var/lib/jenkins/jobs/cubicweb-3.23/workspace/TOXENV/py27-sobjects/.tox/py27-sobjects/local/lib/python2.7/site-packages/unittest2/case.py", line 67, in testPartExecutor
yield
File "/var/lib/jenkins/jobs/cubicweb-3.23/workspace/TOXENV/py27-sobjects/.tox/py27-sobjects/local/lib/python2.7/site-packages/unittest2/case.py", line 621, in run
self.setUp()
File "/var/lib/jenkins/jobs/cubicweb-3.23/workspace/TOXENV/py27-sobjects/cubicweb/devtools/testlib.py", line 448, in setUp
self._init_repo()
File "/var/lib/jenkins/jobs/cubicweb-3.23/workspace/TOXENV/py27-sobjects/cubicweb/devtools/testlib.py", line 356, in _init_repo
db_handler.build_db_cache(self.test_db_id, self.pre_setup_database)
File "/var/lib/jenkins/jobs/cubicweb-3.23/workspace/TOXENV/py27-sobjects/cubicweb/devtools/__init__.py", line 502, in build_db_cache
self.restore_database(DEFAULT_EMPTY_DB_ID)
File "/var/lib/jenkins/jobs/cubicweb-3.23/workspace/TOXENV/py27-sobjects/cubicweb/devtools/__init__.py", line 378, in restore_database
self._restore_database(backup_coordinates, config)
File "/var/lib/jenkins/jobs/cubicweb-3.23/workspace/TOXENV/py27-sobjects/cubicweb/devtools/__init__.py", line 815, in _restore_database
self.get_repo()
File "/var/lib/jenkins/jobs/cubicweb-3.23/workspace/TOXENV/py27-sobjects/cubicweb/devtools/__init__.py", line 393, in get_repo
self._repo = self._new_repo(self.config)
File "/var/lib/jenkins/jobs/cubicweb-3.23/workspace/TOXENV/py27-sobjects/cubicweb/devtools/__init__.py", line 407, in _new_repo
repo = config.repository()
File "/var/lib/jenkins/jobs/cubicweb-3.23/workspace/TOXENV/py27-sobjects/cubicweb/cwconfig.py", line 1030, in repository
return Repository(self, TasksManager(), vreg=vreg)
File "/var/lib/jenkins/jobs/cubicweb-3.23/workspace/TOXENV/py27-sobjects/cubicweb/server/repository.py", line 186, in __init__
self.init_cnxset_pool()
File "/var/lib/jenkins/jobs/cubicweb-3.23/workspace/TOXENV/py27-sobjects/cubicweb/server/repository.py", line 228, in init_cnxset_pool
self.set_schema(config.load_schema(expand_cubes=True))
File "/var/lib/jenkins/jobs/cubicweb-3.23/workspace/TOXENV/py27-sobjects/cubicweb/server/repository.py", line 315, in set_schema
self.vreg.set_schema(schema)
File "/var/lib/jenkins/jobs/cubicweb-3.23/workspace/TOXENV/py27-sobjects/cubicweb/cwvreg.py", line 424, in set_schema
self.reload(self.config.appobjects_path(), force_reload=False)
File "/var/lib/jenkins/jobs/cubicweb-3.23/workspace/TOXENV/py27-sobjects/cubicweb/cwvreg.py", line 474, in reload
self.register_objects(path)
File "/var/lib/jenkins/jobs/cubicweb-3.23/workspace/TOXENV/py27-sobjects/cubicweb/cwvreg.py", line 519, in register_objects
path, self.config.extrapath)
File "/var/lib/jenkins/jobs/cubicweb-3.23/workspace/TOXENV/py27-sobjects/.tox/py27-sobjects/local/lib/python2.7/site-packages/logilab/common/registry.py", line 681, in register_objects
self.load_file(filepath, modname)
File "/var/lib/jenkins/jobs/cubicweb-3.23/workspace/TOXENV/py27-sobjects/cubicweb/cwvreg.py", line 484, in load_file
return super(CWRegistryStore, self).load_file(filepath, modname)
File "/var/lib/jenkins/jobs/cubicweb-3.23/workspace/TOXENV/py27-sobjects/.tox/py27-sobjects/local/lib/python2.7/site-packages/logilab/common/registry.py", line 738, in load_file
module = load_module_from_name(modname)
File "/var/lib/jenkins/jobs/cubicweb-3.23/workspace/TOXENV/py27-sobjects/.tox/py27-sobjects/local/lib/python2.7/site-packages/logilab/common/modutils.py", line 125, in load_module_from_name
return load_module_from_modpath(dotted_name.split('.'), path, use_sys)
File "/var/lib/jenkins/jobs/cubicweb-3.23/workspace/TOXENV/py27-sobjects/.tox/py27-sobjects/local/lib/python2.7/site-packages/logilab/common/modutils.py", line 169, in load_module_from_modpath
module = load_module(curname, mp_file, mp_filename, mp_desc)
File "/var/lib/jenkins/jobs/cubicweb-3.23/workspace/TOXENV/py27-sobjects/cubicweb/web/views/workflow.py", line 82, in <module>
class ChangeStateForm(forms.CompositeEntityForm):
File "/var/lib/jenkins/jobs/cubicweb-3.23/workspace/TOXENV/py27-sobjects/cubicweb/web/views/workflow.py", line 90, in ChangeStateForm
{'class': fw.Button.css_class + ' cwjs-edition-cancel'})]
NameError: name 'fw' is not defined

no stdout
no stderr
======================================================================
SKIPPED: test_complete_url (unittest_cwxmlparser.CWEntityXMLParserTC)
repository is not initialised: NameError("name 'fw' is not defined",)
======================================================================
SKIPPED: test_external_entity (unittest_cwxmlparser.CWEntityXMLParserTC)
repository is not initialised: NameError("name 'fw' is not defined",)
======================================================================
SKIPPED: test_noerror_missing_fti_attribute (unittest_cwxmlparser.CWEntityXMLParserTC)
repository is not initialised: NameError("name 'fw' is not defined",)
======================================================================
SKIPPED: test_noerror_unspecified_date (unittest_cwxmlparser.CWEntityXMLParserTC)
repository is not initialised: NameError("name 'fw' is not defined",)
======================== unittest_email.py =========================
ESSS
======================================================================
ERROR: test_cardinality_check (unittest_email.EmailAddressHooksTC)
----------------------------------------------------------------------
Traceback (most recent call last)
File "/var/lib/jenkins/jobs/cubicweb-3.23/workspace/TOXENV/py27-sobjects/.tox/py27-sobjects/local/lib/python2.7/site-packages/unittest2/case.py", line 67, in testPartExecutor
yield
File "/var/lib/jenkins/jobs/cubicweb-3.23/workspace/TOXENV/py27-sobjects/.tox/py27-sobjects/local/lib/python2.7/site-packages/unittest2/case.py", line 621, in run
self.setUp()
File "/var/lib/jenkins/jobs/cubicweb-3.23/workspace/TOXENV/py27-sobjects/cubicweb/devtools/testlib.py", line 448, in setUp
self._init_repo()
File "/var/lib/jenkins/jobs/cubicweb-3.23/workspace/TOXENV/py27-sobjects/cubicweb/devtools/testlib.py", line 357, in _init_repo
db_handler.restore_database(self.test_db_id)
File "/var/lib/jenkins/jobs/cubicweb-3.23/workspace/TOXENV/py27-sobjects/cubicweb/devtools/__init__.py", line 378, in restore_database
self._restore_database(backup_coordinates, config)
File "/var/lib/jenkins/jobs/cubicweb-3.23/workspace/TOXENV/py27-sobjects/cubicweb/devtools/__init__.py", line 815, in _restore_database
self.get_repo()
File "/var/lib/jenkins/jobs/cubicweb-3.23/workspace/TOXENV/py27-sobjects/cubicweb/devtools/__init__.py", line 393, in get_repo
self._repo = self._new_repo(self.config)
File "/var/lib/jenkins/jobs/cubicweb-3.23/workspace/TOXENV/py27-sobjects/cubicweb/devtools/__init__.py", line 407, in _new_repo
repo = config.repository()
File "/var/lib/jenkins/jobs/cubicweb-3.23/workspace/TOXENV/py27-sobjects/cubicweb/cwconfig.py", line 1030, in repository
return Repository(self, TasksManager(), vreg=vreg)
File "/var/lib/jenkins/jobs/cubicweb-3.23/workspace/TOXENV/py27-sobjects/cubicweb/server/repository.py", line 186, in __init__
self.init_cnxset_pool()
File "/var/lib/jenkins/jobs/cubicweb-3.23/workspace/TOXENV/py27-sobjects/cubicweb/server/repository.py", line 228, in init_cnxset_pool
self.set_schema(config.load_schema(expand_cubes=True))
File "/var/lib/jenkins/jobs/cubicweb-3.23/workspace/TOXENV/py27-sobjects/cubicweb/server/repository.py", line 315, in set_schema
self.vreg.set_schema(schema)
File "/var/lib/jenkins/jobs/cubicweb-3.23/workspace/TOXENV/py27-sobjects/cubicweb/cwvreg.py", line 424, in set_schema
self.reload(self.config.appobjects_path(), force_reload=False)
File "/var/lib/jenkins/jobs/cubicweb-3.23/workspace/TOXENV/py27-sobjects/cubicweb/cwvreg.py", line 474, in reload
self.register_objects(path)
File "/var/lib/jenkins/jobs/cubicweb-3.23/workspace/TOXENV/py27-sobjects/cubicweb/cwvreg.py", line 519, in register_objects
path, self.config.extrapath)
File "/var/lib/jenkins/jobs/cubicweb-3.23/workspace/TOXENV/py27-sobjects/.tox/py27-sobjects/local/lib/python2.7/site-packages/logilab/common/registry.py", line 681, in register_objects
self.load_file(filepath, modname)
File "/var/lib/jenkins/jobs/cubicweb-3.23/workspace/TOXENV/py27-sobjects/cubicweb/cwvreg.py", line 484, in load_file
return super(CWRegistryStore, self).load_file(filepath, modname)
File "/var/lib/jenkins/jobs/cubicweb-3.23/workspace/TOXENV/py27-sobjects/.tox/py27-sobjects/local/lib/python2.7/site-packages/logilab/common/registry.py", line 738, in load_file
module = load_module_from_name(modname)
File "/var/lib/jenkins/jobs/cubicweb-3.23/workspace/TOXENV/py27-sobjects/.tox/py27-sobjects/local/lib/python2.7/site-packages/logilab/common/modutils.py", line 125, in load_module_from_name
return load_module_from_modpath(dotted_name.split('.'), path, use_sys)
File "/var/lib/jenkins/jobs/cubicweb-3.23/workspace/TOXENV/py27-sobjects/.tox/py27-sobjects/local/lib/python2.7/site-packages/logilab/common/modutils.py", line 169, in load_module_from_modpath
module = load_module(curname, mp_file, mp_filename, mp_desc)
File "/var/lib/jenkins/jobs/cubicweb-3.23/workspace/TOXENV/py27-sobjects/cubicweb/web/views/workflow.py", line 82, in <module>
class ChangeStateForm(forms.CompositeEntityForm):
File "/var/lib/jenkins/jobs/cubicweb-3.23/workspace/TOXENV/py27-sobjects/cubicweb/web/views/workflow.py", line 90, in ChangeStateForm
{'class': fw.Button.css_class + ' cwjs-edition-cancel'})]
NameError: name 'fw' is not defined

no stdout
no stderr
======================================================================
SKIPPED: test_primary_email_set_use_email (unittest_email.EmailAddressHooksTC)
repository is not initialised: NameError("name 'fw' is not defined",)
======================================================================
SKIPPED: test_security_check (unittest_email.EmailAddressHooksTC)
repository is not initialised: NameError("name 'fw' is not defined",)
======================================================================
SKIPPED: test_use_email_set_primary_email (unittest_email.EmailAddressHooksTC)
repository is not initialised: NameError("name 'fw' is not defined",)
===================== unittest_notification.py =====================
ES
======================================================================
ERROR: test_recipients_finder (unittest_notification.NotificationTC)
----------------------------------------------------------------------
Traceback (most recent call last)
File "/var/lib/jenkins/jobs/cubicweb-3.23/workspace/TOXENV/py27-sobjects/.tox/py27-sobjects/local/lib/python2.7/site-packages/unittest2/case.py", line 67, in testPartExecutor
yield
File "/var/lib/jenkins/jobs/cubicweb-3.23/workspace/TOXENV/py27-sobjects/.tox/py27-sobjects/local/lib/python2.7/site-packages/unittest2/case.py", line 621, in run
self.setUp()
File "/var/lib/jenkins/jobs/cubicweb-3.23/workspace/TOXENV/py27-sobjects/cubicweb/devtools/testlib.py", line 448, in setUp
self._init_repo()
File "/var/lib/jenkins/jobs/cubicweb-3.23/workspace/TOXENV/py27-sobjects/cubicweb/devtools/testlib.py", line 357, in _init_repo
db_handler.restore_database(self.test_db_id)
File "/var/lib/jenkins/jobs/cubicweb-3.23/workspace/TOXENV/py27-sobjects/cubicweb/devtools/__init__.py", line 378, in restore_database
self._restore_database(backup_coordinates, config)
File "/var/lib/jenkins/jobs/cubicweb-3.23/workspace/TOXENV/py27-sobjects/cubicweb/devtools/__init__.py", line 815, in _restore_database
self.get_repo()
File "/var/lib/jenkins/jobs/cubicweb-3.23/workspace/TOXENV/py27-sobjects/cubicweb/devtools/__init__.py", line 393, in get_repo
self._repo = self._new_repo(self.config)
File "/var/lib/jenkins/jobs/cubicweb-3.23/workspace/TOXENV/py27-sobjects/cubicweb/devtools/__init__.py", line 407, in _new_repo
repo = config.repository()
File "/var/lib/jenkins/jobs/cubicweb-3.23/workspace/TOXENV/py27-sobjects/cubicweb/cwconfig.py", line 1030, in repository
return Repository(self, TasksManager(), vreg=vreg)
File "/var/lib/jenkins/jobs/cubicweb-3.23/workspace/TOXENV/py27-sobjects/cubicweb/server/repository.py", line 186, in __init__
self.init_cnxset_pool()
File "/var/lib/jenkins/jobs/cubicweb-3.23/workspace/TOXENV/py27-sobjects/cubicweb/server/repository.py", line 228, in init_cnxset_pool
self.set_schema(config.load_schema(expand_cubes=True))
File "/var/lib/jenkins/jobs/cubicweb-3.23/workspace/TOXENV/py27-sobjects/cubicweb/server/repository.py", line 315, in set_schema
self.vreg.set_schema(schema)
File "/var/lib/jenkins/jobs/cubicweb-3.23/workspace/TOXENV/py27-sobjects/cubicweb/cwvreg.py", line 424, in set_schema
self.reload(self.config.appobjects_path(), force_reload=False)
File "/var/lib/jenkins/jobs/cubicweb-3.23/workspace/TOXENV/py27-sobjects/cubicweb/cwvreg.py", line 474, in reload
self.register_objects(path)
File "/var/lib/jenkins/jobs/cubicweb-3.23/workspace/TOXENV/py27-sobjects/cubicweb/cwvreg.py", line 519, in register_objects
path, self.config.extrapath)
File "/var/lib/jenkins/jobs/cubicweb-3.23/workspace/TOXENV/py27-sobjects/.tox/py27-sobjects/local/lib/python2.7/site-packages/logilab/common/registry.py", line 681, in register_objects
self.load_file(filepath, modname)
File "/var/lib/jenkins/jobs/cubicweb-3.23/workspace/TOXENV/py27-sobjects/cubicweb/cwvreg.py", line 484, in load_file
return super(CWRegistryStore, self).load_file(filepath, modname)
File "/var/lib/jenkins/jobs/cubicweb-3.23/workspace/TOXENV/py27-sobjects/.tox/py27-sobjects/local/lib/python2.7/site-packages/logilab/common/registry.py", line 738, in load_file
module = load_module_from_name(modname)
File "/var/lib/jenkins/jobs/cubicweb-3.23/workspace/TOXENV/py27-sobjects/.tox/py27-sobjects/local/lib/python2.7/site-packages/logilab/common/modutils.py", line 125, in load_module_from_name
return load_module_from_modpath(dotted_name.split('.'), path, use_sys)
File "/var/lib/jenkins/jobs/cubicweb-3.23/workspace/TOXENV/py27-sobjects/.tox/py27-sobjects/local/lib/python2.7/site-packages/logilab/common/modutils.py", line 169, in load_module_from_modpath
module = load_module(curname, mp_file, mp_filename, mp_desc)
File "/var/lib/jenkins/jobs/cubicweb-3.23/workspace/TOXENV/py27-sobjects/cubicweb/web/views/workflow.py", line 82, in <module>
class ChangeStateForm(forms.CompositeEntityForm):
File "/var/lib/jenkins/jobs/cubicweb-3.23/workspace/TOXENV/py27-sobjects/cubicweb/web/views/workflow.py", line 90, in ChangeStateForm
{'class': fw.Button.css_class + ' cwjs-edition-cancel'})]
NameError: name 'fw' is not defined

no stdout
no stderr
======================================================================
SKIPPED: test_status_change_view (unittest_notification.NotificationTC)
repository is not initialised: NameError("name 'fw' is not defined",)
===================== unittest_supervising.py ======================
ES
======================================================================
ERROR: test_nonregr1 (unittest_supervising.SupervisingTC)
----------------------------------------------------------------------
Traceback (most recent call last)
File "/var/lib/jenkins/jobs/cubicweb-3.23/workspace/TOXENV/py27-sobjects/.tox/py27-sobjects/local/lib/python2.7/site-packages/unittest2/case.py", line 67, in testPartExecutor
yield
File "/var/lib/jenkins/jobs/cubicweb-3.23/workspace/TOXENV/py27-sobjects/.tox/py27-sobjects/local/lib/python2.7/site-packages/unittest2/case.py", line 621, in run
self.setUp()
File "/var/lib/jenkins/jobs/cubicweb-3.23/workspace/TOXENV/py27-sobjects/cubicweb/devtools/testlib.py", line 448, in setUp
self._init_repo()
File "/var/lib/jenkins/jobs/cubicweb-3.23/workspace/TOXENV/py27-sobjects/cubicweb/devtools/testlib.py", line 357, in _init_repo
db_handler.restore_database(self.test_db_id)
File "/var/lib/jenkins/jobs/cubicweb-3.23/workspace/TOXENV/py27-sobjects/cubicweb/devtools/__init__.py", line 378, in restore_database
self._restore_database(backup_coordinates, config)
File "/var/lib/jenkins/jobs/cubicweb-3.23/workspace/TOXENV/py27-sobjects/cubicweb/devtools/__init__.py", line 815, in _restore_database
self.get_repo()
File "/var/lib/jenkins/jobs/cubicweb-3.23/workspace/TOXENV/py27-sobjects/cubicweb/devtools/__init__.py", line 393, in get_repo
self._repo = self._new_repo(self.config)
File "/var/lib/jenkins/jobs/cubicweb-3.23/workspace/TOXENV/py27-sobjects/cubicweb/devtools/__init__.py", line 407, in _new_repo
repo = config.repository()
File "/var/lib/jenkins/jobs/cubicweb-3.23/workspace/TOXENV/py27-sobjects/cubicweb/cwconfig.py", line 1030, in repository
return Repository(self, TasksManager(), vreg=vreg)
File "/var/lib/jenkins/jobs/cubicweb-3.23/workspace/TOXENV/py27-sobjects/cubicweb/server/repository.py", line 186, in __init__
self.init_cnxset_pool()
File "/var/lib/jenkins/jobs/cubicweb-3.23/workspace/TOXENV/py27-sobjects/cubicweb/server/repository.py", line 228, in init_cnxset_pool
self.set_schema(config.load_schema(expand_cubes=True))
File "/var/lib/jenkins/jobs/cubicweb-3.23/workspace/TOXENV/py27-sobjects/cubicweb/server/repository.py", line 315, in set_schema
self.vreg.set_schema(schema)
File "/var/lib/jenkins/jobs/cubicweb-3.23/workspace/TOXENV/py27-sobjects/cubicweb/cwvreg.py", line 424, in set_schema
self.reload(self.config.appobjects_path(), force_reload=False)
File "/var/lib/jenkins/jobs/cubicweb-3.23/workspace/TOXENV/py27-sobjects/cubicweb/cwvreg.py", line 474, in reload
self.register_objects(path)
File "/var/lib/jenkins/jobs/cubicweb-3.23/workspace/TOXENV/py27-sobjects/cubicweb/cwvreg.py", line 519, in register_objects
path, self.config.extrapath)
File "/var/lib/jenkins/jobs/cubicweb-3.23/workspace/TOXENV/py27-sobjects/.tox/py27-sobjects/local/lib/python2.7/site-packages/logilab/common/registry.py", line 681, in register_objects
self.load_file(filepath, modname)
File "/var/lib/jenkins/jobs/cubicweb-3.23/workspace/TOXENV/py27-sobjects/cubicweb/cwvreg.py", line 484, in load_file
return super(CWRegistryStore, self).load_file(filepath, modname)
File "/var/lib/jenkins/jobs/cubicweb-3.23/workspace/TOXENV/py27-sobjects/.tox/py27-sobjects/local/lib/python2.7/site-packages/logilab/common/registry.py", line 738, in load_file
module = load_module_from_name(modname)
File "/var/lib/jenkins/jobs/cubicweb-3.23/workspace/TOXENV/py27-sobjects/.tox/py27-sobjects/local/lib/python2.7/site-packages/logilab/common/modutils.py", line 125, in load_module_from_name
return load_module_from_modpath(dotted_name.split('.'), path, use_sys)
File "/var/lib/jenkins/jobs/cubicweb-3.23/workspace/TOXENV/py27-sobjects/.tox/py27-sobjects/local/lib/python2.7/site-packages/logilab/common/modutils.py", line 169, in load_module_from_modpath
module = load_module(curname, mp_file, mp_filename, mp_desc)
File "/var/lib/jenkins/jobs/cubicweb-3.23/workspace/TOXENV/py27-sobjects/cubicweb/web/views/workflow.py", line 82, in <module>
class ChangeStateForm(forms.CompositeEntityForm):
File "/var/lib/jenkins/jobs/cubicweb-3.23/workspace/TOXENV/py27-sobjects/cubicweb/web/views/workflow.py", line 90, in ChangeStateForm
{'class': fw.Button.css_class + ' cwjs-edition-cancel'})]
NameError: name 'fw' is not defined

no stdout
no stderr
======================================================================
SKIPPED: test_supervision (unittest_supervising.SupervisingTC)
repository is not initialised: NameError("name 'fw' is not defined",)
-> creating tables
-> inserting default user and default groups.
-> storing the schema in the database
-> database for instance data initialized.
Building xmlparser for database tmpdb
*******************************************************************************
Ran 16 test cases in 12.54s (11.99s CPU), 5 errors, 11 skipped
0 modules OK (5 failed)
failures: /var/lib/jenkins/jobs/cubicweb-3.23/workspace/TOXENV/py27-sobjects/cubicweb/sobjects/test/unittest_register_user [1/3], /var/lib/jenkins/jobs/cubicweb-3.23/workspace/TOXENV/py27-sobjects/cubicweb/sobjects/test/unittest_cwxmlparser [1/5], /var/lib/jenkins/jobs/cubicweb-3.23/workspace/TOXENV/py27-sobjects/cubicweb/sobjects/test/unittest_email [1/4], /var/lib/jenkins/jobs/cubicweb-3.23/workspace/TOXENV/py27-sobjects/cubicweb/sobjects/test/unittest_notification [1/2], /var/lib/jenkins/jobs/cubicweb-3.23/workspace/TOXENV/py27-sobjects/cubicweb/sobjects/test/unittest_supervising [1/2]
ERROR: InvocationError: '/var/lib/jenkins/jobs/cubicweb-3.23/workspace/TOXENV/py27-sobjects/.tox/py27-sobjects/bin/python -c from logilab.common import pytest; pytest.run() -t /var/lib/jenkins/jobs/cubicweb-3.23/workspace/TOXENV/py27-sobjects/cubicweb/sobjects/test'
___________________________________ summary ____________________________________
ERROR: py27-sobjects: commands failed
Build step 'Execute shell' marked build as failure
Sending e-mails to: dlaxalde@logilab.fr jcr@logilab.fr syt@logilab.fr david@logilab.fr
[PostBuildScript] - Execution post build scripts.
[py27-sobjects] $ /bin/bash -xe /tmp/hudson7245583123667547510.sh
+ /var/lib/jenkins/scripts/notify_forge_apycot.py cwo cubicweb ed0da4d57b5a http://jenkins.logilab.fr/job/cubicweb-3.23/TOXENV=py27-sobjects/72/ --status failure
<br/>

log from execution
download