consoleText

download

20 Started by upstream project "cubicweb-3.23" build number 72
originally caused by:
Started by an SCM change
Building in workspace /var/lib/jenkins/jobs/cubicweb-3.23/workspace/TOXENV/py34-dataimport
[py34-dataimport] $ hg showconfig paths.default
[py34-dataimport] $ hg pull
pulling from http://hg.logilab.org/review/cubicweb
searching for changes
adding changesets
adding manifests
adding file changes
added 1 changesets with 2 changes to 2 files (+1 heads)
(run 'hg heads .' to see heads, 'hg merge' to merge)
[py34-dataimport] $ hg update --clean --rev ed0da4d57b5a9d10971460c7c6d196733f1046fe
12 files updated, 0 files merged, 0 files removed, 0 files unresolved
[py34-dataimport] $ hg --config extensions.purge= clean --all
[py34-dataimport] $ hg log --rev . --template {node}
[py34-dataimport] $ hg log --rev . --template {rev}
[py34-dataimport] $ hg id --branch
[py34-dataimport] $ /bin/bash -xe /tmp/hudson309308335691439131.sh
+ find . '(' -name 'pgdb*' -o -name 'tmpdb*' ')' -print0
+ xargs -0 rm -rf
[py34-dataimport] $ /bin/bash -xe /tmp/hudson7757154148348477715.sh
+ PATH=/usr/lib/postgresql/9.4/bin:/usr/local/bin:/usr/bin:/bin:/usr/local/games:/usr/games
+ tox --recreate
py34-dataimport create: /var/lib/jenkins/jobs/cubicweb-3.23/workspace/TOXENV/py34-dataimport/.tox/py34-dataimport
py34-dataimport installdeps: -e.
py34-dataimport develop-inst: /var/lib/jenkins/jobs/cubicweb-3.23/workspace/TOXENV/py34-dataimport
py34-dataimport installed: You are using pip version 7.1.2, however version 8.1.0 is available.,You should consider upgrading via the 'pip install --upgrade pip' command.,chardet==2.3.0,colorama==0.3.2,-e hg+http://hg.logilab.org/review/cubicweb@ed0da4d57b5a9d10971460c7c6d196733f1046fe#egg=cubicweb-dev,cwclientlib==0.4.1,html2text==2016.1.8,html5lib==0.999,linecache2==1.0.0,logilab-common==1.2.0,logilab-constraint==0.6.0,logilab-database==1.15.0,logilab-mtconverter==0.9.0,lxml==3.5.0,Markdown==2.6.5,passlib==1.6.5,psycopg2==2.5.4,py==1.4.25,pyasn1==0.1.7,python-apt==0.9.3.12,python-dateutil==2.5.0,python3-ldap==0.9.4.2,pytz==2016.1,requests==2.4.3,rql==0.34.0,six==1.8.0,tox==1.9.2,traceback2==1.4.0,unattended-upgrades==0.1,unittest2==1.1.0,urllib3==1.9.1,virtualenv==1.11.6,wheel==0.24.0,yams==0.42.0,Yapps==2.2.0,Yapps2==2.2.0
py34-dataimport runtests: PYTHONHASHSEED='2286446981'
py34-dataimport runtests: commands[0] | /var/lib/jenkins/jobs/cubicweb-3.23/workspace/TOXENV/py34-dataimport/.tox/py34-dataimport/bin/python -c from logilab.common import pytest; pytest.run() -t /var/lib/jenkins/jobs/cubicweb-3.23/workspace/TOXENV/py34-dataimport/cubicweb/dataimport/test
========================= test_pgstore.py ==========================
........2016-03-15 17:06:00 - (cubicweb.appobject) WARNING: can't find any workflow for CWUser
E
======================================================================
ERROR: test_prepare_insert_entity (test_pgstore.SQLGenObjectStoreTC)
----------------------------------------------------------------------
Traceback (most recent call last)
File "/usr/lib/python3.4/unittest/case.py", line 58, in testPartExecutor
yield
File "/usr/lib/python3.4/unittest/case.py", line 573, in run
self.setUp()
File "/var/lib/jenkins/jobs/cubicweb-3.23/workspace/TOXENV/py34-dataimport/cubicweb/devtools/testlib.py", line 448, in setUp
self._init_repo()
File "/var/lib/jenkins/jobs/cubicweb-3.23/workspace/TOXENV/py34-dataimport/cubicweb/devtools/testlib.py", line 357, in _init_repo
db_handler.restore_database(self.test_db_id)
File "/var/lib/jenkins/jobs/cubicweb-3.23/workspace/TOXENV/py34-dataimport/cubicweb/devtools/__init__.py", line 378, in restore_database
self._restore_database(backup_coordinates, config)
File "/var/lib/jenkins/jobs/cubicweb-3.23/workspace/TOXENV/py34-dataimport/cubicweb/devtools/__init__.py", line 815, in _restore_database
self.get_repo()
File "/var/lib/jenkins/jobs/cubicweb-3.23/workspace/TOXENV/py34-dataimport/cubicweb/devtools/__init__.py", line 393, in get_repo
self._repo = self._new_repo(self.config)
File "/var/lib/jenkins/jobs/cubicweb-3.23/workspace/TOXENV/py34-dataimport/cubicweb/devtools/__init__.py", line 407, in _new_repo
repo = config.repository()
File "/var/lib/jenkins/jobs/cubicweb-3.23/workspace/TOXENV/py34-dataimport/cubicweb/cwconfig.py", line 1030, in repository
return Repository(self, TasksManager(), vreg=vreg)
File "/var/lib/jenkins/jobs/cubicweb-3.23/workspace/TOXENV/py34-dataimport/cubicweb/server/repository.py", line 186, in __init__
self.init_cnxset_pool()
File "/var/lib/jenkins/jobs/cubicweb-3.23/workspace/TOXENV/py34-dataimport/cubicweb/server/repository.py", line 228, in init_cnxset_pool
self.set_schema(config.load_schema(expand_cubes=True))
File "/var/lib/jenkins/jobs/cubicweb-3.23/workspace/TOXENV/py34-dataimport/cubicweb/server/repository.py", line 315, in set_schema
self.vreg.set_schema(schema)
File "/var/lib/jenkins/jobs/cubicweb-3.23/workspace/TOXENV/py34-dataimport/cubicweb/cwvreg.py", line 424, in set_schema
self.reload(self.config.appobjects_path(), force_reload=False)
File "/var/lib/jenkins/jobs/cubicweb-3.23/workspace/TOXENV/py34-dataimport/cubicweb/cwvreg.py", line 474, in reload
self.register_objects(path)
File "/var/lib/jenkins/jobs/cubicweb-3.23/workspace/TOXENV/py34-dataimport/cubicweb/cwvreg.py", line 519, in register_objects
path, self.config.extrapath)
File "/var/lib/jenkins/jobs/cubicweb-3.23/workspace/TOXENV/py34-dataimport/.tox/py34-dataimport/lib/python3.4/site-packages/logilab/common/registry.py", line 681, in register_objects
self.load_file(filepath, modname)
File "/var/lib/jenkins/jobs/cubicweb-3.23/workspace/TOXENV/py34-dataimport/cubicweb/cwvreg.py", line 484, in load_file
return super(CWRegistryStore, self).load_file(filepath, modname)
File "/var/lib/jenkins/jobs/cubicweb-3.23/workspace/TOXENV/py34-dataimport/.tox/py34-dataimport/lib/python3.4/site-packages/logilab/common/registry.py", line 738, in load_file
module = load_module_from_name(modname)
File "/var/lib/jenkins/jobs/cubicweb-3.23/workspace/TOXENV/py34-dataimport/.tox/py34-dataimport/lib/python3.4/site-packages/logilab/common/modutils.py", line 125, in load_module_from_name
return load_module_from_modpath(dotted_name.split('.'), path, use_sys)
File "/var/lib/jenkins/jobs/cubicweb-3.23/workspace/TOXENV/py34-dataimport/.tox/py34-dataimport/lib/python3.4/site-packages/logilab/common/modutils.py", line 169, in load_module_from_modpath
module = load_module(curname, mp_file, mp_filename, mp_desc)
File "/var/lib/jenkins/jobs/cubicweb-3.23/workspace/TOXENV/py34-dataimport/.tox/py34-dataimport/lib/python3.4/imp.py", line 235, in load_module
return load_source(name, filename, file)
File "/var/lib/jenkins/jobs/cubicweb-3.23/workspace/TOXENV/py34-dataimport/.tox/py34-dataimport/lib/python3.4/imp.py", line 171, in load_source
module = methods.load()
File "/var/lib/jenkins/jobs/cubicweb-3.23/workspace/TOXENV/py34-dataimport/cubicweb/dataimport/test/<frozen importlib._bootstrap>", line 1220, in load
<no source available>
File "/var/lib/jenkins/jobs/cubicweb-3.23/workspace/TOXENV/py34-dataimport/cubicweb/dataimport/test/<frozen importlib._bootstrap>", line 1200, in _load_unlocked
<no source available>
File "/var/lib/jenkins/jobs/cubicweb-3.23/workspace/TOXENV/py34-dataimport/cubicweb/dataimport/test/<frozen importlib._bootstrap>", line 1129, in _exec
<no source available>
File "/var/lib/jenkins/jobs/cubicweb-3.23/workspace/TOXENV/py34-dataimport/cubicweb/dataimport/test/<frozen importlib._bootstrap>", line 1471, in exec_module
<no source available>
File "/var/lib/jenkins/jobs/cubicweb-3.23/workspace/TOXENV/py34-dataimport/cubicweb/dataimport/test/<frozen importlib._bootstrap>", line 321, in _call_with_frames_removed
<no source available>
File "/var/lib/jenkins/jobs/cubicweb-3.23/workspace/TOXENV/py34-dataimport/cubicweb/web/views/workflow.py", line 82, in <module>
class ChangeStateForm(forms.CompositeEntityForm):
File "/var/lib/jenkins/jobs/cubicweb-3.23/workspace/TOXENV/py34-dataimport/cubicweb/web/views/workflow.py", line 90, in ChangeStateForm
{'class': fw.Button.css_class + ' cwjs-edition-cancel'})]
NameError: name 'fw' is not defined

no stdout
no stderr
=========================== test_csv.py ============================
..
========================== test_stores.py ==========================
ESE
======================================================================
ERROR: test_dont_generate_relation_to_internal_manager (test_stores.MetaGeneratorTC)
----------------------------------------------------------------------
Traceback (most recent call last)
File "/usr/lib/python3.4/unittest/case.py", line 58, in testPartExecutor
yield
File "/usr/lib/python3.4/unittest/case.py", line 573, in run
self.setUp()
File "/var/lib/jenkins/jobs/cubicweb-3.23/workspace/TOXENV/py34-dataimport/cubicweb/devtools/testlib.py", line 448, in setUp
self._init_repo()
File "/var/lib/jenkins/jobs/cubicweb-3.23/workspace/TOXENV/py34-dataimport/cubicweb/devtools/testlib.py", line 357, in _init_repo
db_handler.restore_database(self.test_db_id)
File "/var/lib/jenkins/jobs/cubicweb-3.23/workspace/TOXENV/py34-dataimport/cubicweb/devtools/__init__.py", line 378, in restore_database
self._restore_database(backup_coordinates, config)
File "/var/lib/jenkins/jobs/cubicweb-3.23/workspace/TOXENV/py34-dataimport/cubicweb/devtools/__init__.py", line 815, in _restore_database
self.get_repo()
File "/var/lib/jenkins/jobs/cubicweb-3.23/workspace/TOXENV/py34-dataimport/cubicweb/devtools/__init__.py", line 393, in get_repo
self._repo = self._new_repo(self.config)
File "/var/lib/jenkins/jobs/cubicweb-3.23/workspace/TOXENV/py34-dataimport/cubicweb/devtools/__init__.py", line 407, in _new_repo
repo = config.repository()
File "/var/lib/jenkins/jobs/cubicweb-3.23/workspace/TOXENV/py34-dataimport/cubicweb/cwconfig.py", line 1030, in repository
return Repository(self, TasksManager(), vreg=vreg)
File "/var/lib/jenkins/jobs/cubicweb-3.23/workspace/TOXENV/py34-dataimport/cubicweb/server/repository.py", line 186, in __init__
self.init_cnxset_pool()
File "/var/lib/jenkins/jobs/cubicweb-3.23/workspace/TOXENV/py34-dataimport/cubicweb/server/repository.py", line 228, in init_cnxset_pool
self.set_schema(config.load_schema(expand_cubes=True))
File "/var/lib/jenkins/jobs/cubicweb-3.23/workspace/TOXENV/py34-dataimport/cubicweb/server/repository.py", line 315, in set_schema
self.vreg.set_schema(schema)
File "/var/lib/jenkins/jobs/cubicweb-3.23/workspace/TOXENV/py34-dataimport/cubicweb/cwvreg.py", line 424, in set_schema
self.reload(self.config.appobjects_path(), force_reload=False)
File "/var/lib/jenkins/jobs/cubicweb-3.23/workspace/TOXENV/py34-dataimport/cubicweb/cwvreg.py", line 474, in reload
self.register_objects(path)
File "/var/lib/jenkins/jobs/cubicweb-3.23/workspace/TOXENV/py34-dataimport/cubicweb/cwvreg.py", line 519, in register_objects
path, self.config.extrapath)
File "/var/lib/jenkins/jobs/cubicweb-3.23/workspace/TOXENV/py34-dataimport/.tox/py34-dataimport/lib/python3.4/site-packages/logilab/common/registry.py", line 681, in register_objects
self.load_file(filepath, modname)
File "/var/lib/jenkins/jobs/cubicweb-3.23/workspace/TOXENV/py34-dataimport/cubicweb/cwvreg.py", line 484, in load_file
return super(CWRegistryStore, self).load_file(filepath, modname)
File "/var/lib/jenkins/jobs/cubicweb-3.23/workspace/TOXENV/py34-dataimport/.tox/py34-dataimport/lib/python3.4/site-packages/logilab/common/registry.py", line 738, in load_file
module = load_module_from_name(modname)
File "/var/lib/jenkins/jobs/cubicweb-3.23/workspace/TOXENV/py34-dataimport/.tox/py34-dataimport/lib/python3.4/site-packages/logilab/common/modutils.py", line 125, in load_module_from_name
return load_module_from_modpath(dotted_name.split('.'), path, use_sys)
File "/var/lib/jenkins/jobs/cubicweb-3.23/workspace/TOXENV/py34-dataimport/.tox/py34-dataimport/lib/python3.4/site-packages/logilab/common/modutils.py", line 169, in load_module_from_modpath
module = load_module(curname, mp_file, mp_filename, mp_desc)
File "/var/lib/jenkins/jobs/cubicweb-3.23/workspace/TOXENV/py34-dataimport/.tox/py34-dataimport/lib/python3.4/imp.py", line 235, in load_module
return load_source(name, filename, file)
File "/var/lib/jenkins/jobs/cubicweb-3.23/workspace/TOXENV/py34-dataimport/.tox/py34-dataimport/lib/python3.4/imp.py", line 171, in load_source
module = methods.load()
File "/var/lib/jenkins/jobs/cubicweb-3.23/workspace/TOXENV/py34-dataimport/cubicweb/dataimport/test/<frozen importlib._bootstrap>", line 1220, in load
<no source available>
File "/var/lib/jenkins/jobs/cubicweb-3.23/workspace/TOXENV/py34-dataimport/cubicweb/dataimport/test/<frozen importlib._bootstrap>", line 1200, in _load_unlocked
<no source available>
File "/var/lib/jenkins/jobs/cubicweb-3.23/workspace/TOXENV/py34-dataimport/cubicweb/dataimport/test/<frozen importlib._bootstrap>", line 1129, in _exec
<no source available>
File "/var/lib/jenkins/jobs/cubicweb-3.23/workspace/TOXENV/py34-dataimport/cubicweb/dataimport/test/<frozen importlib._bootstrap>", line 1471, in exec_module
<no source available>
File "/var/lib/jenkins/jobs/cubicweb-3.23/workspace/TOXENV/py34-dataimport/cubicweb/dataimport/test/<frozen importlib._bootstrap>", line 321, in _call_with_frames_removed
<no source available>
File "/var/lib/jenkins/jobs/cubicweb-3.23/workspace/TOXENV/py34-dataimport/cubicweb/web/views/workflow.py", line 82, in <module>
class ChangeStateForm(forms.CompositeEntityForm):
File "/var/lib/jenkins/jobs/cubicweb-3.23/workspace/TOXENV/py34-dataimport/cubicweb/web/views/workflow.py", line 90, in ChangeStateForm
{'class': fw.Button.css_class + ' cwjs-edition-cancel'})]
NameError: name 'fw' is not defined

no stdout
no stderr
======================================================================
ERROR: test_all (test_stores.RQLObjectStoreTC)
----------------------------------------------------------------------
Traceback (most recent call last)
File "/usr/lib/python3.4/unittest/case.py", line 58, in testPartExecutor
yield
File "/usr/lib/python3.4/unittest/case.py", line 573, in run
self.setUp()
File "/var/lib/jenkins/jobs/cubicweb-3.23/workspace/TOXENV/py34-dataimport/cubicweb/devtools/testlib.py", line 448, in setUp
self._init_repo()
File "/var/lib/jenkins/jobs/cubicweb-3.23/workspace/TOXENV/py34-dataimport/cubicweb/devtools/testlib.py", line 357, in _init_repo
db_handler.restore_database(self.test_db_id)
File "/var/lib/jenkins/jobs/cubicweb-3.23/workspace/TOXENV/py34-dataimport/cubicweb/devtools/__init__.py", line 378, in restore_database
self._restore_database(backup_coordinates, config)
File "/var/lib/jenkins/jobs/cubicweb-3.23/workspace/TOXENV/py34-dataimport/cubicweb/devtools/__init__.py", line 815, in _restore_database
self.get_repo()
File "/var/lib/jenkins/jobs/cubicweb-3.23/workspace/TOXENV/py34-dataimport/cubicweb/devtools/__init__.py", line 393, in get_repo
self._repo = self._new_repo(self.config)
File "/var/lib/jenkins/jobs/cubicweb-3.23/workspace/TOXENV/py34-dataimport/cubicweb/devtools/__init__.py", line 407, in _new_repo
repo = config.repository()
File "/var/lib/jenkins/jobs/cubicweb-3.23/workspace/TOXENV/py34-dataimport/cubicweb/cwconfig.py", line 1030, in repository
return Repository(self, TasksManager(), vreg=vreg)
File "/var/lib/jenkins/jobs/cubicweb-3.23/workspace/TOXENV/py34-dataimport/cubicweb/server/repository.py", line 186, in __init__
self.init_cnxset_pool()
File "/var/lib/jenkins/jobs/cubicweb-3.23/workspace/TOXENV/py34-dataimport/cubicweb/server/repository.py", line 228, in init_cnxset_pool
self.set_schema(config.load_schema(expand_cubes=True))
File "/var/lib/jenkins/jobs/cubicweb-3.23/workspace/TOXENV/py34-dataimport/cubicweb/server/repository.py", line 315, in set_schema
self.vreg.set_schema(schema)
File "/var/lib/jenkins/jobs/cubicweb-3.23/workspace/TOXENV/py34-dataimport/cubicweb/cwvreg.py", line 424, in set_schema
self.reload(self.config.appobjects_path(), force_reload=False)
File "/var/lib/jenkins/jobs/cubicweb-3.23/workspace/TOXENV/py34-dataimport/cubicweb/cwvreg.py", line 474, in reload
self.register_objects(path)
File "/var/lib/jenkins/jobs/cubicweb-3.23/workspace/TOXENV/py34-dataimport/cubicweb/cwvreg.py", line 519, in register_objects
path, self.config.extrapath)
File "/var/lib/jenkins/jobs/cubicweb-3.23/workspace/TOXENV/py34-dataimport/.tox/py34-dataimport/lib/python3.4/site-packages/logilab/common/registry.py", line 681, in register_objects
self.load_file(filepath, modname)
File "/var/lib/jenkins/jobs/cubicweb-3.23/workspace/TOXENV/py34-dataimport/cubicweb/cwvreg.py", line 484, in load_file
return super(CWRegistryStore, self).load_file(filepath, modname)
File "/var/lib/jenkins/jobs/cubicweb-3.23/workspace/TOXENV/py34-dataimport/.tox/py34-dataimport/lib/python3.4/site-packages/logilab/common/registry.py", line 738, in load_file
module = load_module_from_name(modname)
File "/var/lib/jenkins/jobs/cubicweb-3.23/workspace/TOXENV/py34-dataimport/.tox/py34-dataimport/lib/python3.4/site-packages/logilab/common/modutils.py", line 125, in load_module_from_name
return load_module_from_modpath(dotted_name.split('.'), path, use_sys)
File "/var/lib/jenkins/jobs/cubicweb-3.23/workspace/TOXENV/py34-dataimport/.tox/py34-dataimport/lib/python3.4/site-packages/logilab/common/modutils.py", line 169, in load_module_from_modpath
module = load_module(curname, mp_file, mp_filename, mp_desc)
File "/var/lib/jenkins/jobs/cubicweb-3.23/workspace/TOXENV/py34-dataimport/.tox/py34-dataimport/lib/python3.4/imp.py", line 235, in load_module
return load_source(name, filename, file)
File "/var/lib/jenkins/jobs/cubicweb-3.23/workspace/TOXENV/py34-dataimport/.tox/py34-dataimport/lib/python3.4/imp.py", line 171, in load_source
module = methods.load()
File "/var/lib/jenkins/jobs/cubicweb-3.23/workspace/TOXENV/py34-dataimport/cubicweb/dataimport/test/<frozen importlib._bootstrap>", line 1220, in load
<no source available>
File "/var/lib/jenkins/jobs/cubicweb-3.23/workspace/TOXENV/py34-dataimport/cubicweb/dataimport/test/<frozen importlib._bootstrap>", line 1200, in _load_unlocked
<no source available>
File "/var/lib/jenkins/jobs/cubicweb-3.23/workspace/TOXENV/py34-dataimport/cubicweb/dataimport/test/<frozen importlib._bootstrap>", line 1129, in _exec
<no source available>
File "/var/lib/jenkins/jobs/cubicweb-3.23/workspace/TOXENV/py34-dataimport/cubicweb/dataimport/test/<frozen importlib._bootstrap>", line 1471, in exec_module
<no source available>
File "/var/lib/jenkins/jobs/cubicweb-3.23/workspace/TOXENV/py34-dataimport/cubicweb/dataimport/test/<frozen importlib._bootstrap>", line 321, in _call_with_frames_removed
<no source available>
File "/var/lib/jenkins/jobs/cubicweb-3.23/workspace/TOXENV/py34-dataimport/cubicweb/web/views/workflow.py", line 82, in <module>
class ChangeStateForm(forms.CompositeEntityForm):
File "/var/lib/jenkins/jobs/cubicweb-3.23/workspace/TOXENV/py34-dataimport/cubicweb/web/views/workflow.py", line 90, in ChangeStateForm
{'class': fw.Button.css_class + ' cwjs-edition-cancel'})]
NameError: name 'fw' is not defined
The files belonging to this database system will be owned by user "jenkins".
This user must also own the server process.

The database cluster will be initialized with locale "C".
The default text search configuration will be set to "english".

Data page checksums are disabled.

creating directory /var/lib/jenkins/jobs/cubicweb-3.23/workspace/TOXENV/py34-dataimport/cubicweb/dataimport/test/data/database/pgdb-test_massive_store ... ok
creating subdirectories ... ok
selecting default max_connections ... 100
selecting default shared_buffers ... 128MB
selecting dynamic shared memory implementation ... posix
creating configuration files ... ok
creating template1 database in /var/lib/jenkins/jobs/cubicweb-3.23/workspace/TOXENV/py34-dataimport/cubicweb/dataimport/test/data/database/pgdb-test_massive_store/base/1 ... ok
initializing pg_authid ... ok
initializing dependencies ... ok
creating system views ... ok
loading system objects' descriptions ... ok
creating collations ... ok
creating conversions ... ok
creating dictionaries ... ok
setting privileges on built-in objects ... ok
creating information schema ... ok
loading PL/pgSQL server-side language ... ok
vacuuming database template1 ... ok
copying template1 to template0 ... ok
copying template1 to postgres ... ok
syncing data to disk ... ok

WARNING: enabling "trust" authentication for local connections
You can change this by editing pg_hba.conf or using the option -A, or
--auth-local and --auth-host, the next time you run initdb.

Success. You can now start the database server using:

postgres -D /var/lib/jenkins/jobs/cubicweb-3.23/workspace/TOXENV/py34-dataimport/cubicweb/dataimport/test/data/database/pgdb-test_massive_store
or
pg_ctl -D /var/lib/jenkins/jobs/cubicweb-3.23/workspace/TOXENV/py34-dataimport/cubicweb/dataimport/test/data/database/pgdb-test_massive_store -l logfile start

waiting for server to start....LOG: database system was shut down at 2016-03-15 17:06:15 CET
LOG: MultiXact member wraparound protections are now enabled
LOG: database system is ready to accept connections
LOG: autovacuum launcher started
done
server started

no stdout
no stderr
======================================================================
SKIPPED: test_dont_generate_specified_values (test_stores.MetaGeneratorTC)
repository is not initialised: NameError("name 'fw' is not defined",)
====================== test_massive_store.py =======================
2016-03-15 17:06:17 - (logilab.database) WARNING: plpgsql language already installed
2016-03-15 17:06:18 - (cubicweb.appobject) WARNING: can't find any workflow for CWUser
Ewaiting for server to shut down...LOG: received fast shutdown request
.LOG: aborting any active transactions
LOG: autovacuum launcher shutting down
FATAL: terminating connection due to administrator command
FATAL: terminating connection due to administrator command
LOG: shutting down
LOG: database system is shut down
done
server stopped
SSSSSSSSSSSSSSS
======================================================================
ERROR: test_autoflush_metadata (test_massive_store.MassImportSimpleTC)
----------------------------------------------------------------------
Traceback (most recent call last)
File "/usr/lib/python3.4/unittest/case.py", line 58, in testPartExecutor
yield
File "/usr/lib/python3.4/unittest/case.py", line 573, in run
self.setUp()
File "/var/lib/jenkins/jobs/cubicweb-3.23/workspace/TOXENV/py34-dataimport/cubicweb/devtools/testlib.py", line 448, in setUp
self._init_repo()
File "/var/lib/jenkins/jobs/cubicweb-3.23/workspace/TOXENV/py34-dataimport/cubicweb/devtools/testlib.py", line 358, in _init_repo
self.repo = db_handler.get_repo(startup=True)
File "/var/lib/jenkins/jobs/cubicweb-3.23/workspace/TOXENV/py34-dataimport/cubicweb/devtools/__init__.py", line 393, in get_repo
self._repo = self._new_repo(self.config)
File "/var/lib/jenkins/jobs/cubicweb-3.23/workspace/TOXENV/py34-dataimport/cubicweb/devtools/__init__.py", line 407, in _new_repo
repo = config.repository()
File "/var/lib/jenkins/jobs/cubicweb-3.23/workspace/TOXENV/py34-dataimport/cubicweb/cwconfig.py", line 1030, in repository
return Repository(self, TasksManager(), vreg=vreg)
File "/var/lib/jenkins/jobs/cubicweb-3.23/workspace/TOXENV/py34-dataimport/cubicweb/server/repository.py", line 186, in __init__
self.init_cnxset_pool()
File "/var/lib/jenkins/jobs/cubicweb-3.23/workspace/TOXENV/py34-dataimport/cubicweb/server/repository.py", line 228, in init_cnxset_pool
self.set_schema(config.load_schema(expand_cubes=True))
File "/var/lib/jenkins/jobs/cubicweb-3.23/workspace/TOXENV/py34-dataimport/cubicweb/server/repository.py", line 315, in set_schema
self.vreg.set_schema(schema)
File "/var/lib/jenkins/jobs/cubicweb-3.23/workspace/TOXENV/py34-dataimport/cubicweb/cwvreg.py", line 424, in set_schema
self.reload(self.config.appobjects_path(), force_reload=False)
File "/var/lib/jenkins/jobs/cubicweb-3.23/workspace/TOXENV/py34-dataimport/cubicweb/cwvreg.py", line 474, in reload
self.register_objects(path)
File "/var/lib/jenkins/jobs/cubicweb-3.23/workspace/TOXENV/py34-dataimport/cubicweb/cwvreg.py", line 519, in register_objects
path, self.config.extrapath)
File "/var/lib/jenkins/jobs/cubicweb-3.23/workspace/TOXENV/py34-dataimport/.tox/py34-dataimport/lib/python3.4/site-packages/logilab/common/registry.py", line 681, in register_objects
self.load_file(filepath, modname)
File "/var/lib/jenkins/jobs/cubicweb-3.23/workspace/TOXENV/py34-dataimport/cubicweb/cwvreg.py", line 484, in load_file
return super(CWRegistryStore, self).load_file(filepath, modname)
File "/var/lib/jenkins/jobs/cubicweb-3.23/workspace/TOXENV/py34-dataimport/.tox/py34-dataimport/lib/python3.4/site-packages/logilab/common/registry.py", line 738, in load_file
module = load_module_from_name(modname)
File "/var/lib/jenkins/jobs/cubicweb-3.23/workspace/TOXENV/py34-dataimport/.tox/py34-dataimport/lib/python3.4/site-packages/logilab/common/modutils.py", line 125, in load_module_from_name
return load_module_from_modpath(dotted_name.split('.'), path, use_sys)
File "/var/lib/jenkins/jobs/cubicweb-3.23/workspace/TOXENV/py34-dataimport/.tox/py34-dataimport/lib/python3.4/site-packages/logilab/common/modutils.py", line 169, in load_module_from_modpath
module = load_module(curname, mp_file, mp_filename, mp_desc)
File "/var/lib/jenkins/jobs/cubicweb-3.23/workspace/TOXENV/py34-dataimport/.tox/py34-dataimport/lib/python3.4/imp.py", line 235, in load_module
return load_source(name, filename, file)
File "/var/lib/jenkins/jobs/cubicweb-3.23/workspace/TOXENV/py34-dataimport/.tox/py34-dataimport/lib/python3.4/imp.py", line 171, in load_source
module = methods.load()
File "/var/lib/jenkins/jobs/cubicweb-3.23/workspace/TOXENV/py34-dataimport/cubicweb/dataimport/test/<frozen importlib._bootstrap>", line 1220, in load
<no source available>
File "/var/lib/jenkins/jobs/cubicweb-3.23/workspace/TOXENV/py34-dataimport/cubicweb/dataimport/test/<frozen importlib._bootstrap>", line 1200, in _load_unlocked
<no source available>
File "/var/lib/jenkins/jobs/cubicweb-3.23/workspace/TOXENV/py34-dataimport/cubicweb/dataimport/test/<frozen importlib._bootstrap>", line 1129, in _exec
<no source available>
File "/var/lib/jenkins/jobs/cubicweb-3.23/workspace/TOXENV/py34-dataimport/cubicweb/dataimport/test/<frozen importlib._bootstrap>", line 1471, in exec_module
<no source available>
File "/var/lib/jenkins/jobs/cubicweb-3.23/workspace/TOXENV/py34-dataimport/cubicweb/dataimport/test/<frozen importlib._bootstrap>", line 321, in _call_with_frames_removed
<no source available>
File "/var/lib/jenkins/jobs/cubicweb-3.23/workspace/TOXENV/py34-dataimport/cubicweb/web/views/workflow.py", line 82, in <module>
class ChangeStateForm(forms.CompositeEntityForm):
File "/var/lib/jenkins/jobs/cubicweb-3.23/workspace/TOXENV/py34-dataimport/cubicweb/web/views/workflow.py", line 90, in ChangeStateForm
{'class': fw.Button.css_class + ' cwjs-edition-cancel'})]
NameError: name 'fw' is not defined

no stdout
no stderr
======================================================================
SKIPPED: test_drop_index (test_massive_store.MassImportSimpleTC)
repository is not initialised: NameError("name 'fw' is not defined",)
======================================================================
SKIPPED: test_drop_index_recreation (test_massive_store.MassImportSimpleTC)
repository is not initialised: NameError("name 'fw' is not defined",)
======================================================================
SKIPPED: test_eid_entity (test_massive_store.MassImportSimpleTC)
repository is not initialised: NameError("name 'fw' is not defined",)
======================================================================
SKIPPED: test_eid_entity_2 (test_massive_store.MassImportSimpleTC)
repository is not initialised: NameError("name 'fw' is not defined",)
======================================================================
SKIPPED: test_eids_seq_range (test_massive_store.MassImportSimpleTC)
repository is not initialised: NameError("name 'fw' is not defined",)
======================================================================
SKIPPED: test_identical_schema (test_massive_store.MassImportSimpleTC)
repository is not initialised: NameError("name 'fw' is not defined",)
======================================================================
SKIPPED: test_index_building (test_massive_store.MassImportSimpleTC)
repository is not initialised: NameError("name 'fw' is not defined",)
======================================================================
SKIPPED: test_massimport_etype_metadata (test_massive_store.MassImportSimpleTC)
repository is not initialised: NameError("name 'fw' is not defined",)
======================================================================
SKIPPED: test_multiple_insert (test_massive_store.MassImportSimpleTC)
repository is not initialised: NameError("name 'fw' is not defined",)
======================================================================
SKIPPED: test_multiple_insert_relation (test_massive_store.MassImportSimpleTC)
repository is not initialised: NameError("name 'fw' is not defined",)
======================================================================
SKIPPED: test_on_commit_callback (test_massive_store.MassImportSimpleTC)
repository is not initialised: NameError("name 'fw' is not defined",)
======================================================================
SKIPPED: test_on_rollback_callback (test_massive_store.MassImportSimpleTC)
repository is not initialised: NameError("name 'fw' is not defined",)
======================================================================
SKIPPED: test_simple_insert (test_massive_store.MassImportSimpleTC)
repository is not initialised: NameError("name 'fw' is not defined",)
======================================================================
SKIPPED: test_slave_mode_exception (test_massive_store.MassImportSimpleTC)
repository is not initialised: NameError("name 'fw' is not defined",)
======================================================================
SKIPPED: test_slave_mode_indexes (test_massive_store.MassImportSimpleTC)
repository is not initialised: NameError("name 'fw' is not defined",)
======================= unittest_importer.py =======================
EEESSSSSSES.
======================================================================
ERROR: test_csv (unittest_importer.DataimportFunctionalTC)
----------------------------------------------------------------------
Traceback (most recent call last)
File "/usr/lib/python3.4/unittest/case.py", line 58, in testPartExecutor
yield
File "/usr/lib/python3.4/unittest/case.py", line 573, in run
self.setUp()
File "/var/lib/jenkins/jobs/cubicweb-3.23/workspace/TOXENV/py34-dataimport/cubicweb/devtools/testlib.py", line 448, in setUp
self._init_repo()
File "/var/lib/jenkins/jobs/cubicweb-3.23/workspace/TOXENV/py34-dataimport/cubicweb/devtools/testlib.py", line 357, in _init_repo
db_handler.restore_database(self.test_db_id)
File "/var/lib/jenkins/jobs/cubicweb-3.23/workspace/TOXENV/py34-dataimport/cubicweb/devtools/__init__.py", line 378, in restore_database
self._restore_database(backup_coordinates, config)
File "/var/lib/jenkins/jobs/cubicweb-3.23/workspace/TOXENV/py34-dataimport/cubicweb/devtools/__init__.py", line 815, in _restore_database
self.get_repo()
File "/var/lib/jenkins/jobs/cubicweb-3.23/workspace/TOXENV/py34-dataimport/cubicweb/devtools/__init__.py", line 393, in get_repo
self._repo = self._new_repo(self.config)
File "/var/lib/jenkins/jobs/cubicweb-3.23/workspace/TOXENV/py34-dataimport/cubicweb/devtools/__init__.py", line 407, in _new_repo
repo = config.repository()
File "/var/lib/jenkins/jobs/cubicweb-3.23/workspace/TOXENV/py34-dataimport/cubicweb/cwconfig.py", line 1030, in repository
return Repository(self, TasksManager(), vreg=vreg)
File "/var/lib/jenkins/jobs/cubicweb-3.23/workspace/TOXENV/py34-dataimport/cubicweb/server/repository.py", line 186, in __init__
self.init_cnxset_pool()
File "/var/lib/jenkins/jobs/cubicweb-3.23/workspace/TOXENV/py34-dataimport/cubicweb/server/repository.py", line 228, in init_cnxset_pool
self.set_schema(config.load_schema(expand_cubes=True))
File "/var/lib/jenkins/jobs/cubicweb-3.23/workspace/TOXENV/py34-dataimport/cubicweb/server/repository.py", line 315, in set_schema
self.vreg.set_schema(schema)
File "/var/lib/jenkins/jobs/cubicweb-3.23/workspace/TOXENV/py34-dataimport/cubicweb/cwvreg.py", line 424, in set_schema
self.reload(self.config.appobjects_path(), force_reload=False)
File "/var/lib/jenkins/jobs/cubicweb-3.23/workspace/TOXENV/py34-dataimport/cubicweb/cwvreg.py", line 474, in reload
self.register_objects(path)
File "/var/lib/jenkins/jobs/cubicweb-3.23/workspace/TOXENV/py34-dataimport/cubicweb/cwvreg.py", line 519, in register_objects
path, self.config.extrapath)
File "/var/lib/jenkins/jobs/cubicweb-3.23/workspace/TOXENV/py34-dataimport/.tox/py34-dataimport/lib/python3.4/site-packages/logilab/common/registry.py", line 681, in register_objects
self.load_file(filepath, modname)
File "/var/lib/jenkins/jobs/cubicweb-3.23/workspace/TOXENV/py34-dataimport/cubicweb/cwvreg.py", line 484, in load_file
return super(CWRegistryStore, self).load_file(filepath, modname)
File "/var/lib/jenkins/jobs/cubicweb-3.23/workspace/TOXENV/py34-dataimport/.tox/py34-dataimport/lib/python3.4/site-packages/logilab/common/registry.py", line 738, in load_file
module = load_module_from_name(modname)
File "/var/lib/jenkins/jobs/cubicweb-3.23/workspace/TOXENV/py34-dataimport/.tox/py34-dataimport/lib/python3.4/site-packages/logilab/common/modutils.py", line 125, in load_module_from_name
return load_module_from_modpath(dotted_name.split('.'), path, use_sys)
File "/var/lib/jenkins/jobs/cubicweb-3.23/workspace/TOXENV/py34-dataimport/.tox/py34-dataimport/lib/python3.4/site-packages/logilab/common/modutils.py", line 169, in load_module_from_modpath
module = load_module(curname, mp_file, mp_filename, mp_desc)
File "/var/lib/jenkins/jobs/cubicweb-3.23/workspace/TOXENV/py34-dataimport/.tox/py34-dataimport/lib/python3.4/imp.py", line 235, in load_module
return load_source(name, filename, file)
File "/var/lib/jenkins/jobs/cubicweb-3.23/workspace/TOXENV/py34-dataimport/.tox/py34-dataimport/lib/python3.4/imp.py", line 171, in load_source
module = methods.load()
File "/var/lib/jenkins/jobs/cubicweb-3.23/workspace/TOXENV/py34-dataimport/cubicweb/dataimport/test/<frozen importlib._bootstrap>", line 1220, in load
<no source available>
File "/var/lib/jenkins/jobs/cubicweb-3.23/workspace/TOXENV/py34-dataimport/cubicweb/dataimport/test/<frozen importlib._bootstrap>", line 1200, in _load_unlocked
<no source available>
File "/var/lib/jenkins/jobs/cubicweb-3.23/workspace/TOXENV/py34-dataimport/cubicweb/dataimport/test/<frozen importlib._bootstrap>", line 1129, in _exec
<no source available>
File "/var/lib/jenkins/jobs/cubicweb-3.23/workspace/TOXENV/py34-dataimport/cubicweb/dataimport/test/<frozen importlib._bootstrap>", line 1471, in exec_module
<no source available>
File "/var/lib/jenkins/jobs/cubicweb-3.23/workspace/TOXENV/py34-dataimport/cubicweb/dataimport/test/<frozen importlib._bootstrap>", line 321, in _call_with_frames_removed
<no source available>
File "/var/lib/jenkins/jobs/cubicweb-3.23/workspace/TOXENV/py34-dataimport/cubicweb/web/views/workflow.py", line 82, in <module>
class ChangeStateForm(forms.CompositeEntityForm):
File "/var/lib/jenkins/jobs/cubicweb-3.23/workspace/TOXENV/py34-dataimport/cubicweb/web/views/workflow.py", line 90, in ChangeStateForm
{'class': fw.Button.css_class + ' cwjs-edition-cancel'})]
NameError: name 'fw' is not defined

no stdout
no stderr
======================================================================
ERROR: test (unittest_importer.DropExtraValuesTC)
----------------------------------------------------------------------
Traceback (most recent call last)
File "/usr/lib/python3.4/unittest/case.py", line 58, in testPartExecutor
yield
File "/usr/lib/python3.4/unittest/case.py", line 573, in run
self.setUp()
File "/var/lib/jenkins/jobs/cubicweb-3.23/workspace/TOXENV/py34-dataimport/cubicweb/devtools/testlib.py", line 448, in setUp
self._init_repo()
File "/var/lib/jenkins/jobs/cubicweb-3.23/workspace/TOXENV/py34-dataimport/cubicweb/devtools/testlib.py", line 357, in _init_repo
db_handler.restore_database(self.test_db_id)
File "/var/lib/jenkins/jobs/cubicweb-3.23/workspace/TOXENV/py34-dataimport/cubicweb/devtools/__init__.py", line 378, in restore_database
self._restore_database(backup_coordinates, config)
File "/var/lib/jenkins/jobs/cubicweb-3.23/workspace/TOXENV/py34-dataimport/cubicweb/devtools/__init__.py", line 815, in _restore_database
self.get_repo()
File "/var/lib/jenkins/jobs/cubicweb-3.23/workspace/TOXENV/py34-dataimport/cubicweb/devtools/__init__.py", line 393, in get_repo
self._repo = self._new_repo(self.config)
File "/var/lib/jenkins/jobs/cubicweb-3.23/workspace/TOXENV/py34-dataimport/cubicweb/devtools/__init__.py", line 407, in _new_repo
repo = config.repository()
File "/var/lib/jenkins/jobs/cubicweb-3.23/workspace/TOXENV/py34-dataimport/cubicweb/cwconfig.py", line 1030, in repository
return Repository(self, TasksManager(), vreg=vreg)
File "/var/lib/jenkins/jobs/cubicweb-3.23/workspace/TOXENV/py34-dataimport/cubicweb/server/repository.py", line 186, in __init__
self.init_cnxset_pool()
File "/var/lib/jenkins/jobs/cubicweb-3.23/workspace/TOXENV/py34-dataimport/cubicweb/server/repository.py", line 228, in init_cnxset_pool
self.set_schema(config.load_schema(expand_cubes=True))
File "/var/lib/jenkins/jobs/cubicweb-3.23/workspace/TOXENV/py34-dataimport/cubicweb/server/repository.py", line 315, in set_schema
self.vreg.set_schema(schema)
File "/var/lib/jenkins/jobs/cubicweb-3.23/workspace/TOXENV/py34-dataimport/cubicweb/cwvreg.py", line 424, in set_schema
self.reload(self.config.appobjects_path(), force_reload=False)
File "/var/lib/jenkins/jobs/cubicweb-3.23/workspace/TOXENV/py34-dataimport/cubicweb/cwvreg.py", line 474, in reload
self.register_objects(path)
File "/var/lib/jenkins/jobs/cubicweb-3.23/workspace/TOXENV/py34-dataimport/cubicweb/cwvreg.py", line 519, in register_objects
path, self.config.extrapath)
File "/var/lib/jenkins/jobs/cubicweb-3.23/workspace/TOXENV/py34-dataimport/.tox/py34-dataimport/lib/python3.4/site-packages/logilab/common/registry.py", line 681, in register_objects
self.load_file(filepath, modname)
File "/var/lib/jenkins/jobs/cubicweb-3.23/workspace/TOXENV/py34-dataimport/cubicweb/cwvreg.py", line 484, in load_file
return super(CWRegistryStore, self).load_file(filepath, modname)
File "/var/lib/jenkins/jobs/cubicweb-3.23/workspace/TOXENV/py34-dataimport/.tox/py34-dataimport/lib/python3.4/site-packages/logilab/common/registry.py", line 738, in load_file
module = load_module_from_name(modname)
File "/var/lib/jenkins/jobs/cubicweb-3.23/workspace/TOXENV/py34-dataimport/.tox/py34-dataimport/lib/python3.4/site-packages/logilab/common/modutils.py", line 125, in load_module_from_name
return load_module_from_modpath(dotted_name.split('.'), path, use_sys)
File "/var/lib/jenkins/jobs/cubicweb-3.23/workspace/TOXENV/py34-dataimport/.tox/py34-dataimport/lib/python3.4/site-packages/logilab/common/modutils.py", line 169, in load_module_from_modpath
module = load_module(curname, mp_file, mp_filename, mp_desc)
File "/var/lib/jenkins/jobs/cubicweb-3.23/workspace/TOXENV/py34-dataimport/.tox/py34-dataimport/lib/python3.4/imp.py", line 235, in load_module
return load_source(name, filename, file)
File "/var/lib/jenkins/jobs/cubicweb-3.23/workspace/TOXENV/py34-dataimport/.tox/py34-dataimport/lib/python3.4/imp.py", line 171, in load_source
module = methods.load()
File "/var/lib/jenkins/jobs/cubicweb-3.23/workspace/TOXENV/py34-dataimport/cubicweb/dataimport/test/<frozen importlib._bootstrap>", line 1220, in load
<no source available>
File "/var/lib/jenkins/jobs/cubicweb-3.23/workspace/TOXENV/py34-dataimport/cubicweb/dataimport/test/<frozen importlib._bootstrap>", line 1200, in _load_unlocked
<no source available>
File "/var/lib/jenkins/jobs/cubicweb-3.23/workspace/TOXENV/py34-dataimport/cubicweb/dataimport/test/<frozen importlib._bootstrap>", line 1129, in _exec
<no source available>
File "/var/lib/jenkins/jobs/cubicweb-3.23/workspace/TOXENV/py34-dataimport/cubicweb/dataimport/test/<frozen importlib._bootstrap>", line 1471, in exec_module
<no source available>
File "/var/lib/jenkins/jobs/cubicweb-3.23/workspace/TOXENV/py34-dataimport/cubicweb/dataimport/test/<frozen importlib._bootstrap>", line 321, in _call_with_frames_removed
<no source available>
File "/var/lib/jenkins/jobs/cubicweb-3.23/workspace/TOXENV/py34-dataimport/cubicweb/web/views/workflow.py", line 82, in <module>
class ChangeStateForm(forms.CompositeEntityForm):
File "/var/lib/jenkins/jobs/cubicweb-3.23/workspace/TOXENV/py34-dataimport/cubicweb/web/views/workflow.py", line 90, in ChangeStateForm
{'class': fw.Button.css_class + ' cwjs-edition-cancel'})]
NameError: name 'fw' is not defined

no stdout
no stderr
======================================================================
ERROR: test_import_inlined_relation (unittest_importer.ExtEntitiesImporterTC)
Check import of ext entities with inlined relation
----------------------------------------------------------------------
Traceback (most recent call last)
File "/usr/lib/python3.4/unittest/case.py", line 58, in testPartExecutor
yield
File "/usr/lib/python3.4/unittest/case.py", line 573, in run
self.setUp()
File "/var/lib/jenkins/jobs/cubicweb-3.23/workspace/TOXENV/py34-dataimport/cubicweb/devtools/testlib.py", line 448, in setUp
self._init_repo()
File "/var/lib/jenkins/jobs/cubicweb-3.23/workspace/TOXENV/py34-dataimport/cubicweb/devtools/testlib.py", line 357, in _init_repo
db_handler.restore_database(self.test_db_id)
File "/var/lib/jenkins/jobs/cubicweb-3.23/workspace/TOXENV/py34-dataimport/cubicweb/devtools/__init__.py", line 378, in restore_database
self._restore_database(backup_coordinates, config)
File "/var/lib/jenkins/jobs/cubicweb-3.23/workspace/TOXENV/py34-dataimport/cubicweb/devtools/__init__.py", line 815, in _restore_database
self.get_repo()
File "/var/lib/jenkins/jobs/cubicweb-3.23/workspace/TOXENV/py34-dataimport/cubicweb/devtools/__init__.py", line 393, in get_repo
self._repo = self._new_repo(self.config)
File "/var/lib/jenkins/jobs/cubicweb-3.23/workspace/TOXENV/py34-dataimport/cubicweb/devtools/__init__.py", line 407, in _new_repo
repo = config.repository()
File "/var/lib/jenkins/jobs/cubicweb-3.23/workspace/TOXENV/py34-dataimport/cubicweb/cwconfig.py", line 1030, in repository
return Repository(self, TasksManager(), vreg=vreg)
File "/var/lib/jenkins/jobs/cubicweb-3.23/workspace/TOXENV/py34-dataimport/cubicweb/server/repository.py", line 186, in __init__
self.init_cnxset_pool()
File "/var/lib/jenkins/jobs/cubicweb-3.23/workspace/TOXENV/py34-dataimport/cubicweb/server/repository.py", line 228, in init_cnxset_pool
self.set_schema(config.load_schema(expand_cubes=True))
File "/var/lib/jenkins/jobs/cubicweb-3.23/workspace/TOXENV/py34-dataimport/cubicweb/server/repository.py", line 315, in set_schema
self.vreg.set_schema(schema)
File "/var/lib/jenkins/jobs/cubicweb-3.23/workspace/TOXENV/py34-dataimport/cubicweb/cwvreg.py", line 424, in set_schema
self.reload(self.config.appobjects_path(), force_reload=False)
File "/var/lib/jenkins/jobs/cubicweb-3.23/workspace/TOXENV/py34-dataimport/cubicweb/cwvreg.py", line 474, in reload
self.register_objects(path)
File "/var/lib/jenkins/jobs/cubicweb-3.23/workspace/TOXENV/py34-dataimport/cubicweb/cwvreg.py", line 519, in register_objects
path, self.config.extrapath)
File "/var/lib/jenkins/jobs/cubicweb-3.23/workspace/TOXENV/py34-dataimport/.tox/py34-dataimport/lib/python3.4/site-packages/logilab/common/registry.py", line 681, in register_objects
self.load_file(filepath, modname)
File "/var/lib/jenkins/jobs/cubicweb-3.23/workspace/TOXENV/py34-dataimport/cubicweb/cwvreg.py", line 484, in load_file
return super(CWRegistryStore, self).load_file(filepath, modname)
File "/var/lib/jenkins/jobs/cubicweb-3.23/workspace/TOXENV/py34-dataimport/.tox/py34-dataimport/lib/python3.4/site-packages/logilab/common/registry.py", line 738, in load_file
module = load_module_from_name(modname)
File "/var/lib/jenkins/jobs/cubicweb-3.23/workspace/TOXENV/py34-dataimport/.tox/py34-dataimport/lib/python3.4/site-packages/logilab/common/modutils.py", line 125, in load_module_from_name
return load_module_from_modpath(dotted_name.split('.'), path, use_sys)
File "/var/lib/jenkins/jobs/cubicweb-3.23/workspace/TOXENV/py34-dataimport/.tox/py34-dataimport/lib/python3.4/site-packages/logilab/common/modutils.py", line 169, in load_module_from_modpath
module = load_module(curname, mp_file, mp_filename, mp_desc)
File "/var/lib/jenkins/jobs/cubicweb-3.23/workspace/TOXENV/py34-dataimport/.tox/py34-dataimport/lib/python3.4/imp.py", line 235, in load_module
return load_source(name, filename, file)
File "/var/lib/jenkins/jobs/cubicweb-3.23/workspace/TOXENV/py34-dataimport/.tox/py34-dataimport/lib/python3.4/imp.py", line 171, in load_source
module = methods.load()
File "/var/lib/jenkins/jobs/cubicweb-3.23/workspace/TOXENV/py34-dataimport/cubicweb/dataimport/test/<frozen importlib._bootstrap>", line 1220, in load
<no source available>
File "/var/lib/jenkins/jobs/cubicweb-3.23/workspace/TOXENV/py34-dataimport/cubicweb/dataimport/test/<frozen importlib._bootstrap>", line 1200, in _load_unlocked
<no source available>
File "/var/lib/jenkins/jobs/cubicweb-3.23/workspace/TOXENV/py34-dataimport/cubicweb/dataimport/test/<frozen importlib._bootstrap>", line 1129, in _exec
<no source available>
File "/var/lib/jenkins/jobs/cubicweb-3.23/workspace/TOXENV/py34-dataimport/cubicweb/dataimport/test/<frozen importlib._bootstrap>", line 1471, in exec_module
<no source available>
File "/var/lib/jenkins/jobs/cubicweb-3.23/workspace/TOXENV/py34-dataimport/cubicweb/dataimport/test/<frozen importlib._bootstrap>", line 321, in _call_with_frames_removed
<no source available>
File "/var/lib/jenkins/jobs/cubicweb-3.23/workspace/TOXENV/py34-dataimport/cubicweb/web/views/workflow.py", line 82, in <module>
class ChangeStateForm(forms.CompositeEntityForm):
File "/var/lib/jenkins/jobs/cubicweb-3.23/workspace/TOXENV/py34-dataimport/cubicweb/web/views/workflow.py", line 90, in ChangeStateForm
{'class': fw.Button.css_class + ' cwjs-edition-cancel'})]
NameError: name 'fw' is not defined

no stdout
no stderr
======================================================================
ERROR: test_nosource (unittest_importer.RelationMappingTC)
----------------------------------------------------------------------
Traceback (most recent call last)
File "/usr/lib/python3.4/unittest/case.py", line 58, in testPartExecutor
yield
File "/usr/lib/python3.4/unittest/case.py", line 573, in run
self.setUp()
File "/var/lib/jenkins/jobs/cubicweb-3.23/workspace/TOXENV/py34-dataimport/cubicweb/devtools/testlib.py", line 448, in setUp
self._init_repo()
File "/var/lib/jenkins/jobs/cubicweb-3.23/workspace/TOXENV/py34-dataimport/cubicweb/devtools/testlib.py", line 357, in _init_repo
db_handler.restore_database(self.test_db_id)
File "/var/lib/jenkins/jobs/cubicweb-3.23/workspace/TOXENV/py34-dataimport/cubicweb/devtools/__init__.py", line 378, in restore_database
self._restore_database(backup_coordinates, config)
File "/var/lib/jenkins/jobs/cubicweb-3.23/workspace/TOXENV/py34-dataimport/cubicweb/devtools/__init__.py", line 815, in _restore_database
self.get_repo()
File "/var/lib/jenkins/jobs/cubicweb-3.23/workspace/TOXENV/py34-dataimport/cubicweb/devtools/__init__.py", line 393, in get_repo
self._repo = self._new_repo(self.config)
File "/var/lib/jenkins/jobs/cubicweb-3.23/workspace/TOXENV/py34-dataimport/cubicweb/devtools/__init__.py", line 407, in _new_repo
repo = config.repository()
File "/var/lib/jenkins/jobs/cubicweb-3.23/workspace/TOXENV/py34-dataimport/cubicweb/cwconfig.py", line 1030, in repository
return Repository(self, TasksManager(), vreg=vreg)
File "/var/lib/jenkins/jobs/cubicweb-3.23/workspace/TOXENV/py34-dataimport/cubicweb/server/repository.py", line 186, in __init__
self.init_cnxset_pool()
File "/var/lib/jenkins/jobs/cubicweb-3.23/workspace/TOXENV/py34-dataimport/cubicweb/server/repository.py", line 228, in init_cnxset_pool
self.set_schema(config.load_schema(expand_cubes=True))
File "/var/lib/jenkins/jobs/cubicweb-3.23/workspace/TOXENV/py34-dataimport/cubicweb/server/repository.py", line 315, in set_schema
self.vreg.set_schema(schema)
File "/var/lib/jenkins/jobs/cubicweb-3.23/workspace/TOXENV/py34-dataimport/cubicweb/cwvreg.py", line 424, in set_schema
self.reload(self.config.appobjects_path(), force_reload=False)
File "/var/lib/jenkins/jobs/cubicweb-3.23/workspace/TOXENV/py34-dataimport/cubicweb/cwvreg.py", line 474, in reload
self.register_objects(path)
File "/var/lib/jenkins/jobs/cubicweb-3.23/workspace/TOXENV/py34-dataimport/cubicweb/cwvreg.py", line 519, in register_objects
path, self.config.extrapath)
File "/var/lib/jenkins/jobs/cubicweb-3.23/workspace/TOXENV/py34-dataimport/.tox/py34-dataimport/lib/python3.4/site-packages/logilab/common/registry.py", line 681, in register_objects
self.load_file(filepath, modname)
File "/var/lib/jenkins/jobs/cubicweb-3.23/workspace/TOXENV/py34-dataimport/cubicweb/cwvreg.py", line 484, in load_file
return super(CWRegistryStore, self).load_file(filepath, modname)
File "/var/lib/jenkins/jobs/cubicweb-3.23/workspace/TOXENV/py34-dataimport/.tox/py34-dataimport/lib/python3.4/site-packages/logilab/common/registry.py", line 738, in load_file
module = load_module_from_name(modname)
File "/var/lib/jenkins/jobs/cubicweb-3.23/workspace/TOXENV/py34-dataimport/.tox/py34-dataimport/lib/python3.4/site-packages/logilab/common/modutils.py", line 125, in load_module_from_name
return load_module_from_modpath(dotted_name.split('.'), path, use_sys)
File "/var/lib/jenkins/jobs/cubicweb-3.23/workspace/TOXENV/py34-dataimport/.tox/py34-dataimport/lib/python3.4/site-packages/logilab/common/modutils.py", line 169, in load_module_from_modpath
module = load_module(curname, mp_file, mp_filename, mp_desc)
File "/var/lib/jenkins/jobs/cubicweb-3.23/workspace/TOXENV/py34-dataimport/.tox/py34-dataimport/lib/python3.4/imp.py", line 235, in load_module
return load_source(name, filename, file)
File "/var/lib/jenkins/jobs/cubicweb-3.23/workspace/TOXENV/py34-dataimport/.tox/py34-dataimport/lib/python3.4/imp.py", line 171, in load_source
module = methods.load()
File "/var/lib/jenkins/jobs/cubicweb-3.23/workspace/TOXENV/py34-dataimport/cubicweb/dataimport/test/<frozen importlib._bootstrap>", line 1220, in load
<no source available>
File "/var/lib/jenkins/jobs/cubicweb-3.23/workspace/TOXENV/py34-dataimport/cubicweb/dataimport/test/<frozen importlib._bootstrap>", line 1200, in _load_unlocked
<no source available>
File "/var/lib/jenkins/jobs/cubicweb-3.23/workspace/TOXENV/py34-dataimport/cubicweb/dataimport/test/<frozen importlib._bootstrap>", line 1129, in _exec
<no source available>
File "/var/lib/jenkins/jobs/cubicweb-3.23/workspace/TOXENV/py34-dataimport/cubicweb/dataimport/test/<frozen importlib._bootstrap>", line 1471, in exec_module
<no source available>
File "/var/lib/jenkins/jobs/cubicweb-3.23/workspace/TOXENV/py34-dataimport/cubicweb/dataimport/test/<frozen importlib._bootstrap>", line 321, in _call_with_frames_removed
<no source available>
File "/var/lib/jenkins/jobs/cubicweb-3.23/workspace/TOXENV/py34-dataimport/cubicweb/web/views/workflow.py", line 82, in <module>
class ChangeStateForm(forms.CompositeEntityForm):
File "/var/lib/jenkins/jobs/cubicweb-3.23/workspace/TOXENV/py34-dataimport/cubicweb/web/views/workflow.py", line 90, in ChangeStateForm
{'class': fw.Button.css_class + ' cwjs-edition-cancel'})]
NameError: name 'fw' is not defined
The files belonging to this database system will be owned by user "jenkins".
This user must also own the server process.

The database cluster will be initialized with locale "C".
The default text search configuration will be set to "english".

Data page checksums are disabled.

creating directory /var/lib/jenkins/jobs/cubicweb-3.23/workspace/TOXENV/py34-dataimport/cubicweb/dataimport/test/data/database/pgdb-test_sqlgenstore ... ok
creating subdirectories ... ok
selecting default max_connections ... 100
selecting default shared_buffers ... 128MB
selecting dynamic shared memory implementation ... posix
creating configuration files ... ok
creating template1 database in /var/lib/jenkins/jobs/cubicweb-3.23/workspace/TOXENV/py34-dataimport/cubicweb/dataimport/test/data/database/pgdb-test_sqlgenstore/base/1 ... ok
initializing pg_authid ... ok
initializing dependencies ... ok
creating system views ... ok
loading system objects' descriptions ... ok
creating collations ... ok
creating conversions ... ok
creating dictionaries ... ok
setting privileges on built-in objects ... ok
creating information schema ... ok
loading PL/pgSQL server-side language ... ok
vacuuming database template1 ... ok
copying template1 to template0 ... ok
copying template1 to postgres ... ok
syncing data to disk ... ok

WARNING: enabling "trust" authentication for local connections
You can change this by editing pg_hba.conf or using the option -A, or
--auth-local and --auth-host, the next time you run initdb.

Success. You can now start the database server using:

postgres -D /var/lib/jenkins/jobs/cubicweb-3.23/workspace/TOXENV/py34-dataimport/cubicweb/dataimport/test/data/database/pgdb-test_sqlgenstore
or
pg_ctl -D /var/lib/jenkins/jobs/cubicweb-3.23/workspace/TOXENV/py34-dataimport/cubicweb/dataimport/test/data/database/pgdb-test_sqlgenstore -l logfile start

waiting for server to start....LOG: database system was shut down at 2016-03-15 17:06:40 CET
LOG: MultiXact member wraparound protections are now enabled
LOG: database system is ready to accept connections
LOG: autovacuum launcher started
done
server started

no stdout
no stderr
======================================================================
SKIPPED: test_import_missing_inlined_relation (unittest_importer.ExtEntitiesImporterTC)
Check import of ext entity with missing inlined relation
repository is not initialised: NameError("name 'fw' is not defined",)
======================================================================
SKIPPED: test_import_missing_non_inlined_relation (unittest_importer.ExtEntitiesImporterTC)
Check import of ext entity with missing non-inlined relation
repository is not initialised: NameError("name 'fw' is not defined",)
======================================================================
SKIPPED: test_import_missing_required_attribute (unittest_importer.ExtEntitiesImporterTC)
Check import of ext entity with missing required attribute
repository is not initialised: NameError("name 'fw' is not defined",)
======================================================================
SKIPPED: test_import_non_inlined_relation (unittest_importer.ExtEntitiesImporterTC)
Check import of ext entities with non inlined relation
repository is not initialised: NameError("name 'fw' is not defined",)
======================================================================
SKIPPED: test_simple_import (unittest_importer.ExtEntitiesImporterTC)
repository is not initialised: NameError("name 'fw' is not defined",)
======================================================================
SKIPPED: test_update (unittest_importer.ExtEntitiesImporterTC)
Check update of ext entity
repository is not initialised: NameError("name 'fw' is not defined",)
======================================================================
SKIPPED: test_with_source (unittest_importer.RelationMappingTC)
repository is not initialised: NameError("name 'fw' is not defined",)
======================= test_sqlgenstore.py ========================
2016-03-15 17:06:42 - (logilab.database) WARNING: plpgsql language already installed
2016-03-15 17:06:43 - (cubicweb.appobject) WARNING: can't find any workflow for CWUser
Ewaiting for server to shut down...LOG: received fast shutdown request
LOG: aborting any active transactions
FATAL: terminating connection due to administrator command
LOG: autovacuum launcher shutting down
.FATAL: terminating connection due to administrator command
LOG: shutting down
LOG: database system is shut down
done
server stopped
SS
======================================================================
ERROR: test_autoflush_metadata (test_sqlgenstore.SQLGenImportSimpleTC)
----------------------------------------------------------------------
Traceback (most recent call last)
File "/usr/lib/python3.4/unittest/case.py", line 58, in testPartExecutor
yield
File "/usr/lib/python3.4/unittest/case.py", line 573, in run
self.setUp()
File "/var/lib/jenkins/jobs/cubicweb-3.23/workspace/TOXENV/py34-dataimport/cubicweb/devtools/testlib.py", line 448, in setUp
self._init_repo()
File "/var/lib/jenkins/jobs/cubicweb-3.23/workspace/TOXENV/py34-dataimport/cubicweb/devtools/testlib.py", line 358, in _init_repo
self.repo = db_handler.get_repo(startup=True)
File "/var/lib/jenkins/jobs/cubicweb-3.23/workspace/TOXENV/py34-dataimport/cubicweb/devtools/__init__.py", line 393, in get_repo
self._repo = self._new_repo(self.config)
File "/var/lib/jenkins/jobs/cubicweb-3.23/workspace/TOXENV/py34-dataimport/cubicweb/devtools/__init__.py", line 407, in _new_repo
repo = config.repository()
File "/var/lib/jenkins/jobs/cubicweb-3.23/workspace/TOXENV/py34-dataimport/cubicweb/cwconfig.py", line 1030, in repository
return Repository(self, TasksManager(), vreg=vreg)
File "/var/lib/jenkins/jobs/cubicweb-3.23/workspace/TOXENV/py34-dataimport/cubicweb/server/repository.py", line 186, in __init__
self.init_cnxset_pool()
File "/var/lib/jenkins/jobs/cubicweb-3.23/workspace/TOXENV/py34-dataimport/cubicweb/server/repository.py", line 228, in init_cnxset_pool
self.set_schema(config.load_schema(expand_cubes=True))
File "/var/lib/jenkins/jobs/cubicweb-3.23/workspace/TOXENV/py34-dataimport/cubicweb/server/repository.py", line 315, in set_schema
self.vreg.set_schema(schema)
File "/var/lib/jenkins/jobs/cubicweb-3.23/workspace/TOXENV/py34-dataimport/cubicweb/cwvreg.py", line 424, in set_schema
self.reload(self.config.appobjects_path(), force_reload=False)
File "/var/lib/jenkins/jobs/cubicweb-3.23/workspace/TOXENV/py34-dataimport/cubicweb/cwvreg.py", line 474, in reload
self.register_objects(path)
File "/var/lib/jenkins/jobs/cubicweb-3.23/workspace/TOXENV/py34-dataimport/cubicweb/cwvreg.py", line 519, in register_objects
path, self.config.extrapath)
File "/var/lib/jenkins/jobs/cubicweb-3.23/workspace/TOXENV/py34-dataimport/.tox/py34-dataimport/lib/python3.4/site-packages/logilab/common/registry.py", line 681, in register_objects
self.load_file(filepath, modname)
File "/var/lib/jenkins/jobs/cubicweb-3.23/workspace/TOXENV/py34-dataimport/cubicweb/cwvreg.py", line 484, in load_file
return super(CWRegistryStore, self).load_file(filepath, modname)
File "/var/lib/jenkins/jobs/cubicweb-3.23/workspace/TOXENV/py34-dataimport/.tox/py34-dataimport/lib/python3.4/site-packages/logilab/common/registry.py", line 738, in load_file
module = load_module_from_name(modname)
File "/var/lib/jenkins/jobs/cubicweb-3.23/workspace/TOXENV/py34-dataimport/.tox/py34-dataimport/lib/python3.4/site-packages/logilab/common/modutils.py", line 125, in load_module_from_name
return load_module_from_modpath(dotted_name.split('.'), path, use_sys)
File "/var/lib/jenkins/jobs/cubicweb-3.23/workspace/TOXENV/py34-dataimport/.tox/py34-dataimport/lib/python3.4/site-packages/logilab/common/modutils.py", line 169, in load_module_from_modpath
module = load_module(curname, mp_file, mp_filename, mp_desc)
File "/var/lib/jenkins/jobs/cubicweb-3.23/workspace/TOXENV/py34-dataimport/.tox/py34-dataimport/lib/python3.4/imp.py", line 235, in load_module
return load_source(name, filename, file)
File "/var/lib/jenkins/jobs/cubicweb-3.23/workspace/TOXENV/py34-dataimport/.tox/py34-dataimport/lib/python3.4/imp.py", line 171, in load_source
module = methods.load()
File "/var/lib/jenkins/jobs/cubicweb-3.23/workspace/TOXENV/py34-dataimport/cubicweb/dataimport/test/<frozen importlib._bootstrap>", line 1220, in load
<no source available>
File "/var/lib/jenkins/jobs/cubicweb-3.23/workspace/TOXENV/py34-dataimport/cubicweb/dataimport/test/<frozen importlib._bootstrap>", line 1200, in _load_unlocked
<no source available>
File "/var/lib/jenkins/jobs/cubicweb-3.23/workspace/TOXENV/py34-dataimport/cubicweb/dataimport/test/<frozen importlib._bootstrap>", line 1129, in _exec
<no source available>
File "/var/lib/jenkins/jobs/cubicweb-3.23/workspace/TOXENV/py34-dataimport/cubicweb/dataimport/test/<frozen importlib._bootstrap>", line 1471, in exec_module
<no source available>
File "/var/lib/jenkins/jobs/cubicweb-3.23/workspace/TOXENV/py34-dataimport/cubicweb/dataimport/test/<frozen importlib._bootstrap>", line 321, in _call_with_frames_removed
<no source available>
File "/var/lib/jenkins/jobs/cubicweb-3.23/workspace/TOXENV/py34-dataimport/cubicweb/web/views/workflow.py", line 82, in <module>
class ChangeStateForm(forms.CompositeEntityForm):
File "/var/lib/jenkins/jobs/cubicweb-3.23/workspace/TOXENV/py34-dataimport/cubicweb/web/views/workflow.py", line 90, in ChangeStateForm
{'class': fw.Button.css_class + ' cwjs-edition-cancel'})]
NameError: name 'fw' is not defined

no stdout
no stderr
======================================================================
SKIPPED: test_simple_insert (test_sqlgenstore.SQLGenImportSimpleTC)
repository is not initialised: NameError("name 'fw' is not defined",)
======================================================================
SKIPPED: test_sqlgenstore_etype_metadata (test_sqlgenstore.SQLGenImportSimpleTC)
repository is not initialised: NameError("name 'fw' is not defined",)
-> creating tables
-> inserting default user and default groups.
-> storing the schema in the database
-> database for instance data initialized.
-> installing /var/lib/jenkins/jobs/cubicweb-3.23/workspace/TOXENV/py34-dataimport/cubicweb/schemas/_regproc.postgres.sql
-> creating tables
-> inserting default user and default groups.
-> storing the schema in the database
-> database for instance data-massimport initialized.
-> installing /var/lib/jenkins/jobs/cubicweb-3.23/workspace/TOXENV/py34-dataimport/cubicweb/schemas/_regproc.postgres.sql
-> creating tables
-> inserting default user and default groups.
-> storing the schema in the database
-> database for instance data-massimport initialized.
*******************************************************************************
Ran 45 test cases in 61.48s (43.49s CPU), 9 errors, 25 skipped
1 modules OK (5 failed)
failures: /var/lib/jenkins/jobs/cubicweb-3.23/workspace/TOXENV/py34-dataimport/cubicweb/dataimport/test/test_pgstore [1/9], /var/lib/jenkins/jobs/cubicweb-3.23/workspace/TOXENV/py34-dataimport/cubicweb/dataimport/test/test_stores [2/3], /var/lib/jenkins/jobs/cubicweb-3.23/workspace/TOXENV/py34-dataimport/cubicweb/dataimport/test/test_massive_store [1/16], /var/lib/jenkins/jobs/cubicweb-3.23/workspace/TOXENV/py34-dataimport/cubicweb/dataimport/test/unittest_importer [4/12], /var/lib/jenkins/jobs/cubicweb-3.23/workspace/TOXENV/py34-dataimport/cubicweb/dataimport/test/test_sqlgenstore [1/3]
ERROR: InvocationError: '/var/lib/jenkins/jobs/cubicweb-3.23/workspace/TOXENV/py34-dataimport/.tox/py34-dataimport/bin/python -c from logilab.common import pytest; pytest.run() -t /var/lib/jenkins/jobs/cubicweb-3.23/workspace/TOXENV/py34-dataimport/cubicweb/dataimport/test'
___________________________________ summary ____________________________________
ERROR: py34-dataimport: commands failed
Build step 'Execute shell' marked build as failure
Sending e-mails to: dlaxalde@logilab.fr jcr@logilab.fr syt@logilab.fr david@logilab.fr
[PostBuildScript] - Execution post build scripts.
[py34-dataimport] $ /bin/bash -xe /tmp/hudson2143202469157225278.sh
+ /var/lib/jenkins/scripts/notify_forge_apycot.py cwo cubicweb ed0da4d57b5a http://jenkins.logilab.fr/job/cubicweb-3.23/TOXENV=py34-dataimport/72/ --status failure
<br/>

log from execution
download