consoleText

download

20 Started by upstream project "cubicweb-3.23" build number 72
originally caused by:
Started by an SCM change
Building in workspace /var/lib/jenkins/jobs/cubicweb-3.23/workspace/TOXENV/py27-server
[py27-server] $ hg showconfig paths.default
[py27-server] $ hg pull
pulling from http://hg.logilab.org/review/cubicweb
searching for changes
adding changesets
adding manifests
adding file changes
added 1 changesets with 2 changes to 2 files (+1 heads)
(run 'hg heads .' to see heads, 'hg merge' to merge)
[py27-server] $ hg update --clean --rev ed0da4d57b5a9d10971460c7c6d196733f1046fe
12 files updated, 0 files merged, 0 files removed, 0 files unresolved
[py27-server] $ hg --config extensions.purge= clean --all
[py27-server] $ hg log --rev . --template {node}
[py27-server] $ hg log --rev . --template {rev}
[py27-server] $ hg id --branch
[py27-server] $ /bin/bash -xe /tmp/hudson1805870914549697375.sh
+ find . '(' -name 'pgdb*' -o -name 'tmpdb*' ')' -print0
+ xargs -0 rm -rf
[py27-server] $ /bin/bash -xe /tmp/hudson1250769604006664576.sh
+ PATH=/usr/lib/postgresql/9.4/bin:/usr/local/bin:/usr/bin:/bin:/usr/local/games:/usr/games
+ tox --recreate
py27-server create: /var/lib/jenkins/jobs/cubicweb-3.23/workspace/TOXENV/py27-server/.tox/py27-server
py27-server installdeps: -r/var/lib/jenkins/jobs/cubicweb-3.23/workspace/TOXENV/py27-server/cubicweb/server/test/requirements.txt
py27-server develop-inst: /var/lib/jenkins/jobs/cubicweb-3.23/workspace/TOXENV/py27-server
py27-server installed: You are using pip version 7.1.2, however version 8.1.0 is available.,You should consider upgrading via the 'pip install --upgrade pip' command.,beautifulsoup4==4.3.2,boto==2.34.0,bzr-etckeeper==0.0.0,cffi==0.8.6,characteristic==0.1.0,chardet==2.3.0,Cheetah==2.4.4,cloud-init==0.7.6,colorama==0.3.2,configobj==5.0.6,coverage==3.7.1,croniter==0.3.4,cryptography==0.6.1,-e hg+http://hg.logilab.org/review/cubicweb@ed0da4d57b5a9d10971460c7c6d196733f1046fe#egg=cubicweb-dev,cubicweb-basket==1.5.1,cubicweb-card==0.5.8,cubicweb-comment==1.12.1,cubicweb-file==1.18.0,cubicweb-localperms==0.3.2,cubicweb-tag==1.8.3,cwclientlib==0.4.1,Cython==0.21.1,decorator==3.4.0,docutils==0.12,ecdsa==0.11,euca2ools==3.1.0,GDAL==1.10.1,hg-evolve==5.2.1,html2text==2016.1.8,html5lib==0.999,isodate==0.5.0,Jinja2==2.7.3,joblib==0.8.3,jsonpatch==1.3,jsonpointer==1.0,ldap3==1.1.2,linecache2==1.0.0,logilab-common==1.2.0,logilab-constraint==0.6.0,logilab-database==1.15.0,logilab-mtconverter==0.9.0,lxml==3.4.0,M2Crypto==0.21.1,Mako==1.0.0,Markdown==2.5.1,MarkupSafe==0.23,matplotlib==1.4.2,mercurial==3.5.2,mock==1.0.1,msgpack-python==0.4.2,nose==1.3.4,numexpr==2.4,numpy==1.8.2,oauth==1.0.1,openpyxl==1.7.0,pandas==0.14.1,paramiko==1.15.1,passlib==1.6.5,pep8==1.5.7,Pillow==2.6.1,pluggy==0.3.1,ply==3.4,prettytable==0.7.2,psycopg2==2.5.4,py==1.4.31,pyasn1==0.1.9,pyasn1-modules==0.0.5,pycparser==2.10,pycrypto==2.6.1,Pygments==2.0.1,pyinotify==0.9.4,pyOpenSSL==0.14,pyparsing==2.0.3,pyserial==2.6,pysqlite==2.6.3,python-apt==0.9.3.12,python-augeas==0.4.1,python-dateutil==2.2,python-jenkins==0.2.1,python-ldap==2.4.10,python-yapps==2.1.1,python3-ldap==0.9.4.2,pytz==2012rc0,PyYAML==3.11,pyzmq==14.4.0,rdflib==4.1.2,requestbuilder==0.2.3,requests==2.4.3,roman==2.0.0,rql==0.34.0,rubber==1.1,salt==2015.5.3,scikit-learn==0.14.1,scipy==0.14.0,service-identity==1.0.0,Shapely==1.4.3,simplejson==3.6.5,SimpleTAL==4.1,six==1.8.0,SPARQLWrapper==1.6.0,statsmodels==0.4.2,tables==3.1.1,tox==2.3.1,traceback2==1.4.0,unittest2==1.1.0,urllib3==1.9.1,virtualenv==13.1.2,wheel==0.24.0,xlrd==0.9.2,xlwt==0.7.5,yams==0.42.0,Yapps==2.2.0,Yapps2==2.2.0
py27-server runtests: PYTHONHASHSEED='889203122'
py27-server runtests: commands[0] | /var/lib/jenkins/jobs/cubicweb-3.23/workspace/TOXENV/py27-server/.tox/py27-server/bin/python -c from logilab.common import pytest; pytest.run() -t /var/lib/jenkins/jobs/cubicweb-3.23/workspace/TOXENV/py27-server/cubicweb/server/test
========================= unittest_undo.py =========================
2016-03-15 17:07:37 - (cubicweb.appobject) WARNING: can't find any workflow for CWUser
EESSSSSSSSSSSSSSSS
======================================================================
ERROR: test___unicode__method (unittest_undo.UndoExceptionInUnicode)
----------------------------------------------------------------------
Traceback (most recent call last)
File "/var/lib/jenkins/jobs/cubicweb-3.23/workspace/TOXENV/py27-server/.tox/py27-server/local/lib/python2.7/site-packages/unittest2/case.py", line 67, in testPartExecutor
yield
File "/var/lib/jenkins/jobs/cubicweb-3.23/workspace/TOXENV/py27-server/.tox/py27-server/local/lib/python2.7/site-packages/unittest2/case.py", line 621, in run
self.setUp()
File "/var/lib/jenkins/jobs/cubicweb-3.23/workspace/TOXENV/py27-server/cubicweb/devtools/testlib.py", line 448, in setUp
self._init_repo()
File "/var/lib/jenkins/jobs/cubicweb-3.23/workspace/TOXENV/py27-server/cubicweb/devtools/testlib.py", line 357, in _init_repo
db_handler.restore_database(self.test_db_id)
File "/var/lib/jenkins/jobs/cubicweb-3.23/workspace/TOXENV/py27-server/cubicweb/devtools/__init__.py", line 378, in restore_database
self._restore_database(backup_coordinates, config)
File "/var/lib/jenkins/jobs/cubicweb-3.23/workspace/TOXENV/py27-server/cubicweb/devtools/__init__.py", line 815, in _restore_database
self.get_repo()
File "/var/lib/jenkins/jobs/cubicweb-3.23/workspace/TOXENV/py27-server/cubicweb/devtools/__init__.py", line 393, in get_repo
self._repo = self._new_repo(self.config)
File "/var/lib/jenkins/jobs/cubicweb-3.23/workspace/TOXENV/py27-server/cubicweb/devtools/__init__.py", line 407, in _new_repo
repo = config.repository()
File "/var/lib/jenkins/jobs/cubicweb-3.23/workspace/TOXENV/py27-server/cubicweb/cwconfig.py", line 1030, in repository
return Repository(self, TasksManager(), vreg=vreg)
File "/var/lib/jenkins/jobs/cubicweb-3.23/workspace/TOXENV/py27-server/cubicweb/server/repository.py", line 186, in __init__
self.init_cnxset_pool()
File "/var/lib/jenkins/jobs/cubicweb-3.23/workspace/TOXENV/py27-server/cubicweb/server/repository.py", line 228, in init_cnxset_pool
self.set_schema(config.load_schema(expand_cubes=True))
File "/var/lib/jenkins/jobs/cubicweb-3.23/workspace/TOXENV/py27-server/cubicweb/server/repository.py", line 315, in set_schema
self.vreg.set_schema(schema)
File "/var/lib/jenkins/jobs/cubicweb-3.23/workspace/TOXENV/py27-server/cubicweb/cwvreg.py", line 424, in set_schema
self.reload(self.config.appobjects_path(), force_reload=False)
File "/var/lib/jenkins/jobs/cubicweb-3.23/workspace/TOXENV/py27-server/cubicweb/cwvreg.py", line 474, in reload
self.register_objects(path)
File "/var/lib/jenkins/jobs/cubicweb-3.23/workspace/TOXENV/py27-server/cubicweb/cwvreg.py", line 519, in register_objects
path, self.config.extrapath)
File "/var/lib/jenkins/jobs/cubicweb-3.23/workspace/TOXENV/py27-server/.tox/py27-server/local/lib/python2.7/site-packages/logilab/common/registry.py", line 681, in register_objects
self.load_file(filepath, modname)
File "/var/lib/jenkins/jobs/cubicweb-3.23/workspace/TOXENV/py27-server/cubicweb/cwvreg.py", line 484, in load_file
return super(CWRegistryStore, self).load_file(filepath, modname)
File "/var/lib/jenkins/jobs/cubicweb-3.23/workspace/TOXENV/py27-server/.tox/py27-server/local/lib/python2.7/site-packages/logilab/common/registry.py", line 738, in load_file
module = load_module_from_name(modname)
File "/var/lib/jenkins/jobs/cubicweb-3.23/workspace/TOXENV/py27-server/.tox/py27-server/local/lib/python2.7/site-packages/logilab/common/modutils.py", line 125, in load_module_from_name
return load_module_from_modpath(dotted_name.split('.'), path, use_sys)
File "/var/lib/jenkins/jobs/cubicweb-3.23/workspace/TOXENV/py27-server/.tox/py27-server/local/lib/python2.7/site-packages/logilab/common/modutils.py", line 169, in load_module_from_modpath
module = load_module(curname, mp_file, mp_filename, mp_desc)
File "/var/lib/jenkins/jobs/cubicweb-3.23/workspace/TOXENV/py27-server/cubicweb/web/views/workflow.py", line 82, in <module>
class ChangeStateForm(forms.CompositeEntityForm):
File "/var/lib/jenkins/jobs/cubicweb-3.23/workspace/TOXENV/py27-server/cubicweb/web/views/workflow.py", line 90, in ChangeStateForm
{'class': fw.Button.css_class + ' cwjs-edition-cancel'})]
NameError: name 'fw' is not defined

no stdout
no stderr
======================================================================
ERROR: test_undo_api (unittest_undo.UndoableTransactionTC)
----------------------------------------------------------------------
Traceback (most recent call last)
File "/var/lib/jenkins/jobs/cubicweb-3.23/workspace/TOXENV/py27-server/.tox/py27-server/local/lib/python2.7/site-packages/unittest2/case.py", line 67, in testPartExecutor
yield
File "/var/lib/jenkins/jobs/cubicweb-3.23/workspace/TOXENV/py27-server/.tox/py27-server/local/lib/python2.7/site-packages/unittest2/case.py", line 621, in run
self.setUp()
File "/var/lib/jenkins/jobs/cubicweb-3.23/workspace/TOXENV/py27-server/cubicweb/server/test/unittest_undo.py", line 49, in setUp
super(UndoableTransactionTC, self).setUp()
File "/var/lib/jenkins/jobs/cubicweb-3.23/workspace/TOXENV/py27-server/cubicweb/devtools/testlib.py", line 448, in setUp
self._init_repo()
File "/var/lib/jenkins/jobs/cubicweb-3.23/workspace/TOXENV/py27-server/cubicweb/devtools/testlib.py", line 357, in _init_repo
db_handler.restore_database(self.test_db_id)
File "/var/lib/jenkins/jobs/cubicweb-3.23/workspace/TOXENV/py27-server/cubicweb/devtools/__init__.py", line 378, in restore_database
self._restore_database(backup_coordinates, config)
File "/var/lib/jenkins/jobs/cubicweb-3.23/workspace/TOXENV/py27-server/cubicweb/devtools/__init__.py", line 815, in _restore_database
self.get_repo()
File "/var/lib/jenkins/jobs/cubicweb-3.23/workspace/TOXENV/py27-server/cubicweb/devtools/__init__.py", line 393, in get_repo
self._repo = self._new_repo(self.config)
File "/var/lib/jenkins/jobs/cubicweb-3.23/workspace/TOXENV/py27-server/cubicweb/devtools/__init__.py", line 407, in _new_repo
repo = config.repository()
File "/var/lib/jenkins/jobs/cubicweb-3.23/workspace/TOXENV/py27-server/cubicweb/cwconfig.py", line 1030, in repository
return Repository(self, TasksManager(), vreg=vreg)
File "/var/lib/jenkins/jobs/cubicweb-3.23/workspace/TOXENV/py27-server/cubicweb/server/repository.py", line 186, in __init__
self.init_cnxset_pool()
File "/var/lib/jenkins/jobs/cubicweb-3.23/workspace/TOXENV/py27-server/cubicweb/server/repository.py", line 228, in init_cnxset_pool
self.set_schema(config.load_schema(expand_cubes=True))
File "/var/lib/jenkins/jobs/cubicweb-3.23/workspace/TOXENV/py27-server/cubicweb/server/repository.py", line 315, in set_schema
self.vreg.set_schema(schema)
File "/var/lib/jenkins/jobs/cubicweb-3.23/workspace/TOXENV/py27-server/cubicweb/cwvreg.py", line 424, in set_schema
self.reload(self.config.appobjects_path(), force_reload=False)
File "/var/lib/jenkins/jobs/cubicweb-3.23/workspace/TOXENV/py27-server/cubicweb/cwvreg.py", line 474, in reload
self.register_objects(path)
File "/var/lib/jenkins/jobs/cubicweb-3.23/workspace/TOXENV/py27-server/cubicweb/cwvreg.py", line 519, in register_objects
path, self.config.extrapath)
File "/var/lib/jenkins/jobs/cubicweb-3.23/workspace/TOXENV/py27-server/.tox/py27-server/local/lib/python2.7/site-packages/logilab/common/registry.py", line 681, in register_objects
self.load_file(filepath, modname)
File "/var/lib/jenkins/jobs/cubicweb-3.23/workspace/TOXENV/py27-server/cubicweb/cwvreg.py", line 484, in load_file
return super(CWRegistryStore, self).load_file(filepath, modname)
File "/var/lib/jenkins/jobs/cubicweb-3.23/workspace/TOXENV/py27-server/.tox/py27-server/local/lib/python2.7/site-packages/logilab/common/registry.py", line 738, in load_file
module = load_module_from_name(modname)
File "/var/lib/jenkins/jobs/cubicweb-3.23/workspace/TOXENV/py27-server/.tox/py27-server/local/lib/python2.7/site-packages/logilab/common/modutils.py", line 125, in load_module_from_name
return load_module_from_modpath(dotted_name.split('.'), path, use_sys)
File "/var/lib/jenkins/jobs/cubicweb-3.23/workspace/TOXENV/py27-server/.tox/py27-server/local/lib/python2.7/site-packages/logilab/common/modutils.py", line 169, in load_module_from_modpath
module = load_module(curname, mp_file, mp_filename, mp_desc)
File "/var/lib/jenkins/jobs/cubicweb-3.23/workspace/TOXENV/py27-server/cubicweb/web/views/workflow.py", line 82, in <module>
class ChangeStateForm(forms.CompositeEntityForm):
File "/var/lib/jenkins/jobs/cubicweb-3.23/workspace/TOXENV/py27-server/cubicweb/web/views/workflow.py", line 90, in ChangeStateForm
{'class': fw.Button.css_class + ' cwjs-edition-cancel'})]
NameError: name 'fw' is not defined

no stdout
no stderr
======================================================================
SKIPPED: test_undo_attr_update_ko (unittest_undo.UndoableTransactionTC)
repository is not initialised: NameError("name 'fw' is not defined",)
======================================================================
SKIPPED: test_undo_attr_update_ok (unittest_undo.UndoableTransactionTC)
repository is not initialised: NameError("name 'fw' is not defined",)
======================================================================
SKIPPED: test_undo_creation_1 (unittest_undo.UndoableTransactionTC)
repository is not initialised: NameError("name 'fw' is not defined",)
======================================================================
SKIPPED: test_undo_creation_integrity_1 (unittest_undo.UndoableTransactionTC)
repository is not initialised: NameError("name 'fw' is not defined",)
======================================================================
SKIPPED: test_undo_creation_integrity_2 (unittest_undo.UndoableTransactionTC)
repository is not initialised: NameError("name 'fw' is not defined",)
======================================================================
SKIPPED: test_undo_deletion_base (unittest_undo.UndoableTransactionTC)
repository is not initialised: NameError("name 'fw' is not defined",)
======================================================================
SKIPPED: test_undo_deletion_integrity_1 (unittest_undo.UndoableTransactionTC)
repository is not initialised: NameError("name 'fw' is not defined",)
======================================================================
SKIPPED: test_undo_deletion_integrity_2 (unittest_undo.UndoableTransactionTC)
repository is not initialised: NameError("name 'fw' is not defined",)
======================================================================
SKIPPED: test_undo_inline_rel_add_ko (unittest_undo.UndoableTransactionTC)
Undo add relation Personne (?) fiche (?) Card
repository is not initialised: NameError("name 'fw' is not defined",)
======================================================================
SKIPPED: test_undo_inline_rel_add_ok (unittest_undo.UndoableTransactionTC)
Undo add relation Personne (?) fiche (?) Card
repository is not initialised: NameError("name 'fw' is not defined",)
======================================================================
SKIPPED: test_undo_inline_rel_delete_ko (unittest_undo.UndoableTransactionTC)
repository is not initialised: NameError("name 'fw' is not defined",)
======================================================================
SKIPPED: test_undo_inline_rel_remove_ko (unittest_undo.UndoableTransactionTC)
Restore an inlined relation to a deleted entity, with an error.
repository is not initialised: NameError("name 'fw' is not defined",)
======================================================================
SKIPPED: test_undo_inline_rel_remove_ok (unittest_undo.UndoableTransactionTC)
Undo remove relation Personne (?) fiche (?) Card
repository is not initialised: NameError("name 'fw' is not defined",)
======================================================================
SKIPPED: test_undo_inline_rel_replace_ko (unittest_undo.UndoableTransactionTC)
Undo changing relation Personne (?) fiche (?) Card, with an error
repository is not initialised: NameError("name 'fw' is not defined",)
======================================================================
SKIPPED: test_undo_inline_rel_replace_ok (unittest_undo.UndoableTransactionTC)
Undo changing relation Personne (?) fiche (?) Card
repository is not initialised: NameError("name 'fw' is not defined",)
======================================================================
SKIPPED: test_undoable_transactions (unittest_undo.UndoableTransactionTC)
repository is not initialised: NameError("name 'fw' is not defined",)
======================== unittest_utils.py =========================
.
======================= unittest_rql2sql.py ========================
................................................................................................................S....................................................
======================================================================
SKIPPED: test_regexp (unittest_rql2sql.SqlServer2005SQLGeneratorTC)
regexp-based pattern matching not implemented in sqlserver
====================== unittest_repository.py ======================
EESSESESSESSSSSSSSESSSSSSSSSSSSSSSSSSSSS2016-03-15 17:08:13 - (cubicweb.appobject) WARNING: can't find any workflow for CWUser
ES
======================================================================
ERROR: test_versions_inserted (unittest_repository.DBInitTC)
----------------------------------------------------------------------
Traceback (most recent call last)
File "/var/lib/jenkins/jobs/cubicweb-3.23/workspace/TOXENV/py27-server/.tox/py27-server/local/lib/python2.7/site-packages/unittest2/case.py", line 67, in testPartExecutor
yield
File "/var/lib/jenkins/jobs/cubicweb-3.23/workspace/TOXENV/py27-server/.tox/py27-server/local/lib/python2.7/site-packages/unittest2/case.py", line 621, in run
self.setUp()
File "/var/lib/jenkins/jobs/cubicweb-3.23/workspace/TOXENV/py27-server/cubicweb/devtools/testlib.py", line 448, in setUp
self._init_repo()
File "/var/lib/jenkins/jobs/cubicweb-3.23/workspace/TOXENV/py27-server/cubicweb/devtools/testlib.py", line 357, in _init_repo
db_handler.restore_database(self.test_db_id)
File "/var/lib/jenkins/jobs/cubicweb-3.23/workspace/TOXENV/py27-server/cubicweb/devtools/__init__.py", line 378, in restore_database
self._restore_database(backup_coordinates, config)
File "/var/lib/jenkins/jobs/cubicweb-3.23/workspace/TOXENV/py27-server/cubicweb/devtools/__init__.py", line 815, in _restore_database
self.get_repo()
File "/var/lib/jenkins/jobs/cubicweb-3.23/workspace/TOXENV/py27-server/cubicweb/devtools/__init__.py", line 393, in get_repo
self._repo = self._new_repo(self.config)
File "/var/lib/jenkins/jobs/cubicweb-3.23/workspace/TOXENV/py27-server/cubicweb/devtools/__init__.py", line 407, in _new_repo
repo = config.repository()
File "/var/lib/jenkins/jobs/cubicweb-3.23/workspace/TOXENV/py27-server/cubicweb/cwconfig.py", line 1030, in repository
return Repository(self, TasksManager(), vreg=vreg)
File "/var/lib/jenkins/jobs/cubicweb-3.23/workspace/TOXENV/py27-server/cubicweb/server/repository.py", line 186, in __init__
self.init_cnxset_pool()
File "/var/lib/jenkins/jobs/cubicweb-3.23/workspace/TOXENV/py27-server/cubicweb/server/repository.py", line 228, in init_cnxset_pool
self.set_schema(config.load_schema(expand_cubes=True))
File "/var/lib/jenkins/jobs/cubicweb-3.23/workspace/TOXENV/py27-server/cubicweb/server/repository.py", line 315, in set_schema
self.vreg.set_schema(schema)
File "/var/lib/jenkins/jobs/cubicweb-3.23/workspace/TOXENV/py27-server/cubicweb/cwvreg.py", line 424, in set_schema
self.reload(self.config.appobjects_path(), force_reload=False)
File "/var/lib/jenkins/jobs/cubicweb-3.23/workspace/TOXENV/py27-server/cubicweb/cwvreg.py", line 474, in reload
self.register_objects(path)
File "/var/lib/jenkins/jobs/cubicweb-3.23/workspace/TOXENV/py27-server/cubicweb/cwvreg.py", line 519, in register_objects
path, self.config.extrapath)
File "/var/lib/jenkins/jobs/cubicweb-3.23/workspace/TOXENV/py27-server/.tox/py27-server/local/lib/python2.7/site-packages/logilab/common/registry.py", line 681, in register_objects
self.load_file(filepath, modname)
File "/var/lib/jenkins/jobs/cubicweb-3.23/workspace/TOXENV/py27-server/cubicweb/cwvreg.py", line 484, in load_file
return super(CWRegistryStore, self).load_file(filepath, modname)
File "/var/lib/jenkins/jobs/cubicweb-3.23/workspace/TOXENV/py27-server/.tox/py27-server/local/lib/python2.7/site-packages/logilab/common/registry.py", line 738, in load_file
module = load_module_from_name(modname)
File "/var/lib/jenkins/jobs/cubicweb-3.23/workspace/TOXENV/py27-server/.tox/py27-server/local/lib/python2.7/site-packages/logilab/common/modutils.py", line 125, in load_module_from_name
return load_module_from_modpath(dotted_name.split('.'), path, use_sys)
File "/var/lib/jenkins/jobs/cubicweb-3.23/workspace/TOXENV/py27-server/.tox/py27-server/local/lib/python2.7/site-packages/logilab/common/modutils.py", line 169, in load_module_from_modpath
module = load_module(curname, mp_file, mp_filename, mp_desc)
File "/var/lib/jenkins/jobs/cubicweb-3.23/workspace/TOXENV/py27-server/cubicweb/web/views/workflow.py", line 82, in <module>
class ChangeStateForm(forms.CompositeEntityForm):
File "/var/lib/jenkins/jobs/cubicweb-3.23/workspace/TOXENV/py27-server/cubicweb/web/views/workflow.py", line 90, in ChangeStateForm
{'class': fw.Button.css_class + ' cwjs-edition-cancel'})]
NameError: name 'fw' is not defined

no stdout
no stderr
======================================================================
ERROR: test_add_delete_info (unittest_repository.DataHelpersTC)
----------------------------------------------------------------------
Traceback (most recent call last)
File "/var/lib/jenkins/jobs/cubicweb-3.23/workspace/TOXENV/py27-server/.tox/py27-server/local/lib/python2.7/site-packages/unittest2/case.py", line 67, in testPartExecutor
yield
File "/var/lib/jenkins/jobs/cubicweb-3.23/workspace/TOXENV/py27-server/.tox/py27-server/local/lib/python2.7/site-packages/unittest2/case.py", line 621, in run
self.setUp()
File "/var/lib/jenkins/jobs/cubicweb-3.23/workspace/TOXENV/py27-server/cubicweb/devtools/testlib.py", line 448, in setUp
self._init_repo()
File "/var/lib/jenkins/jobs/cubicweb-3.23/workspace/TOXENV/py27-server/cubicweb/devtools/testlib.py", line 357, in _init_repo
db_handler.restore_database(self.test_db_id)
File "/var/lib/jenkins/jobs/cubicweb-3.23/workspace/TOXENV/py27-server/cubicweb/devtools/__init__.py", line 378, in restore_database
self._restore_database(backup_coordinates, config)
File "/var/lib/jenkins/jobs/cubicweb-3.23/workspace/TOXENV/py27-server/cubicweb/devtools/__init__.py", line 815, in _restore_database
self.get_repo()
File "/var/lib/jenkins/jobs/cubicweb-3.23/workspace/TOXENV/py27-server/cubicweb/devtools/__init__.py", line 393, in get_repo
self._repo = self._new_repo(self.config)
File "/var/lib/jenkins/jobs/cubicweb-3.23/workspace/TOXENV/py27-server/cubicweb/devtools/__init__.py", line 407, in _new_repo
repo = config.repository()
File "/var/lib/jenkins/jobs/cubicweb-3.23/workspace/TOXENV/py27-server/cubicweb/cwconfig.py", line 1030, in repository
return Repository(self, TasksManager(), vreg=vreg)
File "/var/lib/jenkins/jobs/cubicweb-3.23/workspace/TOXENV/py27-server/cubicweb/server/repository.py", line 186, in __init__
self.init_cnxset_pool()
File "/var/lib/jenkins/jobs/cubicweb-3.23/workspace/TOXENV/py27-server/cubicweb/server/repository.py", line 228, in init_cnxset_pool
self.set_schema(config.load_schema(expand_cubes=True))
File "/var/lib/jenkins/jobs/cubicweb-3.23/workspace/TOXENV/py27-server/cubicweb/server/repository.py", line 315, in set_schema
self.vreg.set_schema(schema)
File "/var/lib/jenkins/jobs/cubicweb-3.23/workspace/TOXENV/py27-server/cubicweb/cwvreg.py", line 424, in set_schema
self.reload(self.config.appobjects_path(), force_reload=False)
File "/var/lib/jenkins/jobs/cubicweb-3.23/workspace/TOXENV/py27-server/cubicweb/cwvreg.py", line 474, in reload
self.register_objects(path)
File "/var/lib/jenkins/jobs/cubicweb-3.23/workspace/TOXENV/py27-server/cubicweb/cwvreg.py", line 519, in register_objects
path, self.config.extrapath)
File "/var/lib/jenkins/jobs/cubicweb-3.23/workspace/TOXENV/py27-server/.tox/py27-server/local/lib/python2.7/site-packages/logilab/common/registry.py", line 681, in register_objects
self.load_file(filepath, modname)
File "/var/lib/jenkins/jobs/cubicweb-3.23/workspace/TOXENV/py27-server/cubicweb/cwvreg.py", line 484, in load_file
return super(CWRegistryStore, self).load_file(filepath, modname)
File "/var/lib/jenkins/jobs/cubicweb-3.23/workspace/TOXENV/py27-server/.tox/py27-server/local/lib/python2.7/site-packages/logilab/common/registry.py", line 738, in load_file
module = load_module_from_name(modname)
File "/var/lib/jenkins/jobs/cubicweb-3.23/workspace/TOXENV/py27-server/.tox/py27-server/local/lib/python2.7/site-packages/logilab/common/modutils.py", line 125, in load_module_from_name
return load_module_from_modpath(dotted_name.split('.'), path, use_sys)
File "/var/lib/jenkins/jobs/cubicweb-3.23/workspace/TOXENV/py27-server/.tox/py27-server/local/lib/python2.7/site-packages/logilab/common/modutils.py", line 169, in load_module_from_modpath
module = load_module(curname, mp_file, mp_filename, mp_desc)
File "/var/lib/jenkins/jobs/cubicweb-3.23/workspace/TOXENV/py27-server/cubicweb/web/views/workflow.py", line 82, in <module>
class ChangeStateForm(forms.CompositeEntityForm):
File "/var/lib/jenkins/jobs/cubicweb-3.23/workspace/TOXENV/py27-server/cubicweb/web/views/workflow.py", line 90, in ChangeStateForm
{'class': fw.Button.css_class + ' cwjs-edition-cancel'})]
NameError: name 'fw' is not defined

no stdout
no stderr
======================================================================
ERROR: test_fulltext_container_entity (unittest_repository.FTITC)
----------------------------------------------------------------------
Traceback (most recent call last)
File "/var/lib/jenkins/jobs/cubicweb-3.23/workspace/TOXENV/py27-server/.tox/py27-server/local/lib/python2.7/site-packages/unittest2/case.py", line 67, in testPartExecutor
yield
File "/var/lib/jenkins/jobs/cubicweb-3.23/workspace/TOXENV/py27-server/.tox/py27-server/local/lib/python2.7/site-packages/unittest2/case.py", line 621, in run
self.setUp()
File "/var/lib/jenkins/jobs/cubicweb-3.23/workspace/TOXENV/py27-server/cubicweb/devtools/testlib.py", line 448, in setUp
self._init_repo()
File "/var/lib/jenkins/jobs/cubicweb-3.23/workspace/TOXENV/py27-server/cubicweb/devtools/testlib.py", line 357, in _init_repo
db_handler.restore_database(self.test_db_id)
File "/var/lib/jenkins/jobs/cubicweb-3.23/workspace/TOXENV/py27-server/cubicweb/devtools/__init__.py", line 378, in restore_database
self._restore_database(backup_coordinates, config)
File "/var/lib/jenkins/jobs/cubicweb-3.23/workspace/TOXENV/py27-server/cubicweb/devtools/__init__.py", line 815, in _restore_database
self.get_repo()
File "/var/lib/jenkins/jobs/cubicweb-3.23/workspace/TOXENV/py27-server/cubicweb/devtools/__init__.py", line 393, in get_repo
self._repo = self._new_repo(self.config)
File "/var/lib/jenkins/jobs/cubicweb-3.23/workspace/TOXENV/py27-server/cubicweb/devtools/__init__.py", line 407, in _new_repo
repo = config.repository()
File "/var/lib/jenkins/jobs/cubicweb-3.23/workspace/TOXENV/py27-server/cubicweb/cwconfig.py", line 1030, in repository
return Repository(self, TasksManager(), vreg=vreg)
File "/var/lib/jenkins/jobs/cubicweb-3.23/workspace/TOXENV/py27-server/cubicweb/server/repository.py", line 186, in __init__
self.init_cnxset_pool()
File "/var/lib/jenkins/jobs/cubicweb-3.23/workspace/TOXENV/py27-server/cubicweb/server/repository.py", line 228, in init_cnxset_pool
self.set_schema(config.load_schema(expand_cubes=True))
File "/var/lib/jenkins/jobs/cubicweb-3.23/workspace/TOXENV/py27-server/cubicweb/server/repository.py", line 315, in set_schema
self.vreg.set_schema(schema)
File "/var/lib/jenkins/jobs/cubicweb-3.23/workspace/TOXENV/py27-server/cubicweb/cwvreg.py", line 424, in set_schema
self.reload(self.config.appobjects_path(), force_reload=False)
File "/var/lib/jenkins/jobs/cubicweb-3.23/workspace/TOXENV/py27-server/cubicweb/cwvreg.py", line 474, in reload
self.register_objects(path)
File "/var/lib/jenkins/jobs/cubicweb-3.23/workspace/TOXENV/py27-server/cubicweb/cwvreg.py", line 519, in register_objects
path, self.config.extrapath)
File "/var/lib/jenkins/jobs/cubicweb-3.23/workspace/TOXENV/py27-server/.tox/py27-server/local/lib/python2.7/site-packages/logilab/common/registry.py", line 681, in register_objects
self.load_file(filepath, modname)
File "/var/lib/jenkins/jobs/cubicweb-3.23/workspace/TOXENV/py27-server/cubicweb/cwvreg.py", line 484, in load_file
return super(CWRegistryStore, self).load_file(filepath, modname)
File "/var/lib/jenkins/jobs/cubicweb-3.23/workspace/TOXENV/py27-server/.tox/py27-server/local/lib/python2.7/site-packages/logilab/common/registry.py", line 738, in load_file
module = load_module_from_name(modname)
File "/var/lib/jenkins/jobs/cubicweb-3.23/workspace/TOXENV/py27-server/.tox/py27-server/local/lib/python2.7/site-packages/logilab/common/modutils.py", line 125, in load_module_from_name
return load_module_from_modpath(dotted_name.split('.'), path, use_sys)
File "/var/lib/jenkins/jobs/cubicweb-3.23/workspace/TOXENV/py27-server/.tox/py27-server/local/lib/python2.7/site-packages/logilab/common/modutils.py", line 169, in load_module_from_modpath
module = load_module(curname, mp_file, mp_filename, mp_desc)
File "/var/lib/jenkins/jobs/cubicweb-3.23/workspace/TOXENV/py27-server/cubicweb/web/views/workflow.py", line 82, in <module>
class ChangeStateForm(forms.CompositeEntityForm):
File "/var/lib/jenkins/jobs/cubicweb-3.23/workspace/TOXENV/py27-server/cubicweb/web/views/workflow.py", line 90, in ChangeStateForm
{'class': fw.Button.css_class + ' cwjs-edition-cancel'})]
NameError: name 'fw' is not defined

no stdout
no stderr
======================================================================
ERROR: test_add_relations_at_creation_with_del_existing_rel (unittest_repository.InlineRelHooksTC)
----------------------------------------------------------------------
Traceback (most recent call last)
File "/var/lib/jenkins/jobs/cubicweb-3.23/workspace/TOXENV/py27-server/.tox/py27-server/local/lib/python2.7/site-packages/unittest2/case.py", line 67, in testPartExecutor
yield
File "/var/lib/jenkins/jobs/cubicweb-3.23/workspace/TOXENV/py27-server/.tox/py27-server/local/lib/python2.7/site-packages/unittest2/case.py", line 621, in run
self.setUp()
File "/var/lib/jenkins/jobs/cubicweb-3.23/workspace/TOXENV/py27-server/cubicweb/server/test/unittest_repository.py", line 518, in setUp
CubicWebTC.setUp(self)
File "/var/lib/jenkins/jobs/cubicweb-3.23/workspace/TOXENV/py27-server/cubicweb/devtools/testlib.py", line 448, in setUp
self._init_repo()
File "/var/lib/jenkins/jobs/cubicweb-3.23/workspace/TOXENV/py27-server/cubicweb/devtools/testlib.py", line 357, in _init_repo
db_handler.restore_database(self.test_db_id)
File "/var/lib/jenkins/jobs/cubicweb-3.23/workspace/TOXENV/py27-server/cubicweb/devtools/__init__.py", line 378, in restore_database
self._restore_database(backup_coordinates, config)
File "/var/lib/jenkins/jobs/cubicweb-3.23/workspace/TOXENV/py27-server/cubicweb/devtools/__init__.py", line 815, in _restore_database
self.get_repo()
File "/var/lib/jenkins/jobs/cubicweb-3.23/workspace/TOXENV/py27-server/cubicweb/devtools/__init__.py", line 393, in get_repo
self._repo = self._new_repo(self.config)
File "/var/lib/jenkins/jobs/cubicweb-3.23/workspace/TOXENV/py27-server/cubicweb/devtools/__init__.py", line 407, in _new_repo
repo = config.repository()
File "/var/lib/jenkins/jobs/cubicweb-3.23/workspace/TOXENV/py27-server/cubicweb/cwconfig.py", line 1030, in repository
return Repository(self, TasksManager(), vreg=vreg)
File "/var/lib/jenkins/jobs/cubicweb-3.23/workspace/TOXENV/py27-server/cubicweb/server/repository.py", line 186, in __init__
self.init_cnxset_pool()
File "/var/lib/jenkins/jobs/cubicweb-3.23/workspace/TOXENV/py27-server/cubicweb/server/repository.py", line 228, in init_cnxset_pool
self.set_schema(config.load_schema(expand_cubes=True))
File "/var/lib/jenkins/jobs/cubicweb-3.23/workspace/TOXENV/py27-server/cubicweb/server/repository.py", line 315, in set_schema
self.vreg.set_schema(schema)
File "/var/lib/jenkins/jobs/cubicweb-3.23/workspace/TOXENV/py27-server/cubicweb/cwvreg.py", line 424, in set_schema
self.reload(self.config.appobjects_path(), force_reload=False)
File "/var/lib/jenkins/jobs/cubicweb-3.23/workspace/TOXENV/py27-server/cubicweb/cwvreg.py", line 474, in reload
self.register_objects(path)
File "/var/lib/jenkins/jobs/cubicweb-3.23/workspace/TOXENV/py27-server/cubicweb/cwvreg.py", line 519, in register_objects
path, self.config.extrapath)
File "/var/lib/jenkins/jobs/cubicweb-3.23/workspace/TOXENV/py27-server/.tox/py27-server/local/lib/python2.7/site-packages/logilab/common/registry.py", line 681, in register_objects
self.load_file(filepath, modname)
File "/var/lib/jenkins/jobs/cubicweb-3.23/workspace/TOXENV/py27-server/cubicweb/cwvreg.py", line 484, in load_file
return super(CWRegistryStore, self).load_file(filepath, modname)
File "/var/lib/jenkins/jobs/cubicweb-3.23/workspace/TOXENV/py27-server/.tox/py27-server/local/lib/python2.7/site-packages/logilab/common/registry.py", line 738, in load_file
module = load_module_from_name(modname)
File "/var/lib/jenkins/jobs/cubicweb-3.23/workspace/TOXENV/py27-server/.tox/py27-server/local/lib/python2.7/site-packages/logilab/common/modutils.py", line 125, in load_module_from_name
return load_module_from_modpath(dotted_name.split('.'), path, use_sys)
File "/var/lib/jenkins/jobs/cubicweb-3.23/workspace/TOXENV/py27-server/.tox/py27-server/local/lib/python2.7/site-packages/logilab/common/modutils.py", line 169, in load_module_from_modpath
module = load_module(curname, mp_file, mp_filename, mp_desc)
File "/var/lib/jenkins/jobs/cubicweb-3.23/workspace/TOXENV/py27-server/cubicweb/web/views/workflow.py", line 82, in <module>
class ChangeStateForm(forms.CompositeEntityForm):
File "/var/lib/jenkins/jobs/cubicweb-3.23/workspace/TOXENV/py27-server/cubicweb/web/views/workflow.py", line 90, in ChangeStateForm
{'class': fw.Button.css_class + ' cwjs-edition-cancel'})]
NameError: name 'fw' is not defined

no stdout
no stderr
======================================================================
ERROR: test_add_relation_inlined (unittest_repository.PerformanceTest)
----------------------------------------------------------------------
Traceback (most recent call last)
File "/var/lib/jenkins/jobs/cubicweb-3.23/workspace/TOXENV/py27-server/.tox/py27-server/local/lib/python2.7/site-packages/unittest2/case.py", line 67, in testPartExecutor
yield
File "/var/lib/jenkins/jobs/cubicweb-3.23/workspace/TOXENV/py27-server/.tox/py27-server/local/lib/python2.7/site-packages/unittest2/case.py", line 621, in run
self.setUp()
File "/var/lib/jenkins/jobs/cubicweb-3.23/workspace/TOXENV/py27-server/cubicweb/server/test/unittest_repository.py", line 582, in setUp
super(PerformanceTest, self).setUp()
File "/var/lib/jenkins/jobs/cubicweb-3.23/workspace/TOXENV/py27-server/cubicweb/devtools/testlib.py", line 448, in setUp
self._init_repo()
File "/var/lib/jenkins/jobs/cubicweb-3.23/workspace/TOXENV/py27-server/cubicweb/devtools/testlib.py", line 357, in _init_repo
db_handler.restore_database(self.test_db_id)
File "/var/lib/jenkins/jobs/cubicweb-3.23/workspace/TOXENV/py27-server/cubicweb/devtools/__init__.py", line 378, in restore_database
self._restore_database(backup_coordinates, config)
File "/var/lib/jenkins/jobs/cubicweb-3.23/workspace/TOXENV/py27-server/cubicweb/devtools/__init__.py", line 815, in _restore_database
self.get_repo()
File "/var/lib/jenkins/jobs/cubicweb-3.23/workspace/TOXENV/py27-server/cubicweb/devtools/__init__.py", line 393, in get_repo
self._repo = self._new_repo(self.config)
File "/var/lib/jenkins/jobs/cubicweb-3.23/workspace/TOXENV/py27-server/cubicweb/devtools/__init__.py", line 407, in _new_repo
repo = config.repository()
File "/var/lib/jenkins/jobs/cubicweb-3.23/workspace/TOXENV/py27-server/cubicweb/cwconfig.py", line 1030, in repository
return Repository(self, TasksManager(), vreg=vreg)
File "/var/lib/jenkins/jobs/cubicweb-3.23/workspace/TOXENV/py27-server/cubicweb/server/repository.py", line 186, in __init__
self.init_cnxset_pool()
File "/var/lib/jenkins/jobs/cubicweb-3.23/workspace/TOXENV/py27-server/cubicweb/server/repository.py", line 228, in init_cnxset_pool
self.set_schema(config.load_schema(expand_cubes=True))
File "/var/lib/jenkins/jobs/cubicweb-3.23/workspace/TOXENV/py27-server/cubicweb/server/repository.py", line 315, in set_schema
self.vreg.set_schema(schema)
File "/var/lib/jenkins/jobs/cubicweb-3.23/workspace/TOXENV/py27-server/cubicweb/cwvreg.py", line 424, in set_schema
self.reload(self.config.appobjects_path(), force_reload=False)
File "/var/lib/jenkins/jobs/cubicweb-3.23/workspace/TOXENV/py27-server/cubicweb/cwvreg.py", line 474, in reload
self.register_objects(path)
File "/var/lib/jenkins/jobs/cubicweb-3.23/workspace/TOXENV/py27-server/cubicweb/cwvreg.py", line 519, in register_objects
path, self.config.extrapath)
File "/var/lib/jenkins/jobs/cubicweb-3.23/workspace/TOXENV/py27-server/.tox/py27-server/local/lib/python2.7/site-packages/logilab/common/registry.py", line 681, in register_objects
self.load_file(filepath, modname)
File "/var/lib/jenkins/jobs/cubicweb-3.23/workspace/TOXENV/py27-server/cubicweb/cwvreg.py", line 484, in load_file
return super(CWRegistryStore, self).load_file(filepath, modname)
File "/var/lib/jenkins/jobs/cubicweb-3.23/workspace/TOXENV/py27-server/.tox/py27-server/local/lib/python2.7/site-packages/logilab/common/registry.py", line 738, in load_file
module = load_module_from_name(modname)
File "/var/lib/jenkins/jobs/cubicweb-3.23/workspace/TOXENV/py27-server/.tox/py27-server/local/lib/python2.7/site-packages/logilab/common/modutils.py", line 125, in load_module_from_name
return load_module_from_modpath(dotted_name.split('.'), path, use_sys)
File "/var/lib/jenkins/jobs/cubicweb-3.23/workspace/TOXENV/py27-server/.tox/py27-server/local/lib/python2.7/site-packages/logilab/common/modutils.py", line 169, in load_module_from_modpath
module = load_module(curname, mp_file, mp_filename, mp_desc)
File "/var/lib/jenkins/jobs/cubicweb-3.23/workspace/TOXENV/py27-server/cubicweb/web/views/workflow.py", line 82, in <module>
class ChangeStateForm(forms.CompositeEntityForm):
File "/var/lib/jenkins/jobs/cubicweb-3.23/workspace/TOXENV/py27-server/cubicweb/web/views/workflow.py", line 90, in ChangeStateForm
{'class': fw.Button.css_class + ' cwjs-edition-cancel'})]
NameError: name 'fw' is not defined

no stdout
no stderr
======================================================================
ERROR: test_all_entities_have_cw_source (unittest_repository.RepositoryTC)
----------------------------------------------------------------------
Traceback (most recent call last)
File "/var/lib/jenkins/jobs/cubicweb-3.23/workspace/TOXENV/py27-server/.tox/py27-server/local/lib/python2.7/site-packages/unittest2/case.py", line 67, in testPartExecutor
yield
File "/var/lib/jenkins/jobs/cubicweb-3.23/workspace/TOXENV/py27-server/.tox/py27-server/local/lib/python2.7/site-packages/unittest2/case.py", line 621, in run
self.setUp()
File "/var/lib/jenkins/jobs/cubicweb-3.23/workspace/TOXENV/py27-server/cubicweb/devtools/testlib.py", line 448, in setUp
self._init_repo()
File "/var/lib/jenkins/jobs/cubicweb-3.23/workspace/TOXENV/py27-server/cubicweb/devtools/testlib.py", line 357, in _init_repo
db_handler.restore_database(self.test_db_id)
File "/var/lib/jenkins/jobs/cubicweb-3.23/workspace/TOXENV/py27-server/cubicweb/devtools/__init__.py", line 378, in restore_database
self._restore_database(backup_coordinates, config)
File "/var/lib/jenkins/jobs/cubicweb-3.23/workspace/TOXENV/py27-server/cubicweb/devtools/__init__.py", line 815, in _restore_database
self.get_repo()
File "/var/lib/jenkins/jobs/cubicweb-3.23/workspace/TOXENV/py27-server/cubicweb/devtools/__init__.py", line 393, in get_repo
self._repo = self._new_repo(self.config)
File "/var/lib/jenkins/jobs/cubicweb-3.23/workspace/TOXENV/py27-server/cubicweb/devtools/__init__.py", line 407, in _new_repo
repo = config.repository()
File "/var/lib/jenkins/jobs/cubicweb-3.23/workspace/TOXENV/py27-server/cubicweb/cwconfig.py", line 1030, in repository
return Repository(self, TasksManager(), vreg=vreg)
File "/var/lib/jenkins/jobs/cubicweb-3.23/workspace/TOXENV/py27-server/cubicweb/server/repository.py", line 186, in __init__
self.init_cnxset_pool()
File "/var/lib/jenkins/jobs/cubicweb-3.23/workspace/TOXENV/py27-server/cubicweb/server/repository.py", line 228, in init_cnxset_pool
self.set_schema(config.load_schema(expand_cubes=True))
File "/var/lib/jenkins/jobs/cubicweb-3.23/workspace/TOXENV/py27-server/cubicweb/server/repository.py", line 315, in set_schema
self.vreg.set_schema(schema)
File "/var/lib/jenkins/jobs/cubicweb-3.23/workspace/TOXENV/py27-server/cubicweb/cwvreg.py", line 424, in set_schema
self.reload(self.config.appobjects_path(), force_reload=False)
File "/var/lib/jenkins/jobs/cubicweb-3.23/workspace/TOXENV/py27-server/cubicweb/cwvreg.py", line 474, in reload
self.register_objects(path)
File "/var/lib/jenkins/jobs/cubicweb-3.23/workspace/TOXENV/py27-server/cubicweb/cwvreg.py", line 519, in register_objects
path, self.config.extrapath)
File "/var/lib/jenkins/jobs/cubicweb-3.23/workspace/TOXENV/py27-server/.tox/py27-server/local/lib/python2.7/site-packages/logilab/common/registry.py", line 681, in register_objects
self.load_file(filepath, modname)
File "/var/lib/jenkins/jobs/cubicweb-3.23/workspace/TOXENV/py27-server/cubicweb/cwvreg.py", line 484, in load_file
return super(CWRegistryStore, self).load_file(filepath, modname)
File "/var/lib/jenkins/jobs/cubicweb-3.23/workspace/TOXENV/py27-server/.tox/py27-server/local/lib/python2.7/site-packages/logilab/common/registry.py", line 738, in load_file
module = load_module_from_name(modname)
File "/var/lib/jenkins/jobs/cubicweb-3.23/workspace/TOXENV/py27-server/.tox/py27-server/local/lib/python2.7/site-packages/logilab/common/modutils.py", line 125, in load_module_from_name
return load_module_from_modpath(dotted_name.split('.'), path, use_sys)
File "/var/lib/jenkins/jobs/cubicweb-3.23/workspace/TOXENV/py27-server/.tox/py27-server/local/lib/python2.7/site-packages/logilab/common/modutils.py", line 169, in load_module_from_modpath
module = load_module(curname, mp_file, mp_filename, mp_desc)
File "/var/lib/jenkins/jobs/cubicweb-3.23/workspace/TOXENV/py27-server/cubicweb/web/views/workflow.py", line 82, in <module>
class ChangeStateForm(forms.CompositeEntityForm):
File "/var/lib/jenkins/jobs/cubicweb-3.23/workspace/TOXENV/py27-server/cubicweb/web/views/workflow.py", line 90, in ChangeStateForm
{'class': fw.Button.css_class + ' cwjs-edition-cancel'})]
NameError: name 'fw' is not defined

no stdout
no stderr
======================================================================
ERROR: test_custom_attribute_param (unittest_repository.SchemaDeserialTC)
----------------------------------------------------------------------
Traceback (most recent call last)
File "/var/lib/jenkins/jobs/cubicweb-3.23/workspace/TOXENV/py27-server/.tox/py27-server/local/lib/python2.7/site-packages/unittest2/case.py", line 67, in testPartExecutor
yield
File "/var/lib/jenkins/jobs/cubicweb-3.23/workspace/TOXENV/py27-server/.tox/py27-server/local/lib/python2.7/site-packages/unittest2/case.py", line 621, in run
self.setUp()
File "/var/lib/jenkins/jobs/cubicweb-3.23/workspace/TOXENV/py27-server/cubicweb/devtools/testlib.py", line 448, in setUp
self._init_repo()
File "/var/lib/jenkins/jobs/cubicweb-3.23/workspace/TOXENV/py27-server/cubicweb/devtools/testlib.py", line 357, in _init_repo
db_handler.restore_database(self.test_db_id)
File "/var/lib/jenkins/jobs/cubicweb-3.23/workspace/TOXENV/py27-server/cubicweb/devtools/__init__.py", line 378, in restore_database
self._restore_database(backup_coordinates, config)
File "/var/lib/jenkins/jobs/cubicweb-3.23/workspace/TOXENV/py27-server/cubicweb/devtools/__init__.py", line 815, in _restore_database
self.get_repo()
File "/var/lib/jenkins/jobs/cubicweb-3.23/workspace/TOXENV/py27-server/cubicweb/devtools/__init__.py", line 393, in get_repo
self._repo = self._new_repo(self.config)
File "/var/lib/jenkins/jobs/cubicweb-3.23/workspace/TOXENV/py27-server/cubicweb/devtools/__init__.py", line 407, in _new_repo
repo = config.repository()
File "/var/lib/jenkins/jobs/cubicweb-3.23/workspace/TOXENV/py27-server/cubicweb/cwconfig.py", line 1030, in repository
return Repository(self, TasksManager(), vreg=vreg)
File "/var/lib/jenkins/jobs/cubicweb-3.23/workspace/TOXENV/py27-server/cubicweb/server/repository.py", line 186, in __init__
self.init_cnxset_pool()
File "/var/lib/jenkins/jobs/cubicweb-3.23/workspace/TOXENV/py27-server/cubicweb/server/repository.py", line 228, in init_cnxset_pool
self.set_schema(config.load_schema(expand_cubes=True))
File "/var/lib/jenkins/jobs/cubicweb-3.23/workspace/TOXENV/py27-server/cubicweb/server/repository.py", line 315, in set_schema
self.vreg.set_schema(schema)
File "/var/lib/jenkins/jobs/cubicweb-3.23/workspace/TOXENV/py27-server/cubicweb/cwvreg.py", line 424, in set_schema
self.reload(self.config.appobjects_path(), force_reload=False)
File "/var/lib/jenkins/jobs/cubicweb-3.23/workspace/TOXENV/py27-server/cubicweb/cwvreg.py", line 474, in reload
self.register_objects(path)
File "/var/lib/jenkins/jobs/cubicweb-3.23/workspace/TOXENV/py27-server/cubicweb/cwvreg.py", line 519, in register_objects
path, self.config.extrapath)
File "/var/lib/jenkins/jobs/cubicweb-3.23/workspace/TOXENV/py27-server/.tox/py27-server/local/lib/python2.7/site-packages/logilab/common/registry.py", line 681, in register_objects
self.load_file(filepath, modname)
File "/var/lib/jenkins/jobs/cubicweb-3.23/workspace/TOXENV/py27-server/cubicweb/cwvreg.py", line 484, in load_file
return super(CWRegistryStore, self).load_file(filepath, modname)
File "/var/lib/jenkins/jobs/cubicweb-3.23/workspace/TOXENV/py27-server/.tox/py27-server/local/lib/python2.7/site-packages/logilab/common/registry.py", line 738, in load_file
module = load_module_from_name(modname)
File "/var/lib/jenkins/jobs/cubicweb-3.23/workspace/TOXENV/py27-server/.tox/py27-server/local/lib/python2.7/site-packages/logilab/common/modutils.py", line 125, in load_module_from_name
return load_module_from_modpath(dotted_name.split('.'), path, use_sys)
File "/var/lib/jenkins/jobs/cubicweb-3.23/workspace/TOXENV/py27-server/.tox/py27-server/local/lib/python2.7/site-packages/logilab/common/modutils.py", line 169, in load_module_from_modpath
module = load_module(curname, mp_file, mp_filename, mp_desc)
File "/var/lib/jenkins/jobs/cubicweb-3.23/workspace/TOXENV/py27-server/cubicweb/web/views/workflow.py", line 82, in <module>
class ChangeStateForm(forms.CompositeEntityForm):
File "/var/lib/jenkins/jobs/cubicweb-3.23/workspace/TOXENV/py27-server/cubicweb/web/views/workflow.py", line 90, in ChangeStateForm
{'class': fw.Button.css_class + ' cwjs-edition-cancel'})]
NameError: name 'fw' is not defined

no stdout
no stderr
======================================================================
SKIPPED: test_type_from_eid (unittest_repository.DataHelpersTC)
repository is not initialised: NameError("name 'fw' is not defined",)
======================================================================
SKIPPED: test_type_from_eid_raise (unittest_repository.DataHelpersTC)
repository is not initialised: NameError("name 'fw' is not defined",)
======================================================================
SKIPPED: test_no_uncessary_ftiindex_op (unittest_repository.FTITC)
repository is not initialised: NameError("name 'fw' is not defined",)
======================================================================
SKIPPED: test_inline_relation (unittest_repository.InlineRelHooksTC)
make sure <event>_relation hooks are called for inlined relation
repository is not initialised: NameError("name 'fw' is not defined",)
======================================================================
SKIPPED: test_unique_contraint (unittest_repository.InlineRelHooksTC)
repository is not initialised: NameError("name 'fw' is not defined",)
======================================================================
SKIPPED: test_add_relation_non_inlined (unittest_repository.PerformanceTest)
repository is not initialised: NameError("name 'fw' is not defined",)
======================================================================
SKIPPED: test_composite_deletion (unittest_repository.PerformanceTest)
repository is not initialised: NameError("name 'fw' is not defined",)
======================================================================
SKIPPED: test_optional_relation_reset_1 (unittest_repository.PerformanceTest)
repository is not initialised: NameError("name 'fw' is not defined",)
======================================================================
SKIPPED: test_optional_relation_reset_2 (unittest_repository.PerformanceTest)
repository is not initialised: NameError("name 'fw' is not defined",)
======================================================================
SKIPPED: test_session_add_relation (unittest_repository.PerformanceTest)
to be compared with test_session_add_relations
repository is not initialised: NameError("name 'fw' is not defined",)
======================================================================
SKIPPED: test_session_add_relation_inlined (unittest_repository.PerformanceTest)
to be compared with test_session_add_relations
repository is not initialised: NameError("name 'fw' is not defined",)
======================================================================
SKIPPED: test_session_add_relations (unittest_repository.PerformanceTest)
to be compared with test_session_add_relation
repository is not initialised: NameError("name 'fw' is not defined",)
======================================================================
SKIPPED: test_session_add_relations_inlined (unittest_repository.PerformanceTest)
to be compared with test_session_add_relation
repository is not initialised: NameError("name 'fw' is not defined",)
======================================================================
SKIPPED: test_all_entities_have_is (unittest_repository.RepositoryTC)
repository is not initialised: NameError("name 'fw' is not defined",)
======================================================================
SKIPPED: test_all_entities_have_owner (unittest_repository.RepositoryTC)
repository is not initialised: NameError("name 'fw' is not defined",)
======================================================================
SKIPPED: test_attribute_cache (unittest_repository.RepositoryTC)
repository is not initialised: NameError("name 'fw' is not defined",)
======================================================================
SKIPPED: test_close (unittest_repository.RepositoryTC)
repository is not initialised: NameError("name 'fw' is not defined",)
======================================================================
SKIPPED: test_connect (unittest_repository.RepositoryTC)
repository is not initialised: NameError("name 'fw' is not defined",)
======================================================================
SKIPPED: test_cw_set_in_before_add (unittest_repository.RepositoryTC)
repository is not initialised: NameError("name 'fw' is not defined",)
======================================================================
SKIPPED: test_cw_set_in_before_update (unittest_repository.RepositoryTC)
repository is not initialised: NameError("name 'fw' is not defined",)
======================================================================
SKIPPED: test_delete_computed_relation_nonregr (unittest_repository.RepositoryTC)
repository is not initialised: NameError("name 'fw' is not defined",)
======================================================================
SKIPPED: test_delete_if_object_inlined_singlecard (unittest_repository.RepositoryTC)
repository is not initialised: NameError("name 'fw' is not defined",)
======================================================================
SKIPPED: test_delete_if_singlecard1 (unittest_repository.RepositoryTC)
repository is not initialised: NameError("name 'fw' is not defined",)
======================================================================
SKIPPED: test_initial_schema (unittest_repository.RepositoryTC)
repository is not initialised: NameError("name 'fw' is not defined",)
======================================================================
SKIPPED: test_internal_api (unittest_repository.RepositoryTC)
repository is not initialised: NameError("name 'fw' is not defined",)
======================================================================
SKIPPED: test_login_upassword_accent (unittest_repository.RepositoryTC)
repository is not initialised: NameError("name 'fw' is not defined",)
======================================================================
SKIPPED: test_multiple_edit_cw_set (unittest_repository.RepositoryTC)
make sure cw_edited doesn't get cluttered
repository is not initialised: NameError("name 'fw' is not defined",)
======================================================================
SKIPPED: test_public_api (unittest_repository.RepositoryTC)
repository is not initialised: NameError("name 'fw' is not defined",)
======================================================================
SKIPPED: test_rollback_on_execute_unauthorized (unittest_repository.RepositoryTC)
repository is not initialised: NameError("name 'fw' is not defined",)
======================================================================
SKIPPED: test_rollback_on_execute_validation_error (unittest_repository.RepositoryTC)
repository is not initialised: NameError("name 'fw' is not defined",)
======================================================================
SKIPPED: test_schema_is_relation (unittest_repository.RepositoryTC)
repository is not initialised: NameError("name 'fw' is not defined",)
======================================================================
SKIPPED: test_unique_together_constraint (unittest_repository.RepositoryTC)
repository is not initialised: NameError("name 'fw' is not defined",)
======================================================================
SKIPPED: test_unique_together_schema (unittest_repository.RepositoryTC)
repository is not initialised: NameError("name 'fw' is not defined",)
======================================================================
SKIPPED: test_user_friendly_error (unittest_repository.RepositoryTC)
repository is not initialised: NameError("name 'fw' is not defined",)
======================================================================
SKIPPED: test_deserialization_base (unittest_repository.SchemaDeserialTC)
Check the following deserialization
repository is not initialised: NameError("name 'fw' is not defined",)
====================== unittest_schema2sql.py ======================
.
======================= unittest_storage.py ========================
ESSSSSSSSSSSSSSS
======================================================================
ERROR: test_False (unittest_storage.StorageTC)
----------------------------------------------------------------------
Traceback (most recent call last)
File "/var/lib/jenkins/jobs/cubicweb-3.23/workspace/TOXENV/py27-server/.tox/py27-server/local/lib/python2.7/site-packages/unittest2/case.py", line 67, in testPartExecutor
yield
File "/var/lib/jenkins/jobs/cubicweb-3.23/workspace/TOXENV/py27-server/.tox/py27-server/local/lib/python2.7/site-packages/unittest2/case.py", line 621, in run
self.setUp()
File "/var/lib/jenkins/jobs/cubicweb-3.23/workspace/TOXENV/py27-server/cubicweb/devtools/testlib.py", line 448, in setUp
self._init_repo()
File "/var/lib/jenkins/jobs/cubicweb-3.23/workspace/TOXENV/py27-server/cubicweb/devtools/testlib.py", line 357, in _init_repo
db_handler.restore_database(self.test_db_id)
File "/var/lib/jenkins/jobs/cubicweb-3.23/workspace/TOXENV/py27-server/cubicweb/devtools/__init__.py", line 378, in restore_database
self._restore_database(backup_coordinates, config)
File "/var/lib/jenkins/jobs/cubicweb-3.23/workspace/TOXENV/py27-server/cubicweb/devtools/__init__.py", line 815, in _restore_database
self.get_repo()
File "/var/lib/jenkins/jobs/cubicweb-3.23/workspace/TOXENV/py27-server/cubicweb/devtools/__init__.py", line 393, in get_repo
self._repo = self._new_repo(self.config)
File "/var/lib/jenkins/jobs/cubicweb-3.23/workspace/TOXENV/py27-server/cubicweb/devtools/__init__.py", line 407, in _new_repo
repo = config.repository()
File "/var/lib/jenkins/jobs/cubicweb-3.23/workspace/TOXENV/py27-server/cubicweb/cwconfig.py", line 1030, in repository
return Repository(self, TasksManager(), vreg=vreg)
File "/var/lib/jenkins/jobs/cubicweb-3.23/workspace/TOXENV/py27-server/cubicweb/server/repository.py", line 186, in __init__
self.init_cnxset_pool()
File "/var/lib/jenkins/jobs/cubicweb-3.23/workspace/TOXENV/py27-server/cubicweb/server/repository.py", line 228, in init_cnxset_pool
self.set_schema(config.load_schema(expand_cubes=True))
File "/var/lib/jenkins/jobs/cubicweb-3.23/workspace/TOXENV/py27-server/cubicweb/server/repository.py", line 315, in set_schema
self.vreg.set_schema(schema)
File "/var/lib/jenkins/jobs/cubicweb-3.23/workspace/TOXENV/py27-server/cubicweb/cwvreg.py", line 424, in set_schema
self.reload(self.config.appobjects_path(), force_reload=False)
File "/var/lib/jenkins/jobs/cubicweb-3.23/workspace/TOXENV/py27-server/cubicweb/cwvreg.py", line 474, in reload
self.register_objects(path)
File "/var/lib/jenkins/jobs/cubicweb-3.23/workspace/TOXENV/py27-server/cubicweb/cwvreg.py", line 519, in register_objects
path, self.config.extrapath)
File "/var/lib/jenkins/jobs/cubicweb-3.23/workspace/TOXENV/py27-server/.tox/py27-server/local/lib/python2.7/site-packages/logilab/common/registry.py", line 681, in register_objects
self.load_file(filepath, modname)
File "/var/lib/jenkins/jobs/cubicweb-3.23/workspace/TOXENV/py27-server/cubicweb/cwvreg.py", line 484, in load_file
return super(CWRegistryStore, self).load_file(filepath, modname)
File "/var/lib/jenkins/jobs/cubicweb-3.23/workspace/TOXENV/py27-server/.tox/py27-server/local/lib/python2.7/site-packages/logilab/common/registry.py", line 738, in load_file
module = load_module_from_name(modname)
File "/var/lib/jenkins/jobs/cubicweb-3.23/workspace/TOXENV/py27-server/.tox/py27-server/local/lib/python2.7/site-packages/logilab/common/modutils.py", line 125, in load_module_from_name
return load_module_from_modpath(dotted_name.split('.'), path, use_sys)
File "/var/lib/jenkins/jobs/cubicweb-3.23/workspace/TOXENV/py27-server/.tox/py27-server/local/lib/python2.7/site-packages/logilab/common/modutils.py", line 169, in load_module_from_modpath
module = load_module(curname, mp_file, mp_filename, mp_desc)
File "/var/lib/jenkins/jobs/cubicweb-3.23/workspace/TOXENV/py27-server/cubicweb/web/views/workflow.py", line 82, in <module>
class ChangeStateForm(forms.CompositeEntityForm):
File "/var/lib/jenkins/jobs/cubicweb-3.23/workspace/TOXENV/py27-server/cubicweb/web/views/workflow.py", line 90, in ChangeStateForm
{'class': fw.Button.css_class + ' cwjs-edition-cancel'})]
NameError: name 'fw' is not defined

no stdout
no stderr
======================================================================
SKIPPED: test_bfss_fs_importing_doesnt_touch_path (unittest_storage.StorageTC)
repository is not initialised: NameError("name 'fw' is not defined",)
======================================================================
SKIPPED: test_bfss_fs_importing_transparency (unittest_storage.StorageTC)
repository is not initialised: NameError("name 'fw' is not defined",)
======================================================================
SKIPPED: test_bfss_sqlite_fspath (unittest_storage.StorageTC)
repository is not initialised: NameError("name 'fw' is not defined",)
======================================================================
SKIPPED: test_bfss_storage (unittest_storage.StorageTC)
repository is not initialised: NameError("name 'fw' is not defined",)
======================================================================
SKIPPED: test_bfss_update_to_None (unittest_storage.StorageTC)
repository is not initialised: NameError("name 'fw' is not defined",)
======================================================================
SKIPPED: test_bfss_update_with_different_extension_commited (unittest_storage.StorageTC)
repository is not initialised: NameError("name 'fw' is not defined",)
======================================================================
SKIPPED: test_bfss_update_with_different_extension_rolled_back (unittest_storage.StorageTC)
repository is not initialised: NameError("name 'fw' is not defined",)
======================================================================
SKIPPED: test_bfss_update_with_existing_data (unittest_storage.StorageTC)
repository is not initialised: NameError("name 'fw' is not defined",)
======================================================================
SKIPPED: test_bfss_update_with_fs_importing (unittest_storage.StorageTC)
repository is not initialised: NameError("name 'fw' is not defined",)
======================================================================
SKIPPED: test_bfss_wrong_fspath_usage (unittest_storage.StorageTC)
repository is not initialised: NameError("name 'fw' is not defined",)
======================================================================
SKIPPED: test_clean (unittest_storage.StorageTC)
repository is not initialised: NameError("name 'fw' is not defined",)
======================================================================
SKIPPED: test_source_mapped_attribute_advanced (unittest_storage.StorageTC)
repository is not initialised: NameError("name 'fw' is not defined",)
======================================================================
SKIPPED: test_source_mapped_attribute_error_cases (unittest_storage.StorageTC)
repository is not initialised: NameError("name 'fw' is not defined",)
======================================================================
SKIPPED: test_source_storage_transparency (unittest_storage.StorageTC)
repository is not initialised: NameError("name 'fw' is not defined",)
======================================================================
SKIPPED: test_true (unittest_storage.StorageTC)
repository is not initialised: NameError("name 'fw' is not defined",)
==================== unittest_checkintegrity.py ====================
...
======================= unittest_sqlutils.py =======================
..E
======================================================================
ERROR: test_group_concat (unittest_sqlutils.SQLUtilsTC)
----------------------------------------------------------------------
Traceback (most recent call last)
File "/var/lib/jenkins/jobs/cubicweb-3.23/workspace/TOXENV/py27-server/.tox/py27-server/local/lib/python2.7/site-packages/unittest2/case.py", line 67, in testPartExecutor
yield
File "/var/lib/jenkins/jobs/cubicweb-3.23/workspace/TOXENV/py27-server/.tox/py27-server/local/lib/python2.7/site-packages/unittest2/case.py", line 621, in run
self.setUp()
File "/var/lib/jenkins/jobs/cubicweb-3.23/workspace/TOXENV/py27-server/cubicweb/devtools/testlib.py", line 448, in setUp
self._init_repo()
File "/var/lib/jenkins/jobs/cubicweb-3.23/workspace/TOXENV/py27-server/cubicweb/devtools/testlib.py", line 357, in _init_repo
db_handler.restore_database(self.test_db_id)
File "/var/lib/jenkins/jobs/cubicweb-3.23/workspace/TOXENV/py27-server/cubicweb/devtools/__init__.py", line 378, in restore_database
self._restore_database(backup_coordinates, config)
File "/var/lib/jenkins/jobs/cubicweb-3.23/workspace/TOXENV/py27-server/cubicweb/devtools/__init__.py", line 815, in _restore_database
self.get_repo()
File "/var/lib/jenkins/jobs/cubicweb-3.23/workspace/TOXENV/py27-server/cubicweb/devtools/__init__.py", line 393, in get_repo
self._repo = self._new_repo(self.config)
File "/var/lib/jenkins/jobs/cubicweb-3.23/workspace/TOXENV/py27-server/cubicweb/devtools/__init__.py", line 407, in _new_repo
repo = config.repository()
File "/var/lib/jenkins/jobs/cubicweb-3.23/workspace/TOXENV/py27-server/cubicweb/cwconfig.py", line 1030, in repository
return Repository(self, TasksManager(), vreg=vreg)
File "/var/lib/jenkins/jobs/cubicweb-3.23/workspace/TOXENV/py27-server/cubicweb/server/repository.py", line 186, in __init__
self.init_cnxset_pool()
File "/var/lib/jenkins/jobs/cubicweb-3.23/workspace/TOXENV/py27-server/cubicweb/server/repository.py", line 228, in init_cnxset_pool
self.set_schema(config.load_schema(expand_cubes=True))
File "/var/lib/jenkins/jobs/cubicweb-3.23/workspace/TOXENV/py27-server/cubicweb/server/repository.py", line 315, in set_schema
self.vreg.set_schema(schema)
File "/var/lib/jenkins/jobs/cubicweb-3.23/workspace/TOXENV/py27-server/cubicweb/cwvreg.py", line 424, in set_schema
self.reload(self.config.appobjects_path(), force_reload=False)
File "/var/lib/jenkins/jobs/cubicweb-3.23/workspace/TOXENV/py27-server/cubicweb/cwvreg.py", line 474, in reload
self.register_objects(path)
File "/var/lib/jenkins/jobs/cubicweb-3.23/workspace/TOXENV/py27-server/cubicweb/cwvreg.py", line 519, in register_objects
path, self.config.extrapath)
File "/var/lib/jenkins/jobs/cubicweb-3.23/workspace/TOXENV/py27-server/.tox/py27-server/local/lib/python2.7/site-packages/logilab/common/registry.py", line 681, in register_objects
self.load_file(filepath, modname)
File "/var/lib/jenkins/jobs/cubicweb-3.23/workspace/TOXENV/py27-server/cubicweb/cwvreg.py", line 484, in load_file
return super(CWRegistryStore, self).load_file(filepath, modname)
File "/var/lib/jenkins/jobs/cubicweb-3.23/workspace/TOXENV/py27-server/.tox/py27-server/local/lib/python2.7/site-packages/logilab/common/registry.py", line 738, in load_file
module = load_module_from_name(modname)
File "/var/lib/jenkins/jobs/cubicweb-3.23/workspace/TOXENV/py27-server/.tox/py27-server/local/lib/python2.7/site-packages/logilab/common/modutils.py", line 125, in load_module_from_name
return load_module_from_modpath(dotted_name.split('.'), path, use_sys)
File "/var/lib/jenkins/jobs/cubicweb-3.23/workspace/TOXENV/py27-server/.tox/py27-server/local/lib/python2.7/site-packages/logilab/common/modutils.py", line 169, in load_module_from_modpath
module = load_module(curname, mp_file, mp_filename, mp_desc)
File "/var/lib/jenkins/jobs/cubicweb-3.23/workspace/TOXENV/py27-server/cubicweb/web/views/workflow.py", line 82, in <module>
class ChangeStateForm(forms.CompositeEntityForm):
File "/var/lib/jenkins/jobs/cubicweb-3.23/workspace/TOXENV/py27-server/cubicweb/web/views/workflow.py", line 90, in ChangeStateForm
{'class': fw.Button.css_class + ' cwjs-edition-cancel'})]
NameError: name 'fw' is not defined

no stdout
no stderr
===================== unittest_migractions.py ======================
The files belonging to this database system will be owned by user "jenkins".
This user must also own the server process.

The database cluster will be initialized with locale "C".
The default text search configuration will be set to "english".

Data page checksums are disabled.

creating directory data/database/pgdb-unittest_migractions ... ok
creating subdirectories ... ok
selecting default max_connections ... 100
selecting default shared_buffers ... 128MB
selecting dynamic shared memory implementation ... posix
creating configuration files ... ok
creating template1 database in data/database/pgdb-unittest_migractions/base/1 ... ok
initializing pg_authid ... ok
initializing dependencies ... ok
creating system views ... ok
loading system objects' descriptions ... ok
creating collations ... ok
creating conversions ... ok
creating dictionaries ... ok
setting privileges on built-in objects ... ok
creating information schema ... ok
loading PL/pgSQL server-side language ... ok
vacuuming database template1 ... ok
copying template1 to template0 ... ok
copying template1 to postgres ... ok
syncing data to disk ... ok

WARNING: enabling "trust" authentication for local connections
You can change this by editing pg_hba.conf or using the option -A, or
--auth-local and --auth-host, the next time you run initdb.

Success. You can now start the database server using:

postgres -D data/database/pgdb-unittest_migractions
or
pg_ctl -D data/database/pgdb-unittest_migractions -l logfile start

waiting for server to start....LOG: database system was shut down at 2016-03-15 17:08:30 CET
LOG: MultiXact member wraparound protections are now enabled
LOG: autovacuum launcher started
LOG: database system is ready to accept connections
done
server started
........................................S....LOG: received fast shutdown request
LOG: aborting any active transactions
FATAL: terminating connection due to administrator command
LOG: autovacuum launcher shutting down
waiting for server to shut down....LOG: shutting down
LOG: database system is shut down
done
server stopped

======================================================================
SKIPPED: test_rename_relation (unittest_migractions.MigrationCommandsTC)
implement me
====================== unittest_serverctl.py =======================
E
======================================================================
ERROR: test_dump (unittest_serverctl.ServerCTLTC)
----------------------------------------------------------------------
Traceback (most recent call last)
File "/var/lib/jenkins/jobs/cubicweb-3.23/workspace/TOXENV/py27-server/.tox/py27-server/local/lib/python2.7/site-packages/unittest2/case.py", line 67, in testPartExecutor
yield
File "/var/lib/jenkins/jobs/cubicweb-3.23/workspace/TOXENV/py27-server/.tox/py27-server/local/lib/python2.7/site-packages/unittest2/case.py", line 621, in run
self.setUp()
File "/var/lib/jenkins/jobs/cubicweb-3.23/workspace/TOXENV/py27-server/cubicweb/server/test/unittest_serverctl.py", line 10, in setUp
super(ServerCTLTC, self).setUp()
File "/var/lib/jenkins/jobs/cubicweb-3.23/workspace/TOXENV/py27-server/cubicweb/devtools/testlib.py", line 448, in setUp
self._init_repo()
File "/var/lib/jenkins/jobs/cubicweb-3.23/workspace/TOXENV/py27-server/cubicweb/devtools/testlib.py", line 357, in _init_repo
db_handler.restore_database(self.test_db_id)
File "/var/lib/jenkins/jobs/cubicweb-3.23/workspace/TOXENV/py27-server/cubicweb/devtools/__init__.py", line 378, in restore_database
self._restore_database(backup_coordinates, config)
File "/var/lib/jenkins/jobs/cubicweb-3.23/workspace/TOXENV/py27-server/cubicweb/devtools/__init__.py", line 815, in _restore_database
self.get_repo()
File "/var/lib/jenkins/jobs/cubicweb-3.23/workspace/TOXENV/py27-server/cubicweb/devtools/__init__.py", line 393, in get_repo
self._repo = self._new_repo(self.config)
File "/var/lib/jenkins/jobs/cubicweb-3.23/workspace/TOXENV/py27-server/cubicweb/devtools/__init__.py", line 407, in _new_repo
repo = config.repository()
File "/var/lib/jenkins/jobs/cubicweb-3.23/workspace/TOXENV/py27-server/cubicweb/cwconfig.py", line 1030, in repository
return Repository(self, TasksManager(), vreg=vreg)
File "/var/lib/jenkins/jobs/cubicweb-3.23/workspace/TOXENV/py27-server/cubicweb/server/repository.py", line 186, in __init__
self.init_cnxset_pool()
File "/var/lib/jenkins/jobs/cubicweb-3.23/workspace/TOXENV/py27-server/cubicweb/server/repository.py", line 228, in init_cnxset_pool
self.set_schema(config.load_schema(expand_cubes=True))
File "/var/lib/jenkins/jobs/cubicweb-3.23/workspace/TOXENV/py27-server/cubicweb/server/repository.py", line 315, in set_schema
self.vreg.set_schema(schema)
File "/var/lib/jenkins/jobs/cubicweb-3.23/workspace/TOXENV/py27-server/cubicweb/cwvreg.py", line 424, in set_schema
self.reload(self.config.appobjects_path(), force_reload=False)
File "/var/lib/jenkins/jobs/cubicweb-3.23/workspace/TOXENV/py27-server/cubicweb/cwvreg.py", line 474, in reload
self.register_objects(path)
File "/var/lib/jenkins/jobs/cubicweb-3.23/workspace/TOXENV/py27-server/cubicweb/cwvreg.py", line 519, in register_objects
path, self.config.extrapath)
File "/var/lib/jenkins/jobs/cubicweb-3.23/workspace/TOXENV/py27-server/.tox/py27-server/local/lib/python2.7/site-packages/logilab/common/registry.py", line 681, in register_objects
self.load_file(filepath, modname)
File "/var/lib/jenkins/jobs/cubicweb-3.23/workspace/TOXENV/py27-server/cubicweb/cwvreg.py", line 484, in load_file
return super(CWRegistryStore, self).load_file(filepath, modname)
File "/var/lib/jenkins/jobs/cubicweb-3.23/workspace/TOXENV/py27-server/.tox/py27-server/local/lib/python2.7/site-packages/logilab/common/registry.py", line 738, in load_file
module = load_module_from_name(modname)
File "/var/lib/jenkins/jobs/cubicweb-3.23/workspace/TOXENV/py27-server/.tox/py27-server/local/lib/python2.7/site-packages/logilab/common/modutils.py", line 125, in load_module_from_name
return load_module_from_modpath(dotted_name.split('.'), path, use_sys)
File "/var/lib/jenkins/jobs/cubicweb-3.23/workspace/TOXENV/py27-server/.tox/py27-server/local/lib/python2.7/site-packages/logilab/common/modutils.py", line 169, in load_module_from_modpath
module = load_module(curname, mp_file, mp_filename, mp_desc)
File "/var/lib/jenkins/jobs/cubicweb-3.23/workspace/TOXENV/py27-server/cubicweb/web/views/workflow.py", line 82, in <module>
class ChangeStateForm(forms.CompositeEntityForm):
File "/var/lib/jenkins/jobs/cubicweb-3.23/workspace/TOXENV/py27-server/cubicweb/web/views/workflow.py", line 90, in ChangeStateForm
{'class': fw.Button.css_class + ' cwjs-edition-cancel'})]
NameError: name 'fw' is not defined

no stdout
no stderr
======================== unittest_tools.py =========================
.
======================= unittest_querier.py ========================
.ES......................S.........................S.......................................................................................................
======================================================================
ERROR: test_has_text_security_cache_bug (unittest_querier.NonRegressionTC)
----------------------------------------------------------------------
Traceback (most recent call last)
File "/var/lib/jenkins/jobs/cubicweb-3.23/workspace/TOXENV/py27-server/.tox/py27-server/local/lib/python2.7/site-packages/unittest2/case.py", line 67, in testPartExecutor
yield
File "/var/lib/jenkins/jobs/cubicweb-3.23/workspace/TOXENV/py27-server/.tox/py27-server/local/lib/python2.7/site-packages/unittest2/case.py", line 621, in run
self.setUp()
File "/var/lib/jenkins/jobs/cubicweb-3.23/workspace/TOXENV/py27-server/cubicweb/devtools/testlib.py", line 448, in setUp
self._init_repo()
File "/var/lib/jenkins/jobs/cubicweb-3.23/workspace/TOXENV/py27-server/cubicweb/devtools/testlib.py", line 357, in _init_repo
db_handler.restore_database(self.test_db_id)
File "/var/lib/jenkins/jobs/cubicweb-3.23/workspace/TOXENV/py27-server/cubicweb/devtools/__init__.py", line 378, in restore_database
self._restore_database(backup_coordinates, config)
File "/var/lib/jenkins/jobs/cubicweb-3.23/workspace/TOXENV/py27-server/cubicweb/devtools/__init__.py", line 815, in _restore_database
self.get_repo()
File "/var/lib/jenkins/jobs/cubicweb-3.23/workspace/TOXENV/py27-server/cubicweb/devtools/__init__.py", line 393, in get_repo
self._repo = self._new_repo(self.config)
File "/var/lib/jenkins/jobs/cubicweb-3.23/workspace/TOXENV/py27-server/cubicweb/devtools/__init__.py", line 407, in _new_repo
repo = config.repository()
File "/var/lib/jenkins/jobs/cubicweb-3.23/workspace/TOXENV/py27-server/cubicweb/cwconfig.py", line 1030, in repository
return Repository(self, TasksManager(), vreg=vreg)
File "/var/lib/jenkins/jobs/cubicweb-3.23/workspace/TOXENV/py27-server/cubicweb/server/repository.py", line 186, in __init__
self.init_cnxset_pool()
File "/var/lib/jenkins/jobs/cubicweb-3.23/workspace/TOXENV/py27-server/cubicweb/server/repository.py", line 228, in init_cnxset_pool
self.set_schema(config.load_schema(expand_cubes=True))
File "/var/lib/jenkins/jobs/cubicweb-3.23/workspace/TOXENV/py27-server/cubicweb/server/repository.py", line 315, in set_schema
self.vreg.set_schema(schema)
File "/var/lib/jenkins/jobs/cubicweb-3.23/workspace/TOXENV/py27-server/cubicweb/cwvreg.py", line 424, in set_schema
self.reload(self.config.appobjects_path(), force_reload=False)
File "/var/lib/jenkins/jobs/cubicweb-3.23/workspace/TOXENV/py27-server/cubicweb/cwvreg.py", line 474, in reload
self.register_objects(path)
File "/var/lib/jenkins/jobs/cubicweb-3.23/workspace/TOXENV/py27-server/cubicweb/cwvreg.py", line 519, in register_objects
path, self.config.extrapath)
File "/var/lib/jenkins/jobs/cubicweb-3.23/workspace/TOXENV/py27-server/.tox/py27-server/local/lib/python2.7/site-packages/logilab/common/registry.py", line 681, in register_objects
self.load_file(filepath, modname)
File "/var/lib/jenkins/jobs/cubicweb-3.23/workspace/TOXENV/py27-server/cubicweb/cwvreg.py", line 484, in load_file
return super(CWRegistryStore, self).load_file(filepath, modname)
File "/var/lib/jenkins/jobs/cubicweb-3.23/workspace/TOXENV/py27-server/.tox/py27-server/local/lib/python2.7/site-packages/logilab/common/registry.py", line 738, in load_file
module = load_module_from_name(modname)
File "/var/lib/jenkins/jobs/cubicweb-3.23/workspace/TOXENV/py27-server/.tox/py27-server/local/lib/python2.7/site-packages/logilab/common/modutils.py", line 125, in load_module_from_name
return load_module_from_modpath(dotted_name.split('.'), path, use_sys)
File "/var/lib/jenkins/jobs/cubicweb-3.23/workspace/TOXENV/py27-server/.tox/py27-server/local/lib/python2.7/site-packages/logilab/common/modutils.py", line 169, in load_module_from_modpath
module = load_module(curname, mp_file, mp_filename, mp_desc)
File "/var/lib/jenkins/jobs/cubicweb-3.23/workspace/TOXENV/py27-server/cubicweb/web/views/workflow.py", line 82, in <module>
class ChangeStateForm(forms.CompositeEntityForm):
File "/var/lib/jenkins/jobs/cubicweb-3.23/workspace/TOXENV/py27-server/cubicweb/web/views/workflow.py", line 90, in ChangeStateForm
{'class': fw.Button.css_class + ' cwjs-edition-cancel'})]
NameError: name 'fw' is not defined

no stdout
no stderr
======================================================================
SKIPPED: test_set_relations_eid (unittest_querier.NonRegressionTC)
repository is not initialised: NameError("name 'fw' is not defined",)
======================================================================
SKIPPED: test_insert_having (unittest_querier.QuerierTC)
unsupported yet
======================================================================
SKIPPED: test_nonregr_solution_cache (unittest_querier.QuerierTC)
XXX should be fixed or documented
========================= unittest_hook.py =========================
....ESSES
======================================================================
ERROR: test_global_operation_order (unittest_hook.OperationsTC)
----------------------------------------------------------------------
Traceback (most recent call last)
File "/var/lib/jenkins/jobs/cubicweb-3.23/workspace/TOXENV/py27-server/.tox/py27-server/local/lib/python2.7/site-packages/unittest2/case.py", line 67, in testPartExecutor
yield
File "/var/lib/jenkins/jobs/cubicweb-3.23/workspace/TOXENV/py27-server/.tox/py27-server/local/lib/python2.7/site-packages/unittest2/case.py", line 621, in run
self.setUp()
File "/var/lib/jenkins/jobs/cubicweb-3.23/workspace/TOXENV/py27-server/cubicweb/server/test/unittest_hook.py", line 31, in setUp
CubicWebTC.setUp(self)
File "/var/lib/jenkins/jobs/cubicweb-3.23/workspace/TOXENV/py27-server/cubicweb/devtools/testlib.py", line 448, in setUp
self._init_repo()
File "/var/lib/jenkins/jobs/cubicweb-3.23/workspace/TOXENV/py27-server/cubicweb/devtools/testlib.py", line 357, in _init_repo
db_handler.restore_database(self.test_db_id)
File "/var/lib/jenkins/jobs/cubicweb-3.23/workspace/TOXENV/py27-server/cubicweb/devtools/__init__.py", line 378, in restore_database
self._restore_database(backup_coordinates, config)
File "/var/lib/jenkins/jobs/cubicweb-3.23/workspace/TOXENV/py27-server/cubicweb/devtools/__init__.py", line 815, in _restore_database
self.get_repo()
File "/var/lib/jenkins/jobs/cubicweb-3.23/workspace/TOXENV/py27-server/cubicweb/devtools/__init__.py", line 393, in get_repo
self._repo = self._new_repo(self.config)
File "/var/lib/jenkins/jobs/cubicweb-3.23/workspace/TOXENV/py27-server/cubicweb/devtools/__init__.py", line 407, in _new_repo
repo = config.repository()
File "/var/lib/jenkins/jobs/cubicweb-3.23/workspace/TOXENV/py27-server/cubicweb/cwconfig.py", line 1030, in repository
return Repository(self, TasksManager(), vreg=vreg)
File "/var/lib/jenkins/jobs/cubicweb-3.23/workspace/TOXENV/py27-server/cubicweb/server/repository.py", line 186, in __init__
self.init_cnxset_pool()
File "/var/lib/jenkins/jobs/cubicweb-3.23/workspace/TOXENV/py27-server/cubicweb/server/repository.py", line 228, in init_cnxset_pool
self.set_schema(config.load_schema(expand_cubes=True))
File "/var/lib/jenkins/jobs/cubicweb-3.23/workspace/TOXENV/py27-server/cubicweb/server/repository.py", line 315, in set_schema
self.vreg.set_schema(schema)
File "/var/lib/jenkins/jobs/cubicweb-3.23/workspace/TOXENV/py27-server/cubicweb/cwvreg.py", line 424, in set_schema
self.reload(self.config.appobjects_path(), force_reload=False)
File "/var/lib/jenkins/jobs/cubicweb-3.23/workspace/TOXENV/py27-server/cubicweb/cwvreg.py", line 474, in reload
self.register_objects(path)
File "/var/lib/jenkins/jobs/cubicweb-3.23/workspace/TOXENV/py27-server/cubicweb/cwvreg.py", line 519, in register_objects
path, self.config.extrapath)
File "/var/lib/jenkins/jobs/cubicweb-3.23/workspace/TOXENV/py27-server/.tox/py27-server/local/lib/python2.7/site-packages/logilab/common/registry.py", line 681, in register_objects
self.load_file(filepath, modname)
File "/var/lib/jenkins/jobs/cubicweb-3.23/workspace/TOXENV/py27-server/cubicweb/cwvreg.py", line 484, in load_file
return super(CWRegistryStore, self).load_file(filepath, modname)
File "/var/lib/jenkins/jobs/cubicweb-3.23/workspace/TOXENV/py27-server/.tox/py27-server/local/lib/python2.7/site-packages/logilab/common/registry.py", line 738, in load_file
module = load_module_from_name(modname)
File "/var/lib/jenkins/jobs/cubicweb-3.23/workspace/TOXENV/py27-server/.tox/py27-server/local/lib/python2.7/site-packages/logilab/common/modutils.py", line 125, in load_module_from_name
return load_module_from_modpath(dotted_name.split('.'), path, use_sys)
File "/var/lib/jenkins/jobs/cubicweb-3.23/workspace/TOXENV/py27-server/.tox/py27-server/local/lib/python2.7/site-packages/logilab/common/modutils.py", line 169, in load_module_from_modpath
module = load_module(curname, mp_file, mp_filename, mp_desc)
File "/var/lib/jenkins/jobs/cubicweb-3.23/workspace/TOXENV/py27-server/cubicweb/web/views/workflow.py", line 82, in <module>
class ChangeStateForm(forms.CompositeEntityForm):
File "/var/lib/jenkins/jobs/cubicweb-3.23/workspace/TOXENV/py27-server/cubicweb/web/views/workflow.py", line 90, in ChangeStateForm
{'class': fw.Button.css_class + ' cwjs-edition-cancel'})]
NameError: name 'fw' is not defined

no stdout
no stderr
======================================================================
ERROR: test_session_open_close (unittest_hook.SystemHooksTC)
----------------------------------------------------------------------
Traceback (most recent call last)
File "/var/lib/jenkins/jobs/cubicweb-3.23/workspace/TOXENV/py27-server/.tox/py27-server/local/lib/python2.7/site-packages/unittest2/case.py", line 67, in testPartExecutor
yield
File "/var/lib/jenkins/jobs/cubicweb-3.23/workspace/TOXENV/py27-server/.tox/py27-server/local/lib/python2.7/site-packages/unittest2/case.py", line 621, in run
self.setUp()
File "/var/lib/jenkins/jobs/cubicweb-3.23/workspace/TOXENV/py27-server/cubicweb/devtools/testlib.py", line 448, in setUp
self._init_repo()
File "/var/lib/jenkins/jobs/cubicweb-3.23/workspace/TOXENV/py27-server/cubicweb/devtools/testlib.py", line 357, in _init_repo
db_handler.restore_database(self.test_db_id)
File "/var/lib/jenkins/jobs/cubicweb-3.23/workspace/TOXENV/py27-server/cubicweb/devtools/__init__.py", line 378, in restore_database
self._restore_database(backup_coordinates, config)
File "/var/lib/jenkins/jobs/cubicweb-3.23/workspace/TOXENV/py27-server/cubicweb/devtools/__init__.py", line 815, in _restore_database
self.get_repo()
File "/var/lib/jenkins/jobs/cubicweb-3.23/workspace/TOXENV/py27-server/cubicweb/devtools/__init__.py", line 393, in get_repo
self._repo = self._new_repo(self.config)
File "/var/lib/jenkins/jobs/cubicweb-3.23/workspace/TOXENV/py27-server/cubicweb/devtools/__init__.py", line 407, in _new_repo
repo = config.repository()
File "/var/lib/jenkins/jobs/cubicweb-3.23/workspace/TOXENV/py27-server/cubicweb/cwconfig.py", line 1030, in repository
return Repository(self, TasksManager(), vreg=vreg)
File "/var/lib/jenkins/jobs/cubicweb-3.23/workspace/TOXENV/py27-server/cubicweb/server/repository.py", line 186, in __init__
self.init_cnxset_pool()
File "/var/lib/jenkins/jobs/cubicweb-3.23/workspace/TOXENV/py27-server/cubicweb/server/repository.py", line 228, in init_cnxset_pool
self.set_schema(config.load_schema(expand_cubes=True))
File "/var/lib/jenkins/jobs/cubicweb-3.23/workspace/TOXENV/py27-server/cubicweb/server/repository.py", line 315, in set_schema
self.vreg.set_schema(schema)
File "/var/lib/jenkins/jobs/cubicweb-3.23/workspace/TOXENV/py27-server/cubicweb/cwvreg.py", line 424, in set_schema
self.reload(self.config.appobjects_path(), force_reload=False)
File "/var/lib/jenkins/jobs/cubicweb-3.23/workspace/TOXENV/py27-server/cubicweb/cwvreg.py", line 474, in reload
self.register_objects(path)
File "/var/lib/jenkins/jobs/cubicweb-3.23/workspace/TOXENV/py27-server/cubicweb/cwvreg.py", line 519, in register_objects
path, self.config.extrapath)
File "/var/lib/jenkins/jobs/cubicweb-3.23/workspace/TOXENV/py27-server/.tox/py27-server/local/lib/python2.7/site-packages/logilab/common/registry.py", line 681, in register_objects
self.load_file(filepath, modname)
File "/var/lib/jenkins/jobs/cubicweb-3.23/workspace/TOXENV/py27-server/cubicweb/cwvreg.py", line 484, in load_file
return super(CWRegistryStore, self).load_file(filepath, modname)
File "/var/lib/jenkins/jobs/cubicweb-3.23/workspace/TOXENV/py27-server/.tox/py27-server/local/lib/python2.7/site-packages/logilab/common/registry.py", line 738, in load_file
module = load_module_from_name(modname)
File "/var/lib/jenkins/jobs/cubicweb-3.23/workspace/TOXENV/py27-server/.tox/py27-server/local/lib/python2.7/site-packages/logilab/common/modutils.py", line 125, in load_module_from_name
return load_module_from_modpath(dotted_name.split('.'), path, use_sys)
File "/var/lib/jenkins/jobs/cubicweb-3.23/workspace/TOXENV/py27-server/.tox/py27-server/local/lib/python2.7/site-packages/logilab/common/modutils.py", line 169, in load_module_from_modpath
module = load_module(curname, mp_file, mp_filename, mp_desc)
File "/var/lib/jenkins/jobs/cubicweb-3.23/workspace/TOXENV/py27-server/cubicweb/web/views/workflow.py", line 82, in <module>
class ChangeStateForm(forms.CompositeEntityForm):
File "/var/lib/jenkins/jobs/cubicweb-3.23/workspace/TOXENV/py27-server/cubicweb/web/views/workflow.py", line 90, in ChangeStateForm
{'class': fw.Button.css_class + ' cwjs-edition-cancel'})]
NameError: name 'fw' is not defined

no stdout
no stderr
======================================================================
SKIPPED: test_late_operation (unittest_hook.OperationsTC)
repository is not initialised: NameError("name 'fw' is not defined",)
======================================================================
SKIPPED: test_single_last_operation (unittest_hook.OperationsTC)
repository is not initialised: NameError("name 'fw' is not defined",)
======================================================================
SKIPPED: test_startup_shutdown (unittest_hook.SystemHooksTC)
repository is not initialised: NameError("name 'fw' is not defined",)
======================= unittest_postgres.py =======================
The files belonging to this database system will be owned by user "jenkins".
This user must also own the server process.

The database cluster will be initialized with locale "C".
The default text search configuration will be set to "english".

Data page checksums are disabled.

creating directory data/database/pgdb-unittest_postgres ... ok
creating subdirectories ... ok
selecting default max_connections ... 100
selecting default shared_buffers ... 128MB
selecting dynamic shared memory implementation ... posix
creating configuration files ... ok
creating template1 database in data/database/pgdb-unittest_postgres/base/1 ... ok
initializing pg_authid ... ok
initializing dependencies ... ok
creating system views ... ok
loading system objects' descriptions ... ok
creating collations ... ok
creating conversions ... ok
creating dictionaries ... ok
setting privileges on built-in objects ... ok
creating information schema ... ok
loading PL/pgSQL server-side language ... ok
vacuuming database template1 ... ok
copying template1 to template0 ... ok
copying template1 to postgres ... ok
syncing data to disk ... ok

WARNING: enabling "trust" authentication for local connections
You can change this by editing pg_hba.conf or using the option -A, or
--auth-local and --auth-host, the next time you run initdb.

Success. You can now start the database server using:

postgres -D data/database/pgdb-unittest_postgres
or
pg_ctl -D data/database/pgdb-unittest_postgres -l logfile start

waiting for server to start....LOG: database system was shut down at 2016-03-15 17:14:12 CET
LOG: MultiXact member wraparound protections are now enabled
LOG: database system is ready to accept connections
LOG: autovacuum launcher started
done
server started
2016-03-15 17:14:14 - (logilab.database) WARNING: plpgsql language already installed
2016-03-15 17:14:15 - (cubicweb.appobject) WARNING: can't find any workflow for CWUser
ESSSSSSERROR: database "tmpdb891" is being accessed by other users
DETAIL: There is 1 other session using the database.
STATEMENT: DROP DATABASE tmpdb891
Ewaiting for server to shut down....LOG: received fast shutdown request
LOG: aborting any active transactions
LOG: autovacuum launcher shutting down
FATAL: terminating connection due to administrator command
FATAL: terminating connection due to administrator command
FATAL: terminating connection due to administrator command
LOG: shutting down
LOG: database system is shut down
done
server stopped

======================================================================
ERROR: test_attr_weight (unittest_postgres.PostgresFTITC)
----------------------------------------------------------------------
Traceback (most recent call last)
File "/var/lib/jenkins/jobs/cubicweb-3.23/workspace/TOXENV/py27-server/.tox/py27-server/local/lib/python2.7/site-packages/unittest2/case.py", line 67, in testPartExecutor
yield
File "/var/lib/jenkins/jobs/cubicweb-3.23/workspace/TOXENV/py27-server/.tox/py27-server/local/lib/python2.7/site-packages/unittest2/case.py", line 621, in run
self.setUp()
File "/var/lib/jenkins/jobs/cubicweb-3.23/workspace/TOXENV/py27-server/cubicweb/devtools/testlib.py", line 448, in setUp
self._init_repo()
File "/var/lib/jenkins/jobs/cubicweb-3.23/workspace/TOXENV/py27-server/cubicweb/devtools/testlib.py", line 358, in _init_repo
self.repo = db_handler.get_repo(startup=True)
File "/var/lib/jenkins/jobs/cubicweb-3.23/workspace/TOXENV/py27-server/cubicweb/devtools/__init__.py", line 393, in get_repo
self._repo = self._new_repo(self.config)
File "/var/lib/jenkins/jobs/cubicweb-3.23/workspace/TOXENV/py27-server/cubicweb/devtools/__init__.py", line 407, in _new_repo
repo = config.repository()
File "/var/lib/jenkins/jobs/cubicweb-3.23/workspace/TOXENV/py27-server/cubicweb/cwconfig.py", line 1030, in repository
return Repository(self, TasksManager(), vreg=vreg)
File "/var/lib/jenkins/jobs/cubicweb-3.23/workspace/TOXENV/py27-server/cubicweb/server/repository.py", line 186, in __init__
self.init_cnxset_pool()
File "/var/lib/jenkins/jobs/cubicweb-3.23/workspace/TOXENV/py27-server/cubicweb/server/repository.py", line 228, in init_cnxset_pool
self.set_schema(config.load_schema(expand_cubes=True))
File "/var/lib/jenkins/jobs/cubicweb-3.23/workspace/TOXENV/py27-server/cubicweb/server/repository.py", line 315, in set_schema
self.vreg.set_schema(schema)
File "/var/lib/jenkins/jobs/cubicweb-3.23/workspace/TOXENV/py27-server/cubicweb/cwvreg.py", line 424, in set_schema
self.reload(self.config.appobjects_path(), force_reload=False)
File "/var/lib/jenkins/jobs/cubicweb-3.23/workspace/TOXENV/py27-server/cubicweb/cwvreg.py", line 474, in reload
self.register_objects(path)
File "/var/lib/jenkins/jobs/cubicweb-3.23/workspace/TOXENV/py27-server/cubicweb/cwvreg.py", line 519, in register_objects
path, self.config.extrapath)
File "/var/lib/jenkins/jobs/cubicweb-3.23/workspace/TOXENV/py27-server/.tox/py27-server/local/lib/python2.7/site-packages/logilab/common/registry.py", line 681, in register_objects
self.load_file(filepath, modname)
File "/var/lib/jenkins/jobs/cubicweb-3.23/workspace/TOXENV/py27-server/cubicweb/cwvreg.py", line 484, in load_file
return super(CWRegistryStore, self).load_file(filepath, modname)
File "/var/lib/jenkins/jobs/cubicweb-3.23/workspace/TOXENV/py27-server/.tox/py27-server/local/lib/python2.7/site-packages/logilab/common/registry.py", line 738, in load_file
module = load_module_from_name(modname)
File "/var/lib/jenkins/jobs/cubicweb-3.23/workspace/TOXENV/py27-server/.tox/py27-server/local/lib/python2.7/site-packages/logilab/common/modutils.py", line 125, in load_module_from_name
return load_module_from_modpath(dotted_name.split('.'), path, use_sys)
File "/var/lib/jenkins/jobs/cubicweb-3.23/workspace/TOXENV/py27-server/.tox/py27-server/local/lib/python2.7/site-packages/logilab/common/modutils.py", line 169, in load_module_from_modpath
module = load_module(curname, mp_file, mp_filename, mp_desc)
File "/var/lib/jenkins/jobs/cubicweb-3.23/workspace/TOXENV/py27-server/cubicweb/web/views/workflow.py", line 82, in <module>
class ChangeStateForm(forms.CompositeEntityForm):
File "/var/lib/jenkins/jobs/cubicweb-3.23/workspace/TOXENV/py27-server/cubicweb/web/views/workflow.py", line 90, in ChangeStateForm
{'class': fw.Button.css_class + ' cwjs-edition-cancel'})]
NameError: name 'fw' is not defined

no stdout
no stderr
======================================================================
ERROR: test (unittest_postgres.PostgresLimitSizeTC)
----------------------------------------------------------------------
Traceback (most recent call last)
File "/var/lib/jenkins/jobs/cubicweb-3.23/workspace/TOXENV/py27-server/.tox/py27-server/local/lib/python2.7/site-packages/unittest2/case.py", line 67, in testPartExecutor
yield
File "/var/lib/jenkins/jobs/cubicweb-3.23/workspace/TOXENV/py27-server/.tox/py27-server/local/lib/python2.7/site-packages/unittest2/case.py", line 621, in run
self.setUp()
File "/var/lib/jenkins/jobs/cubicweb-3.23/workspace/TOXENV/py27-server/cubicweb/devtools/testlib.py", line 448, in setUp
self._init_repo()
File "/var/lib/jenkins/jobs/cubicweb-3.23/workspace/TOXENV/py27-server/cubicweb/devtools/testlib.py", line 357, in _init_repo
db_handler.restore_database(self.test_db_id)
File "/var/lib/jenkins/jobs/cubicweb-3.23/workspace/TOXENV/py27-server/cubicweb/devtools/__init__.py", line 378, in restore_database
self._restore_database(backup_coordinates, config)
File "/var/lib/jenkins/jobs/cubicweb-3.23/workspace/TOXENV/py27-server/cubicweb/devtools/__init__.py", line 731, in _restore_database
self._drop(self.system_source['db-name'])
File "/var/lib/jenkins/jobs/cubicweb-3.23/workspace/TOXENV/py27-server/cubicweb/devtools/__init__.py", line 700, in _drop
self.cursor.execute('DROP DATABASE %s' % db_name)
OperationalError: database "tmpdb891" is being accessed by other users
DETAIL: There is 1 other session using the database.

no stdout
no stderr
======================================================================
SKIPPED: test_constraint_validationerror (unittest_postgres.PostgresFTITC)
repository is not initialised: NameError("name 'fw' is not defined",)
======================================================================
SKIPPED: test_eid_range (unittest_postgres.PostgresFTITC)
repository is not initialised: NameError("name 'fw' is not defined",)
======================================================================
SKIPPED: test_entity_weight (unittest_postgres.PostgresFTITC)
repository is not initialised: NameError("name 'fw' is not defined",)
======================================================================
SKIPPED: test_occurence_count (unittest_postgres.PostgresFTITC)
repository is not initialised: NameError("name 'fw' is not defined",)
======================================================================
SKIPPED: test_statement_timeout (unittest_postgres.PostgresFTITC)
repository is not initialised: NameError("name 'fw' is not defined",)
======================================================================
SKIPPED: test_tz_datetime (unittest_postgres.PostgresFTITC)
repository is not initialised: NameError("name 'fw' is not defined",)
======================= unittest_datafeed.py =======================
EESS
======================================================================
ERROR: test_use_cwuri_as_url_override (unittest_datafeed.DataFeedConfigTC)
----------------------------------------------------------------------
Traceback (most recent call last)
File "/var/lib/jenkins/jobs/cubicweb-3.23/workspace/TOXENV/py27-server/.tox/py27-server/local/lib/python2.7/site-packages/unittest2/case.py", line 67, in testPartExecutor
yield
File "/var/lib/jenkins/jobs/cubicweb-3.23/workspace/TOXENV/py27-server/.tox/py27-server/local/lib/python2.7/site-packages/unittest2/case.py", line 621, in run
self.setUp()
File "/var/lib/jenkins/jobs/cubicweb-3.23/workspace/TOXENV/py27-server/cubicweb/devtools/testlib.py", line 448, in setUp
self._init_repo()
File "/var/lib/jenkins/jobs/cubicweb-3.23/workspace/TOXENV/py27-server/cubicweb/devtools/testlib.py", line 357, in _init_repo
db_handler.restore_database(self.test_db_id)
File "/var/lib/jenkins/jobs/cubicweb-3.23/workspace/TOXENV/py27-server/cubicweb/devtools/__init__.py", line 378, in restore_database
self._restore_database(backup_coordinates, config)
File "/var/lib/jenkins/jobs/cubicweb-3.23/workspace/TOXENV/py27-server/cubicweb/devtools/__init__.py", line 815, in _restore_database
self.get_repo()
File "/var/lib/jenkins/jobs/cubicweb-3.23/workspace/TOXENV/py27-server/cubicweb/devtools/__init__.py", line 393, in get_repo
self._repo = self._new_repo(self.config)
File "/var/lib/jenkins/jobs/cubicweb-3.23/workspace/TOXENV/py27-server/cubicweb/devtools/__init__.py", line 407, in _new_repo
repo = config.repository()
File "/var/lib/jenkins/jobs/cubicweb-3.23/workspace/TOXENV/py27-server/cubicweb/cwconfig.py", line 1030, in repository
return Repository(self, TasksManager(), vreg=vreg)
File "/var/lib/jenkins/jobs/cubicweb-3.23/workspace/TOXENV/py27-server/cubicweb/server/repository.py", line 186, in __init__
self.init_cnxset_pool()
File "/var/lib/jenkins/jobs/cubicweb-3.23/workspace/TOXENV/py27-server/cubicweb/server/repository.py", line 228, in init_cnxset_pool
self.set_schema(config.load_schema(expand_cubes=True))
File "/var/lib/jenkins/jobs/cubicweb-3.23/workspace/TOXENV/py27-server/cubicweb/server/repository.py", line 315, in set_schema
self.vreg.set_schema(schema)
File "/var/lib/jenkins/jobs/cubicweb-3.23/workspace/TOXENV/py27-server/cubicweb/cwvreg.py", line 424, in set_schema
self.reload(self.config.appobjects_path(), force_reload=False)
File "/var/lib/jenkins/jobs/cubicweb-3.23/workspace/TOXENV/py27-server/cubicweb/cwvreg.py", line 474, in reload
self.register_objects(path)
File "/var/lib/jenkins/jobs/cubicweb-3.23/workspace/TOXENV/py27-server/cubicweb/cwvreg.py", line 519, in register_objects
path, self.config.extrapath)
File "/var/lib/jenkins/jobs/cubicweb-3.23/workspace/TOXENV/py27-server/.tox/py27-server/local/lib/python2.7/site-packages/logilab/common/registry.py", line 681, in register_objects
self.load_file(filepath, modname)
File "/var/lib/jenkins/jobs/cubicweb-3.23/workspace/TOXENV/py27-server/cubicweb/cwvreg.py", line 484, in load_file
return super(CWRegistryStore, self).load_file(filepath, modname)
File "/var/lib/jenkins/jobs/cubicweb-3.23/workspace/TOXENV/py27-server/.tox/py27-server/local/lib/python2.7/site-packages/logilab/common/registry.py", line 738, in load_file
module = load_module_from_name(modname)
File "/var/lib/jenkins/jobs/cubicweb-3.23/workspace/TOXENV/py27-server/.tox/py27-server/local/lib/python2.7/site-packages/logilab/common/modutils.py", line 125, in load_module_from_name
return load_module_from_modpath(dotted_name.split('.'), path, use_sys)
File "/var/lib/jenkins/jobs/cubicweb-3.23/workspace/TOXENV/py27-server/.tox/py27-server/local/lib/python2.7/site-packages/logilab/common/modutils.py", line 169, in load_module_from_modpath
module = load_module(curname, mp_file, mp_filename, mp_desc)
File "/var/lib/jenkins/jobs/cubicweb-3.23/workspace/TOXENV/py27-server/cubicweb/web/views/workflow.py", line 82, in <module>
class ChangeStateForm(forms.CompositeEntityForm):
File "/var/lib/jenkins/jobs/cubicweb-3.23/workspace/TOXENV/py27-server/cubicweb/web/views/workflow.py", line 90, in ChangeStateForm
{'class': fw.Button.css_class + ' cwjs-edition-cancel'})]
NameError: name 'fw' is not defined

no stdout
no stderr
======================================================================
ERROR: test (unittest_datafeed.DataFeedTC)
----------------------------------------------------------------------
Traceback (most recent call last)
File "/var/lib/jenkins/jobs/cubicweb-3.23/workspace/TOXENV/py27-server/.tox/py27-server/local/lib/python2.7/site-packages/unittest2/case.py", line 67, in testPartExecutor
yield
File "/var/lib/jenkins/jobs/cubicweb-3.23/workspace/TOXENV/py27-server/.tox/py27-server/local/lib/python2.7/site-packages/unittest2/case.py", line 621, in run
self.setUp()
File "/var/lib/jenkins/jobs/cubicweb-3.23/workspace/TOXENV/py27-server/cubicweb/devtools/testlib.py", line 448, in setUp
self._init_repo()
File "/var/lib/jenkins/jobs/cubicweb-3.23/workspace/TOXENV/py27-server/cubicweb/devtools/testlib.py", line 357, in _init_repo
db_handler.restore_database(self.test_db_id)
File "/var/lib/jenkins/jobs/cubicweb-3.23/workspace/TOXENV/py27-server/cubicweb/devtools/__init__.py", line 378, in restore_database
self._restore_database(backup_coordinates, config)
File "/var/lib/jenkins/jobs/cubicweb-3.23/workspace/TOXENV/py27-server/cubicweb/devtools/__init__.py", line 815, in _restore_database
self.get_repo()
File "/var/lib/jenkins/jobs/cubicweb-3.23/workspace/TOXENV/py27-server/cubicweb/devtools/__init__.py", line 393, in get_repo
self._repo = self._new_repo(self.config)
File "/var/lib/jenkins/jobs/cubicweb-3.23/workspace/TOXENV/py27-server/cubicweb/devtools/__init__.py", line 407, in _new_repo
repo = config.repository()
File "/var/lib/jenkins/jobs/cubicweb-3.23/workspace/TOXENV/py27-server/cubicweb/cwconfig.py", line 1030, in repository
return Repository(self, TasksManager(), vreg=vreg)
File "/var/lib/jenkins/jobs/cubicweb-3.23/workspace/TOXENV/py27-server/cubicweb/server/repository.py", line 186, in __init__
self.init_cnxset_pool()
File "/var/lib/jenkins/jobs/cubicweb-3.23/workspace/TOXENV/py27-server/cubicweb/server/repository.py", line 228, in init_cnxset_pool
self.set_schema(config.load_schema(expand_cubes=True))
File "/var/lib/jenkins/jobs/cubicweb-3.23/workspace/TOXENV/py27-server/cubicweb/server/repository.py", line 315, in set_schema
self.vreg.set_schema(schema)
File "/var/lib/jenkins/jobs/cubicweb-3.23/workspace/TOXENV/py27-server/cubicweb/cwvreg.py", line 424, in set_schema
self.reload(self.config.appobjects_path(), force_reload=False)
File "/var/lib/jenkins/jobs/cubicweb-3.23/workspace/TOXENV/py27-server/cubicweb/cwvreg.py", line 474, in reload
self.register_objects(path)
File "/var/lib/jenkins/jobs/cubicweb-3.23/workspace/TOXENV/py27-server/cubicweb/cwvreg.py", line 519, in register_objects
path, self.config.extrapath)
File "/var/lib/jenkins/jobs/cubicweb-3.23/workspace/TOXENV/py27-server/.tox/py27-server/local/lib/python2.7/site-packages/logilab/common/registry.py", line 681, in register_objects
self.load_file(filepath, modname)
File "/var/lib/jenkins/jobs/cubicweb-3.23/workspace/TOXENV/py27-server/cubicweb/cwvreg.py", line 484, in load_file
return super(CWRegistryStore, self).load_file(filepath, modname)
File "/var/lib/jenkins/jobs/cubicweb-3.23/workspace/TOXENV/py27-server/.tox/py27-server/local/lib/python2.7/site-packages/logilab/common/registry.py", line 738, in load_file
module = load_module_from_name(modname)
File "/var/lib/jenkins/jobs/cubicweb-3.23/workspace/TOXENV/py27-server/.tox/py27-server/local/lib/python2.7/site-packages/logilab/common/modutils.py", line 125, in load_module_from_name
return load_module_from_modpath(dotted_name.split('.'), path, use_sys)
File "/var/lib/jenkins/jobs/cubicweb-3.23/workspace/TOXENV/py27-server/.tox/py27-server/local/lib/python2.7/site-packages/logilab/common/modutils.py", line 169, in load_module_from_modpath
module = load_module(curname, mp_file, mp_filename, mp_desc)
File "/var/lib/jenkins/jobs/cubicweb-3.23/workspace/TOXENV/py27-server/cubicweb/web/views/workflow.py", line 82, in <module>
class ChangeStateForm(forms.CompositeEntityForm):
File "/var/lib/jenkins/jobs/cubicweb-3.23/workspace/TOXENV/py27-server/cubicweb/web/views/workflow.py", line 90, in ChangeStateForm
{'class': fw.Button.css_class + ' cwjs-edition-cancel'})]
NameError: name 'fw' is not defined

no stdout
no stderr
======================================================================
SKIPPED: test_parser_retrieve_url_local (unittest_datafeed.DataFeedTC)
repository is not initialised: NameError("name 'fw' is not defined",)
======================================================================
SKIPPED: test_update_url (unittest_datafeed.DataFeedTC)
repository is not initialised: NameError("name 'fw' is not defined",)
======================= unittest_security.py =======================
ESSSSSSSSESSSEESSSSSSSSSSSSSSSSSSSSSSSS
======================================================================
ERROR: test_ambigous_ordered (unittest_security.BaseSchemaSecurityTC)
----------------------------------------------------------------------
Traceback (most recent call last)
File "/var/lib/jenkins/jobs/cubicweb-3.23/workspace/TOXENV/py27-server/.tox/py27-server/local/lib/python2.7/site-packages/unittest2/case.py", line 67, in testPartExecutor
yield
File "/var/lib/jenkins/jobs/cubicweb-3.23/workspace/TOXENV/py27-server/.tox/py27-server/local/lib/python2.7/site-packages/unittest2/case.py", line 621, in run
self.setUp()
File "/var/lib/jenkins/jobs/cubicweb-3.23/workspace/TOXENV/py27-server/cubicweb/devtools/testlib.py", line 448, in setUp
self._init_repo()
File "/var/lib/jenkins/jobs/cubicweb-3.23/workspace/TOXENV/py27-server/cubicweb/devtools/testlib.py", line 357, in _init_repo
db_handler.restore_database(self.test_db_id)
File "/var/lib/jenkins/jobs/cubicweb-3.23/workspace/TOXENV/py27-server/cubicweb/devtools/__init__.py", line 378, in restore_database
self._restore_database(backup_coordinates, config)
File "/var/lib/jenkins/jobs/cubicweb-3.23/workspace/TOXENV/py27-server/cubicweb/devtools/__init__.py", line 815, in _restore_database
self.get_repo()
File "/var/lib/jenkins/jobs/cubicweb-3.23/workspace/TOXENV/py27-server/cubicweb/devtools/__init__.py", line 393, in get_repo
self._repo = self._new_repo(self.config)
File "/var/lib/jenkins/jobs/cubicweb-3.23/workspace/TOXENV/py27-server/cubicweb/devtools/__init__.py", line 407, in _new_repo
repo = config.repository()
File "/var/lib/jenkins/jobs/cubicweb-3.23/workspace/TOXENV/py27-server/cubicweb/cwconfig.py", line 1030, in repository
return Repository(self, TasksManager(), vreg=vreg)
File "/var/lib/jenkins/jobs/cubicweb-3.23/workspace/TOXENV/py27-server/cubicweb/server/repository.py", line 186, in __init__
self.init_cnxset_pool()
File "/var/lib/jenkins/jobs/cubicweb-3.23/workspace/TOXENV/py27-server/cubicweb/server/repository.py", line 228, in init_cnxset_pool
self.set_schema(config.load_schema(expand_cubes=True))
File "/var/lib/jenkins/jobs/cubicweb-3.23/workspace/TOXENV/py27-server/cubicweb/server/repository.py", line 315, in set_schema
self.vreg.set_schema(schema)
File "/var/lib/jenkins/jobs/cubicweb-3.23/workspace/TOXENV/py27-server/cubicweb/cwvreg.py", line 424, in set_schema
self.reload(self.config.appobjects_path(), force_reload=False)
File "/var/lib/jenkins/jobs/cubicweb-3.23/workspace/TOXENV/py27-server/cubicweb/cwvreg.py", line 474, in reload
self.register_objects(path)
File "/var/lib/jenkins/jobs/cubicweb-3.23/workspace/TOXENV/py27-server/cubicweb/cwvreg.py", line 519, in register_objects
path, self.config.extrapath)
File "/var/lib/jenkins/jobs/cubicweb-3.23/workspace/TOXENV/py27-server/.tox/py27-server/local/lib/python2.7/site-packages/logilab/common/registry.py", line 681, in register_objects
self.load_file(filepath, modname)
File "/var/lib/jenkins/jobs/cubicweb-3.23/workspace/TOXENV/py27-server/cubicweb/cwvreg.py", line 484, in load_file
return super(CWRegistryStore, self).load_file(filepath, modname)
File "/var/lib/jenkins/jobs/cubicweb-3.23/workspace/TOXENV/py27-server/.tox/py27-server/local/lib/python2.7/site-packages/logilab/common/registry.py", line 738, in load_file
module = load_module_from_name(modname)
File "/var/lib/jenkins/jobs/cubicweb-3.23/workspace/TOXENV/py27-server/.tox/py27-server/local/lib/python2.7/site-packages/logilab/common/modutils.py", line 125, in load_module_from_name
return load_module_from_modpath(dotted_name.split('.'), path, use_sys)
File "/var/lib/jenkins/jobs/cubicweb-3.23/workspace/TOXENV/py27-server/.tox/py27-server/local/lib/python2.7/site-packages/logilab/common/modutils.py", line 169, in load_module_from_modpath
module = load_module(curname, mp_file, mp_filename, mp_desc)
File "/var/lib/jenkins/jobs/cubicweb-3.23/workspace/TOXENV/py27-server/cubicweb/web/views/workflow.py", line 82, in <module>
class ChangeStateForm(forms.CompositeEntityForm):
File "/var/lib/jenkins/jobs/cubicweb-3.23/workspace/TOXENV/py27-server/cubicweb/web/views/workflow.py", line 90, in ChangeStateForm
{'class': fw.Button.css_class + ' cwjs-edition-cancel'})]
NameError: name 'fw' is not defined

no stdout
no stderr
======================================================================
ERROR: test_check_relation_read_access (unittest_security.LowLevelSecurityFunctionTC)
----------------------------------------------------------------------
Traceback (most recent call last)
File "/var/lib/jenkins/jobs/cubicweb-3.23/workspace/TOXENV/py27-server/.tox/py27-server/local/lib/python2.7/site-packages/unittest2/case.py", line 67, in testPartExecutor
yield
File "/var/lib/jenkins/jobs/cubicweb-3.23/workspace/TOXENV/py27-server/.tox/py27-server/local/lib/python2.7/site-packages/unittest2/case.py", line 621, in run
self.setUp()
File "/var/lib/jenkins/jobs/cubicweb-3.23/workspace/TOXENV/py27-server/cubicweb/devtools/testlib.py", line 448, in setUp
self._init_repo()
File "/var/lib/jenkins/jobs/cubicweb-3.23/workspace/TOXENV/py27-server/cubicweb/devtools/testlib.py", line 357, in _init_repo
db_handler.restore_database(self.test_db_id)
File "/var/lib/jenkins/jobs/cubicweb-3.23/workspace/TOXENV/py27-server/cubicweb/devtools/__init__.py", line 378, in restore_database
self._restore_database(backup_coordinates, config)
File "/var/lib/jenkins/jobs/cubicweb-3.23/workspace/TOXENV/py27-server/cubicweb/devtools/__init__.py", line 815, in _restore_database
self.get_repo()
File "/var/lib/jenkins/jobs/cubicweb-3.23/workspace/TOXENV/py27-server/cubicweb/devtools/__init__.py", line 393, in get_repo
self._repo = self._new_repo(self.config)
File "/var/lib/jenkins/jobs/cubicweb-3.23/workspace/TOXENV/py27-server/cubicweb/devtools/__init__.py", line 407, in _new_repo
repo = config.repository()
File "/var/lib/jenkins/jobs/cubicweb-3.23/workspace/TOXENV/py27-server/cubicweb/cwconfig.py", line 1030, in repository
return Repository(self, TasksManager(), vreg=vreg)
File "/var/lib/jenkins/jobs/cubicweb-3.23/workspace/TOXENV/py27-server/cubicweb/server/repository.py", line 186, in __init__
self.init_cnxset_pool()
File "/var/lib/jenkins/jobs/cubicweb-3.23/workspace/TOXENV/py27-server/cubicweb/server/repository.py", line 228, in init_cnxset_pool
self.set_schema(config.load_schema(expand_cubes=True))
File "/var/lib/jenkins/jobs/cubicweb-3.23/workspace/TOXENV/py27-server/cubicweb/server/repository.py", line 315, in set_schema
self.vreg.set_schema(schema)
File "/var/lib/jenkins/jobs/cubicweb-3.23/workspace/TOXENV/py27-server/cubicweb/cwvreg.py", line 424, in set_schema
self.reload(self.config.appobjects_path(), force_reload=False)
File "/var/lib/jenkins/jobs/cubicweb-3.23/workspace/TOXENV/py27-server/cubicweb/cwvreg.py", line 474, in reload
self.register_objects(path)
File "/var/lib/jenkins/jobs/cubicweb-3.23/workspace/TOXENV/py27-server/cubicweb/cwvreg.py", line 519, in register_objects
path, self.config.extrapath)
File "/var/lib/jenkins/jobs/cubicweb-3.23/workspace/TOXENV/py27-server/.tox/py27-server/local/lib/python2.7/site-packages/logilab/common/registry.py", line 681, in register_objects
self.load_file(filepath, modname)
File "/var/lib/jenkins/jobs/cubicweb-3.23/workspace/TOXENV/py27-server/cubicweb/cwvreg.py", line 484, in load_file
return super(CWRegistryStore, self).load_file(filepath, modname)
File "/var/lib/jenkins/jobs/cubicweb-3.23/workspace/TOXENV/py27-server/.tox/py27-server/local/lib/python2.7/site-packages/logilab/common/registry.py", line 738, in load_file
module = load_module_from_name(modname)
File "/var/lib/jenkins/jobs/cubicweb-3.23/workspace/TOXENV/py27-server/.tox/py27-server/local/lib/python2.7/site-packages/logilab/common/modutils.py", line 125, in load_module_from_name
return load_module_from_modpath(dotted_name.split('.'), path, use_sys)
File "/var/lib/jenkins/jobs/cubicweb-3.23/workspace/TOXENV/py27-server/.tox/py27-server/local/lib/python2.7/site-packages/logilab/common/modutils.py", line 169, in load_module_from_modpath
module = load_module(curname, mp_file, mp_filename, mp_desc)
File "/var/lib/jenkins/jobs/cubicweb-3.23/workspace/TOXENV/py27-server/cubicweb/web/views/workflow.py", line 82, in <module>
class ChangeStateForm(forms.CompositeEntityForm):
File "/var/lib/jenkins/jobs/cubicweb-3.23/workspace/TOXENV/py27-server/cubicweb/web/views/workflow.py", line 90, in ChangeStateForm
{'class': fw.Button.css_class + ' cwjs-edition-cancel'})]
NameError: name 'fw' is not defined

no stdout
no stderr
======================================================================
ERROR: test_not_relation_read_security (unittest_security.SecurityRewritingTC)
----------------------------------------------------------------------
Traceback (most recent call last)
File "/var/lib/jenkins/jobs/cubicweb-3.23/workspace/TOXENV/py27-server/.tox/py27-server/local/lib/python2.7/site-packages/unittest2/case.py", line 67, in testPartExecutor
yield
File "/var/lib/jenkins/jobs/cubicweb-3.23/workspace/TOXENV/py27-server/.tox/py27-server/local/lib/python2.7/site-packages/unittest2/case.py", line 621, in run
self.setUp()
File "/var/lib/jenkins/jobs/cubicweb-3.23/workspace/TOXENV/py27-server/cubicweb/devtools/testlib.py", line 448, in setUp
self._init_repo()
File "/var/lib/jenkins/jobs/cubicweb-3.23/workspace/TOXENV/py27-server/cubicweb/devtools/testlib.py", line 357, in _init_repo
db_handler.restore_database(self.test_db_id)
File "/var/lib/jenkins/jobs/cubicweb-3.23/workspace/TOXENV/py27-server/cubicweb/devtools/__init__.py", line 378, in restore_database
self._restore_database(backup_coordinates, config)
File "/var/lib/jenkins/jobs/cubicweb-3.23/workspace/TOXENV/py27-server/cubicweb/devtools/__init__.py", line 815, in _restore_database
self.get_repo()
File "/var/lib/jenkins/jobs/cubicweb-3.23/workspace/TOXENV/py27-server/cubicweb/devtools/__init__.py", line 393, in get_repo
self._repo = self._new_repo(self.config)
File "/var/lib/jenkins/jobs/cubicweb-3.23/workspace/TOXENV/py27-server/cubicweb/devtools/__init__.py", line 407, in _new_repo
repo = config.repository()
File "/var/lib/jenkins/jobs/cubicweb-3.23/workspace/TOXENV/py27-server/cubicweb/cwconfig.py", line 1030, in repository
return Repository(self, TasksManager(), vreg=vreg)
File "/var/lib/jenkins/jobs/cubicweb-3.23/workspace/TOXENV/py27-server/cubicweb/server/repository.py", line 186, in __init__
self.init_cnxset_pool()
File "/var/lib/jenkins/jobs/cubicweb-3.23/workspace/TOXENV/py27-server/cubicweb/server/repository.py", line 228, in init_cnxset_pool
self.set_schema(config.load_schema(expand_cubes=True))
File "/var/lib/jenkins/jobs/cubicweb-3.23/workspace/TOXENV/py27-server/cubicweb/server/repository.py", line 315, in set_schema
self.vreg.set_schema(schema)
File "/var/lib/jenkins/jobs/cubicweb-3.23/workspace/TOXENV/py27-server/cubicweb/cwvreg.py", line 424, in set_schema
self.reload(self.config.appobjects_path(), force_reload=False)
File "/var/lib/jenkins/jobs/cubicweb-3.23/workspace/TOXENV/py27-server/cubicweb/cwvreg.py", line 474, in reload
self.register_objects(path)
File "/var/lib/jenkins/jobs/cubicweb-3.23/workspace/TOXENV/py27-server/cubicweb/cwvreg.py", line 519, in register_objects
path, self.config.extrapath)
File "/var/lib/jenkins/jobs/cubicweb-3.23/workspace/TOXENV/py27-server/.tox/py27-server/local/lib/python2.7/site-packages/logilab/common/registry.py", line 681, in register_objects
self.load_file(filepath, modname)
File "/var/lib/jenkins/jobs/cubicweb-3.23/workspace/TOXENV/py27-server/cubicweb/cwvreg.py", line 484, in load_file
return super(CWRegistryStore, self).load_file(filepath, modname)
File "/var/lib/jenkins/jobs/cubicweb-3.23/workspace/TOXENV/py27-server/.tox/py27-server/local/lib/python2.7/site-packages/logilab/common/registry.py", line 738, in load_file
module = load_module_from_name(modname)
File "/var/lib/jenkins/jobs/cubicweb-3.23/workspace/TOXENV/py27-server/.tox/py27-server/local/lib/python2.7/site-packages/logilab/common/modutils.py", line 125, in load_module_from_name
return load_module_from_modpath(dotted_name.split('.'), path, use_sys)
File "/var/lib/jenkins/jobs/cubicweb-3.23/workspace/TOXENV/py27-server/.tox/py27-server/local/lib/python2.7/site-packages/logilab/common/modutils.py", line 169, in load_module_from_modpath
module = load_module(curname, mp_file, mp_filename, mp_desc)
File "/var/lib/jenkins/jobs/cubicweb-3.23/workspace/TOXENV/py27-server/cubicweb/web/views/workflow.py", line 82, in <module>
class ChangeStateForm(forms.CompositeEntityForm):
File "/var/lib/jenkins/jobs/cubicweb-3.23/workspace/TOXENV/py27-server/cubicweb/web/views/workflow.py", line 90, in ChangeStateForm
{'class': fw.Button.css_class + ' cwjs-edition-cancel'})]
NameError: name 'fw' is not defined

no stdout
no stderr
======================================================================
ERROR: test_attribute_read_security (unittest_security.SecurityTC)
----------------------------------------------------------------------
Traceback (most recent call last)
File "/var/lib/jenkins/jobs/cubicweb-3.23/workspace/TOXENV/py27-server/.tox/py27-server/local/lib/python2.7/site-packages/unittest2/case.py", line 67, in testPartExecutor
yield
File "/var/lib/jenkins/jobs/cubicweb-3.23/workspace/TOXENV/py27-server/.tox/py27-server/local/lib/python2.7/site-packages/unittest2/case.py", line 621, in run
self.setUp()
File "/var/lib/jenkins/jobs/cubicweb-3.23/workspace/TOXENV/py27-server/cubicweb/server/test/unittest_security.py", line 124, in setUp
super(SecurityTC, self).setUp()
File "/var/lib/jenkins/jobs/cubicweb-3.23/workspace/TOXENV/py27-server/cubicweb/devtools/testlib.py", line 448, in setUp
self._init_repo()
File "/var/lib/jenkins/jobs/cubicweb-3.23/workspace/TOXENV/py27-server/cubicweb/devtools/testlib.py", line 357, in _init_repo
db_handler.restore_database(self.test_db_id)
File "/var/lib/jenkins/jobs/cubicweb-3.23/workspace/TOXENV/py27-server/cubicweb/devtools/__init__.py", line 378, in restore_database
self._restore_database(backup_coordinates, config)
File "/var/lib/jenkins/jobs/cubicweb-3.23/workspace/TOXENV/py27-server/cubicweb/devtools/__init__.py", line 815, in _restore_database
self.get_repo()
File "/var/lib/jenkins/jobs/cubicweb-3.23/workspace/TOXENV/py27-server/cubicweb/devtools/__init__.py", line 393, in get_repo
self._repo = self._new_repo(self.config)
File "/var/lib/jenkins/jobs/cubicweb-3.23/workspace/TOXENV/py27-server/cubicweb/devtools/__init__.py", line 407, in _new_repo
repo = config.repository()
File "/var/lib/jenkins/jobs/cubicweb-3.23/workspace/TOXENV/py27-server/cubicweb/cwconfig.py", line 1030, in repository
return Repository(self, TasksManager(), vreg=vreg)
File "/var/lib/jenkins/jobs/cubicweb-3.23/workspace/TOXENV/py27-server/cubicweb/server/repository.py", line 186, in __init__
self.init_cnxset_pool()
File "/var/lib/jenkins/jobs/cubicweb-3.23/workspace/TOXENV/py27-server/cubicweb/server/repository.py", line 228, in init_cnxset_pool
self.set_schema(config.load_schema(expand_cubes=True))
File "/var/lib/jenkins/jobs/cubicweb-3.23/workspace/TOXENV/py27-server/cubicweb/server/repository.py", line 315, in set_schema
self.vreg.set_schema(schema)
File "/var/lib/jenkins/jobs/cubicweb-3.23/workspace/TOXENV/py27-server/cubicweb/cwvreg.py", line 424, in set_schema
self.reload(self.config.appobjects_path(), force_reload=False)
File "/var/lib/jenkins/jobs/cubicweb-3.23/workspace/TOXENV/py27-server/cubicweb/cwvreg.py", line 474, in reload
self.register_objects(path)
File "/var/lib/jenkins/jobs/cubicweb-3.23/workspace/TOXENV/py27-server/cubicweb/cwvreg.py", line 519, in register_objects
path, self.config.extrapath)
File "/var/lib/jenkins/jobs/cubicweb-3.23/workspace/TOXENV/py27-server/.tox/py27-server/local/lib/python2.7/site-packages/logilab/common/registry.py", line 681, in register_objects
self.load_file(filepath, modname)
File "/var/lib/jenkins/jobs/cubicweb-3.23/workspace/TOXENV/py27-server/cubicweb/cwvreg.py", line 484, in load_file
return super(CWRegistryStore, self).load_file(filepath, modname)
File "/var/lib/jenkins/jobs/cubicweb-3.23/workspace/TOXENV/py27-server/.tox/py27-server/local/lib/python2.7/site-packages/logilab/common/registry.py", line 738, in load_file
module = load_module_from_name(modname)
File "/var/lib/jenkins/jobs/cubicweb-3.23/workspace/TOXENV/py27-server/.tox/py27-server/local/lib/python2.7/site-packages/logilab/common/modutils.py", line 125, in load_module_from_name
return load_module_from_modpath(dotted_name.split('.'), path, use_sys)
File "/var/lib/jenkins/jobs/cubicweb-3.23/workspace/TOXENV/py27-server/.tox/py27-server/local/lib/python2.7/site-packages/logilab/common/modutils.py", line 169, in load_module_from_modpath
module = load_module(curname, mp_file, mp_filename, mp_desc)
File "/var/lib/jenkins/jobs/cubicweb-3.23/workspace/TOXENV/py27-server/cubicweb/web/views/workflow.py", line 82, in <module>
class ChangeStateForm(forms.CompositeEntityForm):
File "/var/lib/jenkins/jobs/cubicweb-3.23/workspace/TOXENV/py27-server/cubicweb/web/views/workflow.py", line 90, in ChangeStateForm
{'class': fw.Button.css_class + ' cwjs-edition-cancel'})]
NameError: name 'fw' is not defined

no stdout
no stderr
======================================================================
SKIPPED: test_bookmarked_by_guests_security (unittest_security.BaseSchemaSecurityTC)
repository is not initialised: NameError("name 'fw' is not defined",)
======================================================================
SKIPPED: test_emailaddress_security (unittest_security.BaseSchemaSecurityTC)
repository is not initialised: NameError("name 'fw' is not defined",)
======================================================================
SKIPPED: test_in_group_relation (unittest_security.BaseSchemaSecurityTC)
repository is not initialised: NameError("name 'fw' is not defined",)
======================================================================
SKIPPED: test_in_state_without_update_perm (unittest_security.BaseSchemaSecurityTC)
check a user change in_state without having update permission on the
repository is not initialised: NameError("name 'fw' is not defined",)
======================================================================
SKIPPED: test_owned_by (unittest_security.BaseSchemaSecurityTC)
repository is not initialised: NameError("name 'fw' is not defined",)
======================================================================
SKIPPED: test_trinfo_security (unittest_security.BaseSchemaSecurityTC)
repository is not initialised: NameError("name 'fw' is not defined",)
======================================================================
SKIPPED: test_user_can_delete_object_he_created (unittest_security.BaseSchemaSecurityTC)
repository is not initialised: NameError("name 'fw' is not defined",)
======================================================================
SKIPPED: test_users_and_groups_non_readable_by_guests (unittest_security.BaseSchemaSecurityTC)
repository is not initialised: NameError("name 'fw' is not defined",)
======================================================================
SKIPPED: test_get_local_checks (unittest_security.LowLevelSecurityFunctionTC)
repository is not initialised: NameError("name 'fw' is not defined",)
======================================================================
SKIPPED: test_upassword_not_selectable (unittest_security.LowLevelSecurityFunctionTC)
repository is not initialised: NameError("name 'fw' is not defined",)
======================================================================
SKIPPED: test_update_password (unittest_security.LowLevelSecurityFunctionTC)
Ensure that if a user's password is stored with a deprecated hash,
repository is not initialised: NameError("name 'fw' is not defined",)
======================================================================
SKIPPED: test_attribute_security (unittest_security.SecurityTC)
repository is not initialised: NameError("name 'fw' is not defined",)
======================================================================
SKIPPED: test_attribute_security_rqlexpr (unittest_security.SecurityTC)
repository is not initialised: NameError("name 'fw' is not defined",)
======================================================================
SKIPPED: test_delete_relation_rql_permission (unittest_security.SecurityTC)
repository is not initialised: NameError("name 'fw' is not defined",)
======================================================================
SKIPPED: test_delete_rql_permission (unittest_security.SecurityTC)
repository is not initialised: NameError("name 'fw' is not defined",)
======================================================================
SKIPPED: test_delete_security (unittest_security.SecurityTC)
repository is not initialised: NameError("name 'fw' is not defined",)
======================================================================
SKIPPED: test_entity_created_in_transaction (unittest_security.SecurityTC)
repository is not initialised: NameError("name 'fw' is not defined",)
======================================================================
SKIPPED: test_insert_immutable_attribute_update (unittest_security.SecurityTC)
repository is not initialised: NameError("name 'fw' is not defined",)
======================================================================
SKIPPED: test_insert_relation_rql_permission (unittest_security.SecurityTC)
repository is not initialised: NameError("name 'fw' is not defined",)
======================================================================
SKIPPED: test_insert_rql_permission (unittest_security.SecurityTC)
repository is not initialised: NameError("name 'fw' is not defined",)
======================================================================
SKIPPED: test_insert_security (unittest_security.SecurityTC)
repository is not initialised: NameError("name 'fw' is not defined",)
======================================================================
SKIPPED: test_insert_security_2 (unittest_security.SecurityTC)
repository is not initialised: NameError("name 'fw' is not defined",)
======================================================================
SKIPPED: test_read_base (unittest_security.SecurityTC)
repository is not initialised: NameError("name 'fw' is not defined",)
======================================================================
SKIPPED: test_read_erqlexpr_aggregat (unittest_security.SecurityTC)
repository is not initialised: NameError("name 'fw' is not defined",)
======================================================================
SKIPPED: test_read_erqlexpr_base (unittest_security.SecurityTC)
repository is not initialised: NameError("name 'fw' is not defined",)
======================================================================
SKIPPED: test_read_erqlexpr_has_text1 (unittest_security.SecurityTC)
repository is not initialised: NameError("name 'fw' is not defined",)
======================================================================
SKIPPED: test_read_erqlexpr_has_text2 (unittest_security.SecurityTC)
repository is not initialised: NameError("name 'fw' is not defined",)
======================================================================
SKIPPED: test_read_erqlexpr_optional_rel (unittest_security.SecurityTC)
repository is not initialised: NameError("name 'fw' is not defined",)
======================================================================
SKIPPED: test_update_rql_permission (unittest_security.SecurityTC)
repository is not initialised: NameError("name 'fw' is not defined",)
======================================================================
SKIPPED: test_update_security_1 (unittest_security.SecurityTC)
repository is not initialised: NameError("name 'fw' is not defined",)
======================================================================
SKIPPED: test_update_security_2 (unittest_security.SecurityTC)
repository is not initialised: NameError("name 'fw' is not defined",)
======================================================================
SKIPPED: test_update_security_3 (unittest_security.SecurityTC)
repository is not initialised: NameError("name 'fw' is not defined",)
======================================================================
SKIPPED: test_user_can_change_its_upassword (unittest_security.SecurityTC)
repository is not initialised: NameError("name 'fw' is not defined",)
======================================================================
SKIPPED: test_user_cant_change_other_upassword (unittest_security.SecurityTC)
repository is not initialised: NameError("name 'fw' is not defined",)
======================================================================
SKIPPED: test_yams_inheritance_and_security_bug (unittest_security.SecurityTC)
repository is not initialised: NameError("name 'fw' is not defined",)
==================== unittest_rqlannotation.py =====================
..........................................................
====================== unittest_ssplanner.py =======================
..
==================== unittest_sources_native.py ====================
E
======================================================================
ERROR: test_index_entity_consider_do_fti (unittest_sources_native.NativeSourceTC)
----------------------------------------------------------------------
Traceback (most recent call last)
File "/var/lib/jenkins/jobs/cubicweb-3.23/workspace/TOXENV/py27-server/.tox/py27-server/local/lib/python2.7/site-packages/unittest2/case.py", line 67, in testPartExecutor
yield
File "/var/lib/jenkins/jobs/cubicweb-3.23/workspace/TOXENV/py27-server/.tox/py27-server/local/lib/python2.7/site-packages/unittest2/case.py", line 621, in run
self.setUp()
File "/var/lib/jenkins/jobs/cubicweb-3.23/workspace/TOXENV/py27-server/cubicweb/devtools/testlib.py", line 448, in setUp
self._init_repo()
File "/var/lib/jenkins/jobs/cubicweb-3.23/workspace/TOXENV/py27-server/cubicweb/devtools/testlib.py", line 357, in _init_repo
db_handler.restore_database(self.test_db_id)
File "/var/lib/jenkins/jobs/cubicweb-3.23/workspace/TOXENV/py27-server/cubicweb/devtools/__init__.py", line 378, in restore_database
self._restore_database(backup_coordinates, config)
File "/var/lib/jenkins/jobs/cubicweb-3.23/workspace/TOXENV/py27-server/cubicweb/devtools/__init__.py", line 815, in _restore_database
self.get_repo()
File "/var/lib/jenkins/jobs/cubicweb-3.23/workspace/TOXENV/py27-server/cubicweb/devtools/__init__.py", line 393, in get_repo
self._repo = self._new_repo(self.config)
File "/var/lib/jenkins/jobs/cubicweb-3.23/workspace/TOXENV/py27-server/cubicweb/devtools/__init__.py", line 407, in _new_repo
repo = config.repository()
File "/var/lib/jenkins/jobs/cubicweb-3.23/workspace/TOXENV/py27-server/cubicweb/cwconfig.py", line 1030, in repository
return Repository(self, TasksManager(), vreg=vreg)
File "/var/lib/jenkins/jobs/cubicweb-3.23/workspace/TOXENV/py27-server/cubicweb/server/repository.py", line 186, in __init__
self.init_cnxset_pool()
File "/var/lib/jenkins/jobs/cubicweb-3.23/workspace/TOXENV/py27-server/cubicweb/server/repository.py", line 228, in init_cnxset_pool
self.set_schema(config.load_schema(expand_cubes=True))
File "/var/lib/jenkins/jobs/cubicweb-3.23/workspace/TOXENV/py27-server/cubicweb/server/repository.py", line 315, in set_schema
self.vreg.set_schema(schema)
File "/var/lib/jenkins/jobs/cubicweb-3.23/workspace/TOXENV/py27-server/cubicweb/cwvreg.py", line 424, in set_schema
self.reload(self.config.appobjects_path(), force_reload=False)
File "/var/lib/jenkins/jobs/cubicweb-3.23/workspace/TOXENV/py27-server/cubicweb/cwvreg.py", line 474, in reload
self.register_objects(path)
File "/var/lib/jenkins/jobs/cubicweb-3.23/workspace/TOXENV/py27-server/cubicweb/cwvreg.py", line 519, in register_objects
path, self.config.extrapath)
File "/var/lib/jenkins/jobs/cubicweb-3.23/workspace/TOXENV/py27-server/.tox/py27-server/local/lib/python2.7/site-packages/logilab/common/registry.py", line 681, in register_objects
self.load_file(filepath, modname)
File "/var/lib/jenkins/jobs/cubicweb-3.23/workspace/TOXENV/py27-server/cubicweb/cwvreg.py", line 484, in load_file
return super(CWRegistryStore, self).load_file(filepath, modname)
File "/var/lib/jenkins/jobs/cubicweb-3.23/workspace/TOXENV/py27-server/.tox/py27-server/local/lib/python2.7/site-packages/logilab/common/registry.py", line 738, in load_file
module = load_module_from_name(modname)
File "/var/lib/jenkins/jobs/cubicweb-3.23/workspace/TOXENV/py27-server/.tox/py27-server/local/lib/python2.7/site-packages/logilab/common/modutils.py", line 125, in load_module_from_name
return load_module_from_modpath(dotted_name.split('.'), path, use_sys)
File "/var/lib/jenkins/jobs/cubicweb-3.23/workspace/TOXENV/py27-server/.tox/py27-server/local/lib/python2.7/site-packages/logilab/common/modutils.py", line 169, in load_module_from_modpath
module = load_module(curname, mp_file, mp_filename, mp_desc)
File "/var/lib/jenkins/jobs/cubicweb-3.23/workspace/TOXENV/py27-server/cubicweb/web/views/workflow.py", line 82, in <module>
class ChangeStateForm(forms.CompositeEntityForm):
File "/var/lib/jenkins/jobs/cubicweb-3.23/workspace/TOXENV/py27-server/cubicweb/web/views/workflow.py", line 90, in ChangeStateForm
{'class': fw.Button.css_class + ' cwjs-edition-cancel'})]
NameError: name 'fw' is not defined

no stdout
no stderr
====================== unittest_ldapsource.py ======================
EESSSSESSESS
======================================================================
ERROR: test_wrong_group (unittest_ldapsource.CheckWrongGroup)
----------------------------------------------------------------------
Traceback (most recent call last)
File "/var/lib/jenkins/jobs/cubicweb-3.23/workspace/TOXENV/py27-server/.tox/py27-server/local/lib/python2.7/site-packages/unittest2/case.py", line 67, in testPartExecutor
yield
File "/var/lib/jenkins/jobs/cubicweb-3.23/workspace/TOXENV/py27-server/.tox/py27-server/local/lib/python2.7/site-packages/unittest2/case.py", line 621, in run
self.setUp()
File "/var/lib/jenkins/jobs/cubicweb-3.23/workspace/TOXENV/py27-server/cubicweb/devtools/testlib.py", line 448, in setUp
self._init_repo()
File "/var/lib/jenkins/jobs/cubicweb-3.23/workspace/TOXENV/py27-server/cubicweb/devtools/testlib.py", line 356, in _init_repo
db_handler.build_db_cache(self.test_db_id, self.pre_setup_database)
File "/var/lib/jenkins/jobs/cubicweb-3.23/workspace/TOXENV/py27-server/cubicweb/devtools/__init__.py", line 502, in build_db_cache
self.restore_database(DEFAULT_EMPTY_DB_ID)
File "/var/lib/jenkins/jobs/cubicweb-3.23/workspace/TOXENV/py27-server/cubicweb/devtools/__init__.py", line 378, in restore_database
self._restore_database(backup_coordinates, config)
File "/var/lib/jenkins/jobs/cubicweb-3.23/workspace/TOXENV/py27-server/cubicweb/devtools/__init__.py", line 815, in _restore_database
self.get_repo()
File "/var/lib/jenkins/jobs/cubicweb-3.23/workspace/TOXENV/py27-server/cubicweb/devtools/__init__.py", line 393, in get_repo
self._repo = self._new_repo(self.config)
File "/var/lib/jenkins/jobs/cubicweb-3.23/workspace/TOXENV/py27-server/cubicweb/devtools/__init__.py", line 407, in _new_repo
repo = config.repository()
File "/var/lib/jenkins/jobs/cubicweb-3.23/workspace/TOXENV/py27-server/cubicweb/cwconfig.py", line 1030, in repository
return Repository(self, TasksManager(), vreg=vreg)
File "/var/lib/jenkins/jobs/cubicweb-3.23/workspace/TOXENV/py27-server/cubicweb/server/repository.py", line 186, in __init__
self.init_cnxset_pool()
File "/var/lib/jenkins/jobs/cubicweb-3.23/workspace/TOXENV/py27-server/cubicweb/server/repository.py", line 228, in init_cnxset_pool
self.set_schema(config.load_schema(expand_cubes=True))
File "/var/lib/jenkins/jobs/cubicweb-3.23/workspace/TOXENV/py27-server/cubicweb/server/repository.py", line 315, in set_schema
self.vreg.set_schema(schema)
File "/var/lib/jenkins/jobs/cubicweb-3.23/workspace/TOXENV/py27-server/cubicweb/cwvreg.py", line 424, in set_schema
self.reload(self.config.appobjects_path(), force_reload=False)
File "/var/lib/jenkins/jobs/cubicweb-3.23/workspace/TOXENV/py27-server/cubicweb/cwvreg.py", line 474, in reload
self.register_objects(path)
File "/var/lib/jenkins/jobs/cubicweb-3.23/workspace/TOXENV/py27-server/cubicweb/cwvreg.py", line 519, in register_objects
path, self.config.extrapath)
File "/var/lib/jenkins/jobs/cubicweb-3.23/workspace/TOXENV/py27-server/.tox/py27-server/local/lib/python2.7/site-packages/logilab/common/registry.py", line 681, in register_objects
self.load_file(filepath, modname)
File "/var/lib/jenkins/jobs/cubicweb-3.23/workspace/TOXENV/py27-server/cubicweb/cwvreg.py", line 484, in load_file
return super(CWRegistryStore, self).load_file(filepath, modname)
File "/var/lib/jenkins/jobs/cubicweb-3.23/workspace/TOXENV/py27-server/.tox/py27-server/local/lib/python2.7/site-packages/logilab/common/registry.py", line 738, in load_file
module = load_module_from_name(modname)
File "/var/lib/jenkins/jobs/cubicweb-3.23/workspace/TOXENV/py27-server/.tox/py27-server/local/lib/python2.7/site-packages/logilab/common/modutils.py", line 125, in load_module_from_name
return load_module_from_modpath(dotted_name.split('.'), path, use_sys)
File "/var/lib/jenkins/jobs/cubicweb-3.23/workspace/TOXENV/py27-server/.tox/py27-server/local/lib/python2.7/site-packages/logilab/common/modutils.py", line 169, in load_module_from_modpath
module = load_module(curname, mp_file, mp_filename, mp_desc)
File "/var/lib/jenkins/jobs/cubicweb-3.23/workspace/TOXENV/py27-server/cubicweb/web/views/workflow.py", line 82, in <module>
class ChangeStateForm(forms.CompositeEntityForm):
File "/var/lib/jenkins/jobs/cubicweb-3.23/workspace/TOXENV/py27-server/cubicweb/web/views/workflow.py", line 90, in ChangeStateForm
{'class': fw.Button.css_class + ' cwjs-edition-cancel'})]
NameError: name 'fw' is not defined

no stdout
no stderr
======================================================================
ERROR: test_group_deleted (unittest_ldapsource.LDAPFeedGroupTC)
----------------------------------------------------------------------
Traceback (most recent call last)
File "/var/lib/jenkins/jobs/cubicweb-3.23/workspace/TOXENV/py27-server/.tox/py27-server/local/lib/python2.7/site-packages/unittest2/case.py", line 67, in testPartExecutor
yield
File "/var/lib/jenkins/jobs/cubicweb-3.23/workspace/TOXENV/py27-server/.tox/py27-server/local/lib/python2.7/site-packages/unittest2/case.py", line 621, in run
self.setUp()
File "/var/lib/jenkins/jobs/cubicweb-3.23/workspace/TOXENV/py27-server/cubicweb/devtools/testlib.py", line 448, in setUp
self._init_repo()
File "/var/lib/jenkins/jobs/cubicweb-3.23/workspace/TOXENV/py27-server/cubicweb/devtools/testlib.py", line 356, in _init_repo
db_handler.build_db_cache(self.test_db_id, self.pre_setup_database)
File "/var/lib/jenkins/jobs/cubicweb-3.23/workspace/TOXENV/py27-server/cubicweb/devtools/__init__.py", line 502, in build_db_cache
self.restore_database(DEFAULT_EMPTY_DB_ID)
File "/var/lib/jenkins/jobs/cubicweb-3.23/workspace/TOXENV/py27-server/cubicweb/devtools/__init__.py", line 378, in restore_database
self._restore_database(backup_coordinates, config)
File "/var/lib/jenkins/jobs/cubicweb-3.23/workspace/TOXENV/py27-server/cubicweb/devtools/__init__.py", line 815, in _restore_database
self.get_repo()
File "/var/lib/jenkins/jobs/cubicweb-3.23/workspace/TOXENV/py27-server/cubicweb/devtools/__init__.py", line 393, in get_repo
self._repo = self._new_repo(self.config)
File "/var/lib/jenkins/jobs/cubicweb-3.23/workspace/TOXENV/py27-server/cubicweb/devtools/__init__.py", line 407, in _new_repo
repo = config.repository()
File "/var/lib/jenkins/jobs/cubicweb-3.23/workspace/TOXENV/py27-server/cubicweb/cwconfig.py", line 1030, in repository
return Repository(self, TasksManager(), vreg=vreg)
File "/var/lib/jenkins/jobs/cubicweb-3.23/workspace/TOXENV/py27-server/cubicweb/server/repository.py", line 186, in __init__
self.init_cnxset_pool()
File "/var/lib/jenkins/jobs/cubicweb-3.23/workspace/TOXENV/py27-server/cubicweb/server/repository.py", line 228, in init_cnxset_pool
self.set_schema(config.load_schema(expand_cubes=True))
File "/var/lib/jenkins/jobs/cubicweb-3.23/workspace/TOXENV/py27-server/cubicweb/server/repository.py", line 315, in set_schema
self.vreg.set_schema(schema)
File "/var/lib/jenkins/jobs/cubicweb-3.23/workspace/TOXENV/py27-server/cubicweb/cwvreg.py", line 424, in set_schema
self.reload(self.config.appobjects_path(), force_reload=False)
File "/var/lib/jenkins/jobs/cubicweb-3.23/workspace/TOXENV/py27-server/cubicweb/cwvreg.py", line 474, in reload
self.register_objects(path)
File "/var/lib/jenkins/jobs/cubicweb-3.23/workspace/TOXENV/py27-server/cubicweb/cwvreg.py", line 519, in register_objects
path, self.config.extrapath)
File "/var/lib/jenkins/jobs/cubicweb-3.23/workspace/TOXENV/py27-server/.tox/py27-server/local/lib/python2.7/site-packages/logilab/common/registry.py", line 681, in register_objects
self.load_file(filepath, modname)
File "/var/lib/jenkins/jobs/cubicweb-3.23/workspace/TOXENV/py27-server/cubicweb/cwvreg.py", line 484, in load_file
return super(CWRegistryStore, self).load_file(filepath, modname)
File "/var/lib/jenkins/jobs/cubicweb-3.23/workspace/TOXENV/py27-server/.tox/py27-server/local/lib/python2.7/site-packages/logilab/common/registry.py", line 738, in load_file
module = load_module_from_name(modname)
File "/var/lib/jenkins/jobs/cubicweb-3.23/workspace/TOXENV/py27-server/.tox/py27-server/local/lib/python2.7/site-packages/logilab/common/modutils.py", line 125, in load_module_from_name
return load_module_from_modpath(dotted_name.split('.'), path, use_sys)
File "/var/lib/jenkins/jobs/cubicweb-3.23/workspace/TOXENV/py27-server/.tox/py27-server/local/lib/python2.7/site-packages/logilab/common/modutils.py", line 169, in load_module_from_modpath
module = load_module(curname, mp_file, mp_filename, mp_desc)
File "/var/lib/jenkins/jobs/cubicweb-3.23/workspace/TOXENV/py27-server/cubicweb/web/views/workflow.py", line 82, in <module>
class ChangeStateForm(forms.CompositeEntityForm):
File "/var/lib/jenkins/jobs/cubicweb-3.23/workspace/TOXENV/py27-server/cubicweb/web/views/workflow.py", line 90, in ChangeStateForm
{'class': fw.Button.css_class + ' cwjs-edition-cancel'})]
NameError: name 'fw' is not defined

no stdout
no stderr
======================================================================
ERROR: test_a_filter_inactivate (unittest_ldapsource.LDAPFeedUserDeletionTC)
filtered out people should be deactivated, unable to authenticate
----------------------------------------------------------------------
Traceback (most recent call last)
File "/var/lib/jenkins/jobs/cubicweb-3.23/workspace/TOXENV/py27-server/.tox/py27-server/local/lib/python2.7/site-packages/unittest2/case.py", line 67, in testPartExecutor
yield
File "/var/lib/jenkins/jobs/cubicweb-3.23/workspace/TOXENV/py27-server/.tox/py27-server/local/lib/python2.7/site-packages/unittest2/case.py", line 621, in run
self.setUp()
File "/var/lib/jenkins/jobs/cubicweb-3.23/workspace/TOXENV/py27-server/cubicweb/devtools/testlib.py", line 448, in setUp
self._init_repo()
File "/var/lib/jenkins/jobs/cubicweb-3.23/workspace/TOXENV/py27-server/cubicweb/devtools/testlib.py", line 356, in _init_repo
db_handler.build_db_cache(self.test_db_id, self.pre_setup_database)
File "/var/lib/jenkins/jobs/cubicweb-3.23/workspace/TOXENV/py27-server/cubicweb/devtools/__init__.py", line 502, in build_db_cache
self.restore_database(DEFAULT_EMPTY_DB_ID)
File "/var/lib/jenkins/jobs/cubicweb-3.23/workspace/TOXENV/py27-server/cubicweb/devtools/__init__.py", line 378, in restore_database
self._restore_database(backup_coordinates, config)
File "/var/lib/jenkins/jobs/cubicweb-3.23/workspace/TOXENV/py27-server/cubicweb/devtools/__init__.py", line 815, in _restore_database
self.get_repo()
File "/var/lib/jenkins/jobs/cubicweb-3.23/workspace/TOXENV/py27-server/cubicweb/devtools/__init__.py", line 393, in get_repo
self._repo = self._new_repo(self.config)
File "/var/lib/jenkins/jobs/cubicweb-3.23/workspace/TOXENV/py27-server/cubicweb/devtools/__init__.py", line 407, in _new_repo
repo = config.repository()
File "/var/lib/jenkins/jobs/cubicweb-3.23/workspace/TOXENV/py27-server/cubicweb/cwconfig.py", line 1030, in repository
return Repository(self, TasksManager(), vreg=vreg)
File "/var/lib/jenkins/jobs/cubicweb-3.23/workspace/TOXENV/py27-server/cubicweb/server/repository.py", line 186, in __init__
self.init_cnxset_pool()
File "/var/lib/jenkins/jobs/cubicweb-3.23/workspace/TOXENV/py27-server/cubicweb/server/repository.py", line 228, in init_cnxset_pool
self.set_schema(config.load_schema(expand_cubes=True))
File "/var/lib/jenkins/jobs/cubicweb-3.23/workspace/TOXENV/py27-server/cubicweb/server/repository.py", line 315, in set_schema
self.vreg.set_schema(schema)
File "/var/lib/jenkins/jobs/cubicweb-3.23/workspace/TOXENV/py27-server/cubicweb/cwvreg.py", line 424, in set_schema
self.reload(self.config.appobjects_path(), force_reload=False)
File "/var/lib/jenkins/jobs/cubicweb-3.23/workspace/TOXENV/py27-server/cubicweb/cwvreg.py", line 474, in reload
self.register_objects(path)
File "/var/lib/jenkins/jobs/cubicweb-3.23/workspace/TOXENV/py27-server/cubicweb/cwvreg.py", line 519, in register_objects
path, self.config.extrapath)
File "/var/lib/jenkins/jobs/cubicweb-3.23/workspace/TOXENV/py27-server/.tox/py27-server/local/lib/python2.7/site-packages/logilab/common/registry.py", line 681, in register_objects
self.load_file(filepath, modname)
File "/var/lib/jenkins/jobs/cubicweb-3.23/workspace/TOXENV/py27-server/cubicweb/cwvreg.py", line 484, in load_file
return super(CWRegistryStore, self).load_file(filepath, modname)
File "/var/lib/jenkins/jobs/cubicweb-3.23/workspace/TOXENV/py27-server/.tox/py27-server/local/lib/python2.7/site-packages/logilab/common/registry.py", line 738, in load_file
module = load_module_from_name(modname)
File "/var/lib/jenkins/jobs/cubicweb-3.23/workspace/TOXENV/py27-server/.tox/py27-server/local/lib/python2.7/site-packages/logilab/common/modutils.py", line 125, in load_module_from_name
return load_module_from_modpath(dotted_name.split('.'), path, use_sys)
File "/var/lib/jenkins/jobs/cubicweb-3.23/workspace/TOXENV/py27-server/.tox/py27-server/local/lib/python2.7/site-packages/logilab/common/modutils.py", line 169, in load_module_from_modpath
module = load_module(curname, mp_file, mp_filename, mp_desc)
File "/var/lib/jenkins/jobs/cubicweb-3.23/workspace/TOXENV/py27-server/cubicweb/web/views/workflow.py", line 82, in <module>
class ChangeStateForm(forms.CompositeEntityForm):
File "/var/lib/jenkins/jobs/cubicweb-3.23/workspace/TOXENV/py27-server/cubicweb/web/views/workflow.py", line 90, in ChangeStateForm
{'class': fw.Button.css_class + ' cwjs-edition-cancel'})]
NameError: name 'fw' is not defined

no stdout
no stderr
======================================================================
ERROR: test_authenticate (unittest_ldapsource.LDAPFeedUserTC)
----------------------------------------------------------------------
Traceback (most recent call last)
File "/var/lib/jenkins/jobs/cubicweb-3.23/workspace/TOXENV/py27-server/.tox/py27-server/local/lib/python2.7/site-packages/unittest2/case.py", line 67, in testPartExecutor
yield
File "/var/lib/jenkins/jobs/cubicweb-3.23/workspace/TOXENV/py27-server/.tox/py27-server/local/lib/python2.7/site-packages/unittest2/case.py", line 621, in run
self.setUp()
File "/var/lib/jenkins/jobs/cubicweb-3.23/workspace/TOXENV/py27-server/cubicweb/devtools/testlib.py", line 448, in setUp
self._init_repo()
File "/var/lib/jenkins/jobs/cubicweb-3.23/workspace/TOXENV/py27-server/cubicweb/devtools/testlib.py", line 356, in _init_repo
db_handler.build_db_cache(self.test_db_id, self.pre_setup_database)
File "/var/lib/jenkins/jobs/cubicweb-3.23/workspace/TOXENV/py27-server/cubicweb/devtools/__init__.py", line 502, in build_db_cache
self.restore_database(DEFAULT_EMPTY_DB_ID)
File "/var/lib/jenkins/jobs/cubicweb-3.23/workspace/TOXENV/py27-server/cubicweb/devtools/__init__.py", line 378, in restore_database
self._restore_database(backup_coordinates, config)
File "/var/lib/jenkins/jobs/cubicweb-3.23/workspace/TOXENV/py27-server/cubicweb/devtools/__init__.py", line 815, in _restore_database
self.get_repo()
File "/var/lib/jenkins/jobs/cubicweb-3.23/workspace/TOXENV/py27-server/cubicweb/devtools/__init__.py", line 393, in get_repo
self._repo = self._new_repo(self.config)
File "/var/lib/jenkins/jobs/cubicweb-3.23/workspace/TOXENV/py27-server/cubicweb/devtools/__init__.py", line 407, in _new_repo
repo = config.repository()
File "/var/lib/jenkins/jobs/cubicweb-3.23/workspace/TOXENV/py27-server/cubicweb/cwconfig.py", line 1030, in repository
return Repository(self, TasksManager(), vreg=vreg)
File "/var/lib/jenkins/jobs/cubicweb-3.23/workspace/TOXENV/py27-server/cubicweb/server/repository.py", line 186, in __init__
self.init_cnxset_pool()
File "/var/lib/jenkins/jobs/cubicweb-3.23/workspace/TOXENV/py27-server/cubicweb/server/repository.py", line 228, in init_cnxset_pool
self.set_schema(config.load_schema(expand_cubes=True))
File "/var/lib/jenkins/jobs/cubicweb-3.23/workspace/TOXENV/py27-server/cubicweb/server/repository.py", line 315, in set_schema
self.vreg.set_schema(schema)
File "/var/lib/jenkins/jobs/cubicweb-3.23/workspace/TOXENV/py27-server/cubicweb/cwvreg.py", line 424, in set_schema
self.reload(self.config.appobjects_path(), force_reload=False)
File "/var/lib/jenkins/jobs/cubicweb-3.23/workspace/TOXENV/py27-server/cubicweb/cwvreg.py", line 474, in reload
self.register_objects(path)
File "/var/lib/jenkins/jobs/cubicweb-3.23/workspace/TOXENV/py27-server/cubicweb/cwvreg.py", line 519, in register_objects
path, self.config.extrapath)
File "/var/lib/jenkins/jobs/cubicweb-3.23/workspace/TOXENV/py27-server/.tox/py27-server/local/lib/python2.7/site-packages/logilab/common/registry.py", line 681, in register_objects
self.load_file(filepath, modname)
File "/var/lib/jenkins/jobs/cubicweb-3.23/workspace/TOXENV/py27-server/cubicweb/cwvreg.py", line 484, in load_file
return super(CWRegistryStore, self).load_file(filepath, modname)
File "/var/lib/jenkins/jobs/cubicweb-3.23/workspace/TOXENV/py27-server/.tox/py27-server/local/lib/python2.7/site-packages/logilab/common/registry.py", line 738, in load_file
module = load_module_from_name(modname)
File "/var/lib/jenkins/jobs/cubicweb-3.23/workspace/TOXENV/py27-server/.tox/py27-server/local/lib/python2.7/site-packages/logilab/common/modutils.py", line 125, in load_module_from_name
return load_module_from_modpath(dotted_name.split('.'), path, use_sys)
File "/var/lib/jenkins/jobs/cubicweb-3.23/workspace/TOXENV/py27-server/.tox/py27-server/local/lib/python2.7/site-packages/logilab/common/modutils.py", line 169, in load_module_from_modpath
module = load_module(curname, mp_file, mp_filename, mp_desc)
File "/var/lib/jenkins/jobs/cubicweb-3.23/workspace/TOXENV/py27-server/cubicweb/web/views/workflow.py", line 82, in <module>
class ChangeStateForm(forms.CompositeEntityForm):
File "/var/lib/jenkins/jobs/cubicweb-3.23/workspace/TOXENV/py27-server/cubicweb/web/views/workflow.py", line 90, in ChangeStateForm
{'class': fw.Button.css_class + ' cwjs-edition-cancel'})]
NameError: name 'fw' is not defined

no stdout
no stderr
======================================================================
SKIPPED: test_group_member_added (unittest_ldapsource.LDAPFeedGroupTC)
repository is not initialised: NameError("name 'fw' is not defined",)
======================================================================
SKIPPED: test_group_member_deleted (unittest_ldapsource.LDAPFeedGroupTC)
repository is not initialised: NameError("name 'fw' is not defined",)
======================================================================
SKIPPED: test_groups_exist (unittest_ldapsource.LDAPFeedGroupTC)
repository is not initialised: NameError("name 'fw' is not defined",)
======================================================================
SKIPPED: test_in_group (unittest_ldapsource.LDAPFeedGroupTC)
repository is not initialised: NameError("name 'fw' is not defined",)
======================================================================
SKIPPED: test_delete (unittest_ldapsource.LDAPFeedUserDeletionTC)
delete syt, pull, check deactivation, repull,
repository is not initialised: NameError("name 'fw' is not defined",)
======================================================================
SKIPPED: test_reactivate_deleted (unittest_ldapsource.LDAPFeedUserDeletionTC)
repository is not initialised: NameError("name 'fw' is not defined",)
======================================================================
SKIPPED: test_base (unittest_ldapsource.LDAPFeedUserTC)
repository is not initialised: NameError("name 'fw' is not defined",)
======================================================================
SKIPPED: test_copy_to_system_source (unittest_ldapsource.LDAPFeedUserTC)
make sure we can 'convert' an LDAP user into a system one
repository is not initialised: NameError("name 'fw' is not defined",)
===================== unittest_schemaserial.py =====================
2016-03-15 17:16:17 - (cubicweb.appobject) WARNING: can't find any workflow for CWUser
E................
======================================================================
ERROR: test (unittest_schemaserial.ComputedAttributeAndRelationTC)
----------------------------------------------------------------------
Traceback (most recent call last)
File "/var/lib/jenkins/jobs/cubicweb-3.23/workspace/TOXENV/py27-server/.tox/py27-server/local/lib/python2.7/site-packages/unittest2/case.py", line 67, in testPartExecutor
yield
File "/var/lib/jenkins/jobs/cubicweb-3.23/workspace/TOXENV/py27-server/.tox/py27-server/local/lib/python2.7/site-packages/unittest2/case.py", line 621, in run
self.setUp()
File "/var/lib/jenkins/jobs/cubicweb-3.23/workspace/TOXENV/py27-server/cubicweb/devtools/testlib.py", line 448, in setUp
self._init_repo()
File "/var/lib/jenkins/jobs/cubicweb-3.23/workspace/TOXENV/py27-server/cubicweb/devtools/testlib.py", line 357, in _init_repo
db_handler.restore_database(self.test_db_id)
File "/var/lib/jenkins/jobs/cubicweb-3.23/workspace/TOXENV/py27-server/cubicweb/devtools/__init__.py", line 378, in restore_database
self._restore_database(backup_coordinates, config)
File "/var/lib/jenkins/jobs/cubicweb-3.23/workspace/TOXENV/py27-server/cubicweb/devtools/__init__.py", line 815, in _restore_database
self.get_repo()
File "/var/lib/jenkins/jobs/cubicweb-3.23/workspace/TOXENV/py27-server/cubicweb/devtools/__init__.py", line 393, in get_repo
self._repo = self._new_repo(self.config)
File "/var/lib/jenkins/jobs/cubicweb-3.23/workspace/TOXENV/py27-server/cubicweb/devtools/__init__.py", line 407, in _new_repo
repo = config.repository()
File "/var/lib/jenkins/jobs/cubicweb-3.23/workspace/TOXENV/py27-server/cubicweb/cwconfig.py", line 1030, in repository
return Repository(self, TasksManager(), vreg=vreg)
File "/var/lib/jenkins/jobs/cubicweb-3.23/workspace/TOXENV/py27-server/cubicweb/server/repository.py", line 186, in __init__
self.init_cnxset_pool()
File "/var/lib/jenkins/jobs/cubicweb-3.23/workspace/TOXENV/py27-server/cubicweb/server/repository.py", line 228, in init_cnxset_pool
self.set_schema(config.load_schema(expand_cubes=True))
File "/var/lib/jenkins/jobs/cubicweb-3.23/workspace/TOXENV/py27-server/cubicweb/server/repository.py", line 315, in set_schema
self.vreg.set_schema(schema)
File "/var/lib/jenkins/jobs/cubicweb-3.23/workspace/TOXENV/py27-server/cubicweb/cwvreg.py", line 424, in set_schema
self.reload(self.config.appobjects_path(), force_reload=False)
File "/var/lib/jenkins/jobs/cubicweb-3.23/workspace/TOXENV/py27-server/cubicweb/cwvreg.py", line 474, in reload
self.register_objects(path)
File "/var/lib/jenkins/jobs/cubicweb-3.23/workspace/TOXENV/py27-server/cubicweb/cwvreg.py", line 519, in register_objects
path, self.config.extrapath)
File "/var/lib/jenkins/jobs/cubicweb-3.23/workspace/TOXENV/py27-server/.tox/py27-server/local/lib/python2.7/site-packages/logilab/common/registry.py", line 681, in register_objects
self.load_file(filepath, modname)
File "/var/lib/jenkins/jobs/cubicweb-3.23/workspace/TOXENV/py27-server/cubicweb/cwvreg.py", line 484, in load_file
return super(CWRegistryStore, self).load_file(filepath, modname)
File "/var/lib/jenkins/jobs/cubicweb-3.23/workspace/TOXENV/py27-server/.tox/py27-server/local/lib/python2.7/site-packages/logilab/common/registry.py", line 738, in load_file
module = load_module_from_name(modname)
File "/var/lib/jenkins/jobs/cubicweb-3.23/workspace/TOXENV/py27-server/.tox/py27-server/local/lib/python2.7/site-packages/logilab/common/modutils.py", line 125, in load_module_from_name
return load_module_from_modpath(dotted_name.split('.'), path, use_sys)
File "/var/lib/jenkins/jobs/cubicweb-3.23/workspace/TOXENV/py27-server/.tox/py27-server/local/lib/python2.7/site-packages/logilab/common/modutils.py", line 169, in load_module_from_modpath
module = load_module(curname, mp_file, mp_filename, mp_desc)
File "/var/lib/jenkins/jobs/cubicweb-3.23/workspace/TOXENV/py27-server/cubicweb/web/views/workflow.py", line 82, in <module>
class ChangeStateForm(forms.CompositeEntityForm):
File "/var/lib/jenkins/jobs/cubicweb-3.23/workspace/TOXENV/py27-server/cubicweb/web/views/workflow.py", line 90, in ChangeStateForm
{'class': fw.Button.css_class + ' cwjs-edition-cancel'})]
NameError: name 'fw' is not defined

no stdout
no stderr
-> creating tables
-> inserting default user and default groups.
-> storing the schema in the database
-> database for instance data initialized.
-> creating tables
-> inserting default user and default groups.
-> storing the schema in the database
-> database for instance data-schemaserial initialized.
-> installing /var/lib/jenkins/jobs/cubicweb-3.23/workspace/TOXENV/py27-server/cubicweb/schemas/_regproc.postgres.sql
-> creating tables
-> inserting default user and default groups.
-> storing the schema in the database
-> database for instance datacomputed initialized.
-> installing /var/lib/jenkins/jobs/cubicweb-3.23/workspace/TOXENV/py27-server/cubicweb/schemas/_regproc.postgres.sql
-> creating tables
-> inserting default user and default groups.
-> storing the schema in the database
-> database for instance data-migractions initialized.
warning: Numeric already known, skip addition
warning: relation ExternalUri same_as Societe is already known, skip addition
-> installing /var/lib/jenkins/jobs/cubicweb-3.23/workspace/TOXENV/py27-server/cubicweb/schemas/_regproc.postgres.sql
-> creating tables
-> inserting default user and default groups.
-> storing the schema in the database
-> database for instance data initialized.
Building ldap-feed for database tmpdb
Building ldap-feed for database tmpdb
Building ldap-feed for database tmpdb
Building ldap-feed for database tmpdb
-> creating tables
-> inserting default user and default groups.
-> storing the schema in the database
-> database for instance data-cwep002 initialized.
*******************************************************************************
Ran 599 test cases in 532.01s (472.50s CPU), 29 errors, 125 skipped
8 modules OK (13 failed)
failures: /var/lib/jenkins/jobs/cubicweb-3.23/workspace/TOXENV/py27-server/cubicweb/server/test/unittest_undo [2/18], /var/lib/jenkins/jobs/cubicweb-3.23/workspace/TOXENV/py27-server/cubicweb/server/test/unittest_repository [7/42], /var/lib/jenkins/jobs/cubicweb-3.23/workspace/TOXENV/py27-server/cubicweb/server/test/unittest_storage [1/16], /var/lib/jenkins/jobs/cubicweb-3.23/workspace/TOXENV/py27-server/cubicweb/server/test/unittest_sqlutils [1/3], /var/lib/jenkins/jobs/cubicweb-3.23/workspace/TOXENV/py27-server/cubicweb/server/test/unittest_serverctl [1/1], /var/lib/jenkins/jobs/cubicweb-3.23/workspace/TOXENV/py27-server/cubicweb/server/test/unittest_querier [1/153], /var/lib/jenkins/jobs/cubicweb-3.23/workspace/TOXENV/py27-server/cubicweb/server/test/unittest_hook [2/9], /var/lib/jenkins/jobs/cubicweb-3.23/workspace/TOXENV/py27-server/cubicweb/server/test/unittest_postgres [2/8], /var/lib/jenkins/jobs/cubicweb-3.23/workspace/TOXENV/py27-server/cubicweb/server/test/unittest_datafeed [2/4], /var/lib/jenkins/jobs/cubicweb-3.23/workspace/TOXENV/py27-server/cubicweb/server/test/unittest_security [4/39], /var/lib/jenkins/jobs/cubicweb-3.23/workspace/TOXENV/py27-server/cubicweb/server/test/unittest_sources_native [1/1], /var/lib/jenkins/jobs/cubicweb-3.23/workspace/TOXENV/py27-server/cubicweb/server/test/unittest_ldapsource [4/12], /var/lib/jenkins/jobs/cubicweb-3.23/workspace/TOXENV/py27-server/cubicweb/server/test/unittest_schemaserial [1/17]
ERROR: InvocationError: '/var/lib/jenkins/jobs/cubicweb-3.23/workspace/TOXENV/py27-server/.tox/py27-server/bin/python -c from logilab.common import pytest; pytest.run() -t /var/lib/jenkins/jobs/cubicweb-3.23/workspace/TOXENV/py27-server/cubicweb/server/test'
___________________________________ summary ____________________________________
ERROR: py27-server: commands failed
Build step 'Execute shell' marked build as failure
Sending e-mails to: dlaxalde@logilab.fr jcr@logilab.fr syt@logilab.fr david@logilab.fr
[PostBuildScript] - Execution post build scripts.
[py27-server] $ /bin/bash -xe /tmp/hudson8769058210336709475.sh
+ /var/lib/jenkins/scripts/notify_forge_apycot.py cwo cubicweb ed0da4d57b5a http://jenkins.logilab.fr/job/cubicweb-3.23/TOXENV=py27-server/72/ --status failure
<br/>

log from execution
download