consoleText

download

20 Started by upstream project "cubicweb-3.23" build number 73
originally caused by:
Started by an SCM change
Building in workspace /var/lib/jenkins/jobs/cubicweb-3.23/workspace/TOXENV/py27-devtools
[py27-devtools] $ hg showconfig paths.default
[py27-devtools] $ hg pull
pulling from http://hg.logilab.org/review/cubicweb
searching for changes
adding changesets
adding manifests
adding file changes
added 1 changesets with 1 changes to 2 files (+1 heads)
2 new obsolescence markers
(run 'hg heads .' to see heads, 'hg merge' to merge)
working directory parent is obsolete!
(use "hg evolve" to update to its successor)
[py27-devtools] $ hg update --clean --rev 6907c7b48bd538ac7e3fc5d522cdb1ecd757c490
1 files updated, 0 files merged, 0 files removed, 0 files unresolved
[py27-devtools] $ hg --config extensions.purge= clean --all
[py27-devtools] $ hg log --rev . --template {node}
[py27-devtools] $ hg log --rev . --template {rev}
[py27-devtools] $ hg id --branch
[py27-devtools] $ /bin/bash -xe /tmp/hudson3837703425198170322.sh
+ find . '(' -name 'pgdb*' -o -name 'tmpdb*' ')' -print0
+ xargs -0 rm -rf
[py27-devtools] $ /bin/bash -xe /tmp/hudson7412696280935179628.sh
+ PATH=/usr/lib/postgresql/9.4/bin:/usr/local/bin:/usr/bin:/bin:/usr/local/games:/usr/games
+ tox --recreate
py27-devtools create: /var/lib/jenkins/jobs/cubicweb-3.23/workspace/TOXENV/py27-devtools/.tox/py27-devtools
py27-devtools installdeps: -r/var/lib/jenkins/jobs/cubicweb-3.23/workspace/TOXENV/py27-devtools/cubicweb/devtools/test/requirements.txt
py27-devtools develop-inst: /var/lib/jenkins/jobs/cubicweb-3.23/workspace/TOXENV/py27-devtools
py27-devtools installed: You are using pip version 7.1.2, however version 8.1.0 is available.,You should consider upgrading via the 'pip install --upgrade pip' command.,beautifulsoup4==4.3.2,boto==2.34.0,bzr-etckeeper==0.0.0,cffi==0.8.6,characteristic==0.1.0,chardet==2.3.0,Cheetah==2.4.4,cloud-init==0.7.6,colorama==0.3.2,configobj==5.0.6,coverage==3.7.1,croniter==0.3.4,cryptography==0.6.1,-e hg+http://hg.logilab.org/review/cubicweb@6907c7b48bd538ac7e3fc5d522cdb1ecd757c490#egg=cubicweb-dev,cwclientlib==0.4.1,Cython==0.21.1,decorator==3.4.0,docutils==0.12,ecdsa==0.11,euca2ools==3.1.0,flake8==2.5.4,GDAL==1.10.1,hg-evolve==5.2.1,html2text==2016.1.8,html5lib==0.999,isodate==0.5.0,Jinja2==2.7.3,joblib==0.8.3,jsonpatch==1.3,jsonpointer==1.0,linecache2==1.0.0,logilab-common==1.2.0,logilab-constraint==0.6.0,logilab-database==1.15.0,logilab-mtconverter==0.9.0,lxml==3.4.0,M2Crypto==0.21.1,Mako==1.0.0,Markdown==2.5.1,MarkupSafe==0.23,matplotlib==1.4.2,mccabe==0.4.0,mercurial==3.5.2,mock==1.0.1,msgpack-python==0.4.2,nose==1.3.4,numexpr==2.4,numpy==1.8.2,oauth==1.0.1,openpyxl==1.7.0,pandas==0.14.1,paramiko==1.15.1,passlib==1.6.5,pep8==1.5.7,Pillow==2.6.1,pluggy==0.3.1,ply==3.4,prettytable==0.7.2,psycopg2==2.5.4,py==1.4.31,pyasn1==0.1.7,pyasn1-modules==0.0.5,pycparser==2.10,pycrypto==2.6.1,pyflakes==1.0.0,Pygments==2.0.1,pyinotify==0.9.4,pyOpenSSL==0.14,pyparsing==2.0.3,pyserial==2.6,pysqlite==2.6.3,python-apt==0.9.3.12,python-augeas==0.4.1,python-dateutil==2.2,python-jenkins==0.2.1,python-ldap==2.4.10,python-yapps==2.1.1,python3-ldap==0.9.4.2,pytz==2012rc0,PyYAML==3.11,pyzmq==14.4.0,rdflib==4.1.2,requestbuilder==0.2.3,requests==2.4.3,roman==2.0.0,rql==0.34.0,rubber==1.1,salt==2015.5.3,scikit-learn==0.14.1,scipy==0.14.0,service-identity==1.0.0,Shapely==1.4.3,simplejson==3.6.5,SimpleTAL==4.1,six==1.8.0,SPARQLWrapper==1.6.0,statsmodels==0.4.2,tables==3.1.1,tox==2.3.1,traceback2==1.4.0,Twisted==16.0.0,unittest2==1.1.0,urllib3==1.9.1,virtualenv==13.1.2,waitress==0.8.10,WebOb==1.5.1,WebTest==2.0.20,wheel==0.24.0,xlrd==0.9.2,xlwt==0.7.5,yams==0.42.0,Yapps==2.2.0,Yapps2==2.2.0,zope.interface==4.1.3
py27-devtools runtests: PYTHONHASHSEED='2108360074'
py27-devtools runtests: commands[0] | /var/lib/jenkins/jobs/cubicweb-3.23/workspace/TOXENV/py27-devtools/.tox/py27-devtools/bin/python -c from logilab.common import pytest; pytest.run() -t /var/lib/jenkins/jobs/cubicweb-3.23/workspace/TOXENV/py27-devtools/cubicweb/devtools/test
======================= unittest_testlib.py ========================
2016-03-15 17:21:45 - (cubicweb.appobject) WARNING: can't find any workflow for CWUser
2016-03-15 17:21:54 - (cubicweb.web) WARNING: [3.17] massmailing extracted to cube massmailing that was not found. try installing it.
2016-03-15 17:21:54 - (cubicweb.web) WARNING: [3.17] igeocoding extracted to cube geocoding that was not found. try installing it.
2016-03-15 17:21:54 - (cubicweb.web) WARNING: [3.17] embedding extracted to cube embed that was not found. try installing it.
2016-03-15 17:21:54 - (cubicweb.web) WARNING: [3.17] isioc extracted to cube sioc that was not found. try installing it.
....................2016-03-15 17:21:57 - (py.warnings) WARNING: /var/lib/jenkins/jobs/cubicweb-3.23/workspace/TOXENV/py27-devtools/cubicweb/devtools/__init__.py:111: RuntimeWarning: admina996374962c9477bb3a2152fb9a7c775 Open session found while turning repository off
%sessionid, RuntimeWarning)

..
======================== unittest_dbfill.py ========================
S........
======================================================================
SKIPPED: test_writeme (unittest_dbfill.ConstraintInsertionTC)
Test automatic insertion / Schema Constraints
========================= unittest_i18n.py =========================
.
======================== unittest_devctl.py ========================
..
======================= unittest_httptest.py =======================
F.F2016-03-15 17:22:08 - (py.warnings) WARNING: /var/lib/jenkins/jobs/cubicweb-3.23/workspace/TOXENV/py27-devtools/cubicweb/devtools/__init__.py:111: RuntimeWarning: admin363c9aff6d3d4e15896d6a2980999dd3 Open session found while turning repository off
%sessionid, RuntimeWarning)

SF127.0.0.1 - - [15/Mar/2016 17:22:10] "GET / HTTP/1.1" 200 6169
2016-03-15 17:22:10 - (py.warnings) WARNING: /var/lib/jenkins/jobs/cubicweb-3.23/workspace/TOXENV/py27-devtools/cubicweb/devtools/__init__.py:111: RuntimeWarning: anon0d38ebb7cb3e43a0940e2c1a551776e9 Open session found while turning repository off
%sessionid, RuntimeWarning)

.127.0.0.1 - - [15/Mar/2016 17:22:12] "GET / HTTP/1.1" 200 6169
2016-03-15 17:22:12 - (py.warnings) WARNING: /var/lib/jenkins/jobs/cubicweb-3.23/workspace/TOXENV/py27-devtools/cubicweb/devtools/__init__.py:111: RuntimeWarning: anondd6d2a7e58cb4a33babbaaa99ecb86b6 Open session found while turning repository off
%sessionid, RuntimeWarning)

.127.0.0.1 - - [15/Mar/2016 17:22:14] "GET / HTTP/1.1" 200 6169
2016-03-15 17:22:14 - (py.warnings) WARNING: /var/lib/jenkins/jobs/cubicweb-3.23/workspace/TOXENV/py27-devtools/cubicweb/devtools/__init__.py:111: RuntimeWarning: anon3404c3f969f54044a0bc248580a31f56 Open session found while turning repository off
%sessionid, RuntimeWarning)

.127.0.0.1 - - [15/Mar/2016 17:22:15] "GET / HTTP/1.1" 403 3887
127.0.0.1 - - [15/Mar/2016 17:22:17] "GET /login?__login=admin&__password=gingkow HTTP/1.1" 303 0
127.0.0.1 - - [15/Mar/2016 17:22:17] "GET / HTTP/1.1" 200 5964
127.0.0.1 - - [15/Mar/2016 17:22:17] "GET /logout HTTP/1.1" 303 0
127.0.0.1 - - [15/Mar/2016 17:22:17] "GET / HTTP/1.1" 403 3887
.127.0.0.1 - - [15/Mar/2016 17:22:17] "GET / HTTP/1.1" 403 3887
.
======================================================================
FAIL: test_base_url (unittest_httptest.TwistedCWAnonTC)
----------------------------------------------------------------------
Traceback (most recent call last)
File "/var/lib/jenkins/jobs/cubicweb-3.23/workspace/TOXENV/py27-devtools/.tox/py27-devtools/local/lib/python2.7/site-packages/unittest2/case.py", line 67, in testPartExecutor
yield
File "/var/lib/jenkins/jobs/cubicweb-3.23/workspace/TOXENV/py27-devtools/.tox/py27-devtools/local/lib/python2.7/site-packages/unittest2/case.py", line 625, in run
testMethod()
File "/var/lib/jenkins/jobs/cubicweb-3.23/workspace/TOXENV/py27-devtools/cubicweb/devtools/test/unittest_httptest.py", line 40, in test_base_url
self.fail('no mention of base url in retrieved page')
File "/var/lib/jenkins/jobs/cubicweb-3.23/workspace/TOXENV/py27-devtools/.tox/py27-devtools/local/lib/python2.7/site-packages/unittest2/case.py", line 690, in fail
raise self.failureException(msg)
AssertionError: no mention of base url in retrieved page

no stdout
no stderr
======================================================================
FAIL: test_response_anon (unittest_httptest.TwistedCWAnonTC)
----------------------------------------------------------------------
Traceback (most recent call last)
File "/var/lib/jenkins/jobs/cubicweb-3.23/workspace/TOXENV/py27-devtools/.tox/py27-devtools/local/lib/python2.7/site-packages/unittest2/case.py", line 67, in testPartExecutor
yield
File "/var/lib/jenkins/jobs/cubicweb-3.23/workspace/TOXENV/py27-devtools/.tox/py27-devtools/local/lib/python2.7/site-packages/unittest2/case.py", line 625, in run
testMethod()
File "/var/lib/jenkins/jobs/cubicweb-3.23/workspace/TOXENV/py27-devtools/cubicweb/devtools/test/unittest_httptest.py", line 36, in test_response_anon
self.assertEqual(response.status, http_client.OK)
File "/var/lib/jenkins/jobs/cubicweb-3.23/workspace/TOXENV/py27-devtools/.tox/py27-devtools/local/lib/python2.7/site-packages/unittest2/case.py", line 836, in assertEqual
assertion_func(first, second, msg=msg)
File "/var/lib/jenkins/jobs/cubicweb-3.23/workspace/TOXENV/py27-devtools/.tox/py27-devtools/local/lib/python2.7/site-packages/unittest2/case.py", line 829, in _baseAssertEqual
raise self.failureException(msg)
AssertionError: 500 != 200

no stdout
no stderr
======================================================================
FAIL: test_response_denied (unittest_httptest.TwistedCWIdentTC)
----------------------------------------------------------------------
Traceback (most recent call last)
File "/var/lib/jenkins/jobs/cubicweb-3.23/workspace/TOXENV/py27-devtools/.tox/py27-devtools/local/lib/python2.7/site-packages/unittest2/case.py", line 67, in testPartExecutor
yield
File "/var/lib/jenkins/jobs/cubicweb-3.23/workspace/TOXENV/py27-devtools/.tox/py27-devtools/local/lib/python2.7/site-packages/unittest2/case.py", line 625, in run
testMethod()
File "/var/lib/jenkins/jobs/cubicweb-3.23/workspace/TOXENV/py27-devtools/cubicweb/devtools/test/unittest_httptest.py", line 50, in test_response_denied
self.assertEqual(response.status, http_client.FORBIDDEN)
File "/var/lib/jenkins/jobs/cubicweb-3.23/workspace/TOXENV/py27-devtools/.tox/py27-devtools/local/lib/python2.7/site-packages/unittest2/case.py", line 836, in assertEqual
assertion_func(first, second, msg=msg)
File "/var/lib/jenkins/jobs/cubicweb-3.23/workspace/TOXENV/py27-devtools/.tox/py27-devtools/local/lib/python2.7/site-packages/unittest2/case.py", line 829, in _baseAssertEqual
raise self.failureException(msg)
AssertionError: 500 != 403

no stdout
no stderr
======================================================================
SKIPPED: test_login (unittest_httptest.TwistedCWIdentTC)
Already authenticated, "test_response_denied" must have failed
======================== unittest_qunit.py =========================
2016-03-15 17:22:27 - (py.warnings) WARNING: /var/lib/jenkins/jobs/cubicweb-3.23/workspace/TOXENV/py27-devtools/cubicweb/devtools/__init__.py:111: RuntimeWarning: anon9289eed254754f25baf4300e17a12bd5 Open session found while turning repository off
%sessionid, RuntimeWarning)

2016-03-15 17:22:27 - (py.warnings) WARNING: /var/lib/jenkins/jobs/cubicweb-3.23/workspace/TOXENV/py27-devtools/cubicweb/devtools/__init__.py:111: RuntimeWarning: anonad777e6cb7254c5898fe565397e923f7 Open session found while turning repository off
%sessionid, RuntimeWarning)

2016-03-15 17:22:27 - (py.warnings) WARNING: /var/lib/jenkins/jobs/cubicweb-3.23/workspace/TOXENV/py27-devtools/cubicweb/devtools/__init__.py:111: RuntimeWarning: anon802ccc6b6b144f8a876ec9a0c078f5ee Open session found while turning repository off
%sessionid, RuntimeWarning)

.2016-03-15 17:22:30 - (py.warnings) WARNING: /var/lib/jenkins/jobs/cubicweb-3.23/workspace/TOXENV/py27-devtools/cubicweb/devtools/__init__.py:111: RuntimeWarning: anon2eec8474930d45939f9871b8078ab73f Open session found while turning repository off
%sessionid, RuntimeWarning)

.
======================= unittest_webtest.py ========================
2016-03-15 17:22:33 - (py.warnings) WARNING: /var/lib/jenkins/jobs/cubicweb-3.23/workspace/TOXENV/py27-devtools/cubicweb/devtools/__init__.py:111: RuntimeWarning: admin3b4c0965d823410b91bd1e44fcf6e273 Open session found while turning repository off
%sessionid, RuntimeWarning)

..2016-03-15 17:22:36 - (py.warnings) WARNING: /var/lib/jenkins/jobs/cubicweb-3.23/workspace/TOXENV/py27-devtools/cubicweb/devtools/__init__.py:111: RuntimeWarning: anon000492ddb7c44f3d883d16856074a4ca Open session found while turning repository off
%sessionid, RuntimeWarning)

.2016-03-15 17:22:38 - (py.warnings) WARNING: /var/lib/jenkins/jobs/cubicweb-3.23/workspace/TOXENV/py27-devtools/cubicweb/devtools/__init__.py:111: RuntimeWarning: anon2670a689113b445983c5359ee7014f08 Open session found while turning repository off
%sessionid, RuntimeWarning)

.
========================= unittest_fill.py =========================
...
-> creating tables
-> inserting default user and default groups.
-> storing the schema in the database
-> database for instance data initialized.
Building RepoInstancesConsistencyTC for database tmpdb
Building httptest-cwident for database tmpdb
Building webtest-ident for database tmpdb
*******************************************************************************
Ran 52 test cases in 54.78s (43.50s CPU), 3 failures, 2 skipped
7 modules OK (1 failed)
failures: /var/lib/jenkins/jobs/cubicweb-3.23/workspace/TOXENV/py27-devtools/cubicweb/devtools/test/unittest_httptest [3/10]
ERROR: InvocationError: '/var/lib/jenkins/jobs/cubicweb-3.23/workspace/TOXENV/py27-devtools/.tox/py27-devtools/bin/python -c from logilab.common import pytest; pytest.run() -t /var/lib/jenkins/jobs/cubicweb-3.23/workspace/TOXENV/py27-devtools/cubicweb/devtools/test'
___________________________________ summary ____________________________________
ERROR: py27-devtools: commands failed
Build step 'Execute shell' marked build as failure
Sending e-mails to: dlaxalde@logilab.fr jcr@logilab.fr syt@logilab.fr david@logilab.fr
[PostBuildScript] - Execution post build scripts.
[py27-devtools] $ /bin/bash -xe /tmp/hudson6292346783595192255.sh
+ /var/lib/jenkins/scripts/notify_forge_apycot.py cwo cubicweb 6907c7b48bd5 http://jenkins.logilab.fr/job/cubicweb-3.23/TOXENV=py27-devtools/73/ --status failure
<br/>

log from execution
download