consoleText

download

20 Started by upstream project "cubicweb-3.23" build number 74
originally caused by:
Started by an SCM change
Building in workspace /var/lib/jenkins/jobs/cubicweb-3.23/workspace/TOXENV/py27-devtools
[py27-devtools] $ hg showconfig paths.default
[py27-devtools] $ hg pull
pulling from http://hg.logilab.org/review/cubicweb
searching for changes
adding changesets
adding manifests
adding file changes
added 2 changesets with 5 changes to 4 files (+1 heads)
4 new obsolescence markers
(run 'hg heads .' to see heads, 'hg merge' to merge)
[py27-devtools] $ hg update --clean --rev 27253355de868621a66361e415375e56f3bf5a63
14 files updated, 0 files merged, 0 files removed, 0 files unresolved
[py27-devtools] $ hg --config extensions.purge= clean --all
[py27-devtools] $ hg log --rev . --template {node}
[py27-devtools] $ hg log --rev . --template {rev}
[py27-devtools] $ hg id --branch
[py27-devtools] $ /bin/bash -xe /tmp/hudson6700259077665056781.sh
+ xargs -0 rm -rf
+ find . '(' -name 'pgdb*' -o -name 'tmpdb*' ')' -print0
[py27-devtools] $ /bin/bash -xe /tmp/hudson2856961480326819830.sh
+ PATH=/usr/lib/postgresql/9.4/bin:/usr/local/bin:/usr/bin:/bin:/usr/local/games:/usr/games
+ tox --recreate
py27-devtools create: /var/lib/jenkins/jobs/cubicweb-3.23/workspace/TOXENV/py27-devtools/.tox/py27-devtools
py27-devtools installdeps: -r/var/lib/jenkins/jobs/cubicweb-3.23/workspace/TOXENV/py27-devtools/cubicweb/devtools/test/requirements.txt
py27-devtools develop-inst: /var/lib/jenkins/jobs/cubicweb-3.23/workspace/TOXENV/py27-devtools
py27-devtools installed: You are using pip version 7.1.2, however version 8.1.0 is available.,You should consider upgrading via the 'pip install --upgrade pip' command.,beautifulsoup4==4.3.2,boto==2.34.0,bzr-etckeeper==0.0.0,cffi==0.8.6,characteristic==0.1.0,chardet==2.3.0,Cheetah==2.4.4,cloud-init==0.7.6,colorama==0.3.2,configobj==5.0.6,coverage==3.7.1,croniter==0.3.4,cryptography==0.6.1,-e hg+http://hg.logilab.org/review/cubicweb@27253355de868621a66361e415375e56f3bf5a63#egg=cubicweb-dev,cwclientlib==0.4.1,Cython==0.21.1,decorator==3.4.0,docutils==0.12,ecdsa==0.11,euca2ools==3.1.0,flake8==2.5.4,GDAL==1.10.1,hg-evolve==5.2.1,html2text==2016.1.8,html5lib==0.999,isodate==0.5.0,Jinja2==2.7.3,joblib==0.8.3,jsonpatch==1.3,jsonpointer==1.0,linecache2==1.0.0,logilab-common==1.2.0,logilab-constraint==0.6.0,logilab-database==1.15.0,logilab-mtconverter==0.9.0,lxml==3.4.0,M2Crypto==0.21.1,Mako==1.0.0,Markdown==2.5.1,MarkupSafe==0.23,matplotlib==1.4.2,mccabe==0.4.0,mercurial==3.5.2,mock==1.0.1,msgpack-python==0.4.2,nose==1.3.4,numexpr==2.4,numpy==1.8.2,oauth==1.0.1,openpyxl==1.7.0,pandas==0.14.1,paramiko==1.15.1,passlib==1.6.5,pep8==1.5.7,Pillow==2.6.1,pluggy==0.3.1,ply==3.4,prettytable==0.7.2,psycopg2==2.5.4,py==1.4.31,pyasn1==0.1.7,pyasn1-modules==0.0.5,pycparser==2.10,pycrypto==2.6.1,pyflakes==1.0.0,Pygments==2.0.1,pyinotify==0.9.4,pyOpenSSL==0.14,pyparsing==2.0.3,pyserial==2.6,pysqlite==2.6.3,python-apt==0.9.3.12,python-augeas==0.4.1,python-dateutil==2.2,python-jenkins==0.2.1,python-ldap==2.4.10,python-yapps==2.1.1,python3-ldap==0.9.4.2,pytz==2012rc0,PyYAML==3.11,pyzmq==14.4.0,rdflib==4.1.2,requestbuilder==0.2.3,requests==2.4.3,roman==2.0.0,rql==0.34.0,rubber==1.1,salt==2015.5.3,scikit-learn==0.14.1,scipy==0.14.0,service-identity==1.0.0,Shapely==1.4.3,simplejson==3.6.5,SimpleTAL==4.1,six==1.8.0,SPARQLWrapper==1.6.0,statsmodels==0.4.2,tables==3.1.1,tox==2.3.1,traceback2==1.4.0,Twisted==16.0.0,unittest2==1.1.0,urllib3==1.9.1,virtualenv==13.1.2,waitress==0.8.10,WebOb==1.5.1,WebTest==2.0.20,wheel==0.24.0,xlrd==0.9.2,xlwt==0.7.5,yams==0.42.0,Yapps==2.2.0,Yapps2==2.2.0,zope.interface==4.1.3
py27-devtools runtests: PYTHONHASHSEED='1342992439'
py27-devtools runtests: commands[0] | /var/lib/jenkins/jobs/cubicweb-3.23/workspace/TOXENV/py27-devtools/.tox/py27-devtools/bin/python -c from logilab.common import pytest; pytest.run() -t /var/lib/jenkins/jobs/cubicweb-3.23/workspace/TOXENV/py27-devtools/cubicweb/devtools/test
======================== unittest_dbfill.py ========================
S........
======================================================================
SKIPPED: test_writeme (unittest_dbfill.ConstraintInsertionTC)
Test automatic insertion / Schema Constraints
======================== unittest_qunit.py =========================
2016-03-15 17:45:09 - (cubicweb.appobject) WARNING: can't find any workflow for CWUser
2016-03-15 17:45:20 - (cubicweb.web) WARNING: [3.17] massmailing extracted to cube massmailing that was not found. try installing it.
2016-03-15 17:45:20 - (cubicweb.web) WARNING: [3.17] igeocoding extracted to cube geocoding that was not found. try installing it.
2016-03-15 17:45:20 - (cubicweb.web) WARNING: [3.17] embedding extracted to cube embed that was not found. try installing it.
2016-03-15 17:45:20 - (cubicweb.web) WARNING: [3.17] isioc extracted to cube sioc that was not found. try installing it.
2016-03-15 17:45:31 - (cubicweb.session) WARNING: closing already closed session admin22f63f9970e4407392878fdfebbcaebb
.2016-03-15 17:45:35 - (cubicweb.session) WARNING: closing already closed session admin97ceebe7b08a4f69a1529aeeab3dd41e
.
========================= unittest_i18n.py =========================
.
======================= unittest_webtest.py ========================
2016-03-15 17:45:39 - (cubicweb.session) WARNING: closing already closed session admin8e59ee9a9bdc4e2ba042a8158d20f15c
.2016-03-15 17:45:39 - (cubicweb.session) WARNING: closing already closed session admin833a8302bfb8418697b075c3b51148b6
.2016-03-15 17:45:40 - (cubicweb.session) WARNING: closing already closed session admin929229e1fe6e4e358699b7f0218e2df0
.2016-03-15 17:45:41 - (cubicweb.session) WARNING: closing already closed session adminc758fe1c15ab48bb9c8a0bb36ce57b75
.
========================= unittest_fill.py =========================
...
======================= unittest_httptest.py =======================
2016-03-15 17:45:44 - (cubicweb.session) WARNING: closing already closed session admin8002ba0c552e464a94f28b5dab30ccf6
F2016-03-15 17:45:45 - (cubicweb.session) WARNING: closing already closed session admin6592d4deb77e4a0cb84548338fde672d
.2016-03-15 17:45:45 - (cubicweb.session) WARNING: closing already closed session admin833715689a54456aac7e79d7ea5d5572
F2016-03-15 17:45:46 - (cubicweb.session) WARNING: closing already closed session adminf9892a92523e4c9ea1c6fb329e3489d0
S2016-03-15 17:45:47 - (cubicweb.session) WARNING: closing already closed session admin3756d69553c54746a33d46ea6659072b
F127.0.0.1 - - [15/Mar/2016 17:45:50] "GET / HTTP/1.1" 200 6169
2016-03-15 17:45:50 - (cubicweb.session) WARNING: closing already closed session admin84052710f8964dbe8ee33f0ce54d21fd
.127.0.0.1 - - [15/Mar/2016 17:45:52] "GET / HTTP/1.1" 200 6169
2016-03-15 17:45:52 - (cubicweb.session) WARNING: closing already closed session admin921088ba52eb4624bfe2a0896e222cc9
.127.0.0.1 - - [15/Mar/2016 17:45:53] "GET / HTTP/1.1" 200 6169
2016-03-15 17:45:53 - (cubicweb.session) WARNING: closing already closed session admin082d4b1d9ac944cc8d5f6a42d99b0b49
.127.0.0.1 - - [15/Mar/2016 17:45:54] "GET / HTTP/1.1" 403 3887
127.0.0.1 - - [15/Mar/2016 17:45:55] "GET /login?__login=admin&__password=gingkow HTTP/1.1" 303 0
127.0.0.1 - - [15/Mar/2016 17:45:55] "GET / HTTP/1.1" 200 5964
127.0.0.1 - - [15/Mar/2016 17:45:55] "GET /logout HTTP/1.1" 303 0
127.0.0.1 - - [15/Mar/2016 17:45:55] "GET / HTTP/1.1" 403 3887
2016-03-15 17:45:55 - (cubicweb.session) WARNING: closing already closed session adminc470618edd684d7495efeef182aedf23
.127.0.0.1 - - [15/Mar/2016 17:45:55] "GET / HTTP/1.1" 403 3887
2016-03-15 17:45:55 - (cubicweb.session) WARNING: closing already closed session admin980eb65749a443d493571fbd6e7a14de
.
======================================================================
FAIL: test_base_url (unittest_httptest.TwistedCWAnonTC)
----------------------------------------------------------------------
Traceback (most recent call last)
File "/var/lib/jenkins/jobs/cubicweb-3.23/workspace/TOXENV/py27-devtools/.tox/py27-devtools/local/lib/python2.7/site-packages/unittest2/case.py", line 67, in testPartExecutor
yield
File "/var/lib/jenkins/jobs/cubicweb-3.23/workspace/TOXENV/py27-devtools/.tox/py27-devtools/local/lib/python2.7/site-packages/unittest2/case.py", line 625, in run
testMethod()
File "/var/lib/jenkins/jobs/cubicweb-3.23/workspace/TOXENV/py27-devtools/cubicweb/devtools/test/unittest_httptest.py", line 40, in test_base_url
self.fail('no mention of base url in retrieved page')
File "/var/lib/jenkins/jobs/cubicweb-3.23/workspace/TOXENV/py27-devtools/.tox/py27-devtools/local/lib/python2.7/site-packages/unittest2/case.py", line 690, in fail
raise self.failureException(msg)
AssertionError: no mention of base url in retrieved page

no stdout
no stderr
======================================================================
FAIL: test_response_anon (unittest_httptest.TwistedCWAnonTC)
----------------------------------------------------------------------
Traceback (most recent call last)
File "/var/lib/jenkins/jobs/cubicweb-3.23/workspace/TOXENV/py27-devtools/.tox/py27-devtools/local/lib/python2.7/site-packages/unittest2/case.py", line 67, in testPartExecutor
yield
File "/var/lib/jenkins/jobs/cubicweb-3.23/workspace/TOXENV/py27-devtools/.tox/py27-devtools/local/lib/python2.7/site-packages/unittest2/case.py", line 625, in run
testMethod()
File "/var/lib/jenkins/jobs/cubicweb-3.23/workspace/TOXENV/py27-devtools/cubicweb/devtools/test/unittest_httptest.py", line 36, in test_response_anon
self.assertEqual(response.status, http_client.OK)
File "/var/lib/jenkins/jobs/cubicweb-3.23/workspace/TOXENV/py27-devtools/.tox/py27-devtools/local/lib/python2.7/site-packages/unittest2/case.py", line 836, in assertEqual
assertion_func(first, second, msg=msg)
File "/var/lib/jenkins/jobs/cubicweb-3.23/workspace/TOXENV/py27-devtools/.tox/py27-devtools/local/lib/python2.7/site-packages/unittest2/case.py", line 829, in _baseAssertEqual
raise self.failureException(msg)
AssertionError: 500 != 200

no stdout
no stderr
======================================================================
FAIL: test_response_denied (unittest_httptest.TwistedCWIdentTC)
----------------------------------------------------------------------
Traceback (most recent call last)
File "/var/lib/jenkins/jobs/cubicweb-3.23/workspace/TOXENV/py27-devtools/.tox/py27-devtools/local/lib/python2.7/site-packages/unittest2/case.py", line 67, in testPartExecutor
yield
File "/var/lib/jenkins/jobs/cubicweb-3.23/workspace/TOXENV/py27-devtools/.tox/py27-devtools/local/lib/python2.7/site-packages/unittest2/case.py", line 625, in run
testMethod()
File "/var/lib/jenkins/jobs/cubicweb-3.23/workspace/TOXENV/py27-devtools/cubicweb/devtools/test/unittest_httptest.py", line 50, in test_response_denied
self.assertEqual(response.status, http_client.FORBIDDEN)
File "/var/lib/jenkins/jobs/cubicweb-3.23/workspace/TOXENV/py27-devtools/.tox/py27-devtools/local/lib/python2.7/site-packages/unittest2/case.py", line 836, in assertEqual
assertion_func(first, second, msg=msg)
File "/var/lib/jenkins/jobs/cubicweb-3.23/workspace/TOXENV/py27-devtools/.tox/py27-devtools/local/lib/python2.7/site-packages/unittest2/case.py", line 829, in _baseAssertEqual
raise self.failureException(msg)
AssertionError: 500 != 403

no stdout
no stderr
======================================================================
SKIPPED: test_login (unittest_httptest.TwistedCWIdentTC)
Already authenticated, "test_response_denied" must have failed
======================= unittest_testlib.py ========================
2016-03-15 17:45:56 - (cubicweb.session) WARNING: closing already closed session admin8db3fa11b1fb48b58137e336379e12be
.2016-03-15 17:45:56 - (cubicweb.session) WARNING: closing already closed session adminf2d3cfd6054a4c8cb053ce25b464a1fe
.2016-03-15 17:45:56 - (cubicweb.session) WARNING: closing already closed session adminad9dd6859db94f72a31b448002b93f06
.2016-03-15 17:45:56 - (cubicweb.session) WARNING: closing already closed session admin19b53c6689314e64bbc4c09898c01bb0
.2016-03-15 17:45:56 - (cubicweb.session) WARNING: closing already closed session admin615db03272164762bd3c9c5c944913d8
...........2016-03-15 17:45:57 - (cubicweb.session) WARNING: closing already closed session admin22ad6d178b1f420b8a757284c7bd8bb9
.2016-03-15 17:45:57 - (cubicweb.session) WARNING: closing already closed session adminb3759cd7c6954f6782363430fb21032f
.2016-03-15 17:45:57 - (cubicweb.session) WARNING: closing already closed session admina03a5516a9a14d8c9879c243759befa0
2016-03-15 17:45:57 - (cubicweb.session) WARNING: closing already closed session admindd83e64ce0f24c15bfd403672c549901
.2016-03-15 17:45:57 - (cubicweb.session) WARNING: closing already closed session admin19281ef5ab8d4d5cbc19c10a153a1bf0
.2016-03-15 17:45:57 - (cubicweb.session) WARNING: closing already closed session admin7761a78107c348aca666d65c73913c78
.2016-03-15 17:45:59 - (cubicweb.session) WARNING: closing already closed session adminfa060519fe9c4cc6b1ab1ddb401facdc
.2016-03-15 17:45:59 - (cubicweb.session) WARNING: closing already closed session admin4e5b427edde148bdba16e8d6cde00a11
2016-03-15 17:45:59 - (cubicweb.session) WARNING: closing already closed session adminaf20538271bb4924a79f7c33a32780cf
.
======================== unittest_devctl.py ========================
..
-> creating tables
-> inserting default user and default groups.
-> storing the schema in the database
-> database for instance data initialized.
Building webtest-ident for database tmpdb
Building httptest-cwident for database tmpdb
Building RepoInstancesConsistencyTC for database tmpdb
*******************************************************************************
Ran 52 test cases in 55.26s (40.89s CPU), 3 failures, 2 skipped
7 modules OK (1 failed)
failures: /var/lib/jenkins/jobs/cubicweb-3.23/workspace/TOXENV/py27-devtools/cubicweb/devtools/test/unittest_httptest [3/10]
ERROR: InvocationError: '/var/lib/jenkins/jobs/cubicweb-3.23/workspace/TOXENV/py27-devtools/.tox/py27-devtools/bin/python -c from logilab.common import pytest; pytest.run() -t /var/lib/jenkins/jobs/cubicweb-3.23/workspace/TOXENV/py27-devtools/cubicweb/devtools/test'
___________________________________ summary ____________________________________
ERROR: py27-devtools: commands failed
Build step 'Execute shell' marked build as failure
Sending e-mails to: dlaxalde@logilab.fr jcr@logilab.fr syt@logilab.fr david@logilab.fr
[PostBuildScript] - Execution post build scripts.
[py27-devtools] $ /bin/bash -xe /tmp/hudson2070706977575031239.sh
+ /var/lib/jenkins/scripts/notify_forge_apycot.py cwo cubicweb 27253355de86 http://jenkins.logilab.fr/job/cubicweb-3.23/TOXENV=py27-devtools/74/ --status failure
<br/>

log from execution
download