consoleText

download

20 Started by upstream project "cubicweb-3.23" build number 81
originally caused by:
Started by an SCM change
Building in workspace /var/lib/jenkins/jobs/cubicweb-3.23/workspace/TOXENV/py34-devtools
[py34-devtools] $ hg showconfig paths.default
[py34-devtools] $ hg pull
pulling from http://hg.logilab.org/review/cubicweb
searching for changes
adding changesets
adding manifests
adding file changes
added 4 changesets with 10 changes to 8 files (+3 heads)
10 new obsolescence markers
(run 'hg heads .' to see heads, 'hg merge' to merge)
[py34-devtools] $ hg update --clean --rev 69aa09ec38d545147b152e6fd12b5ce495a4f053
12 files updated, 0 files merged, 0 files removed, 0 files unresolved
[py34-devtools] $ hg --config extensions.purge= clean --all
[py34-devtools] $ hg log --rev . --template {node}
[py34-devtools] $ hg log --rev . --template {rev}
[py34-devtools] $ hg id --branch
[py34-devtools] $ /bin/bash -xe /tmp/hudson8042315620087996605.sh
+ find . '(' -name 'pgdb*' -o -name 'tmpdb*' ')' -print0
+ xargs -0 rm -rf
[py34-devtools] $ /bin/bash -xe /tmp/hudson507344840585320943.sh
+ PATH=/usr/lib/postgresql/9.4/bin:/usr/local/bin:/usr/bin:/bin:/usr/local/games:/usr/games
+ tox --recreate
py34-devtools create: /var/lib/jenkins/jobs/cubicweb-3.23/workspace/TOXENV/py34-devtools/.tox/py34-devtools
py34-devtools installdeps: -e., -r/var/lib/jenkins/jobs/cubicweb-3.23/workspace/TOXENV/py34-devtools/cubicweb/devtools/test/requirements.txt
py34-devtools develop-inst: /var/lib/jenkins/jobs/cubicweb-3.23/workspace/TOXENV/py34-devtools
py34-devtools installed: You are using pip version 7.1.2, however version 8.1.0 is available.,You should consider upgrading via the 'pip install --upgrade pip' command.,beautifulsoup4==4.4.1,chardet==2.3.0,colorama==0.3.2,-e hg+http://hg.logilab.org/review/cubicweb@69aa09ec38d545147b152e6fd12b5ce495a4f053#egg=cubicweb-dev,cwclientlib==0.4.1,flake8==2.5.4,html2text==2016.1.8,html5lib==0.999,linecache2==1.0.0,logilab-common==1.2.0,logilab-constraint==0.6.0,logilab-database==1.15.0,logilab-mtconverter==0.9.0,lxml==3.5.0,Markdown==2.6.5,mccabe==0.4.0,passlib==1.6.5,pep8==1.7.0,psycopg2==2.5.4,py==1.4.25,pyasn1==0.1.7,pyflakes==0.8.1,python-apt==0.9.3.12,python-dateutil==2.5.0,python3-ldap==0.9.4.2,pytz==2016.1,requests==2.4.3,rql==0.34.0,six==1.8.0,tox==1.9.2,traceback2==1.4.0,Twisted==16.0.0,unattended-upgrades==0.1,unittest2==1.1.0,urllib3==1.9.1,virtualenv==1.11.6,waitress==0.8.10,WebOb==1.6.0,WebTest==2.0.20,wheel==0.24.0,yams==0.42.0,Yapps==2.2.0,Yapps2==2.2.0,zope.interface==4.1.3
py34-devtools runtests: PYTHONHASHSEED='160771712'
py34-devtools runtests: commands[0] | /var/lib/jenkins/jobs/cubicweb-3.23/workspace/TOXENV/py34-devtools/.tox/py34-devtools/bin/python -c from logilab.common import pytest; pytest.run() -t /var/lib/jenkins/jobs/cubicweb-3.23/workspace/TOXENV/py34-devtools/cubicweb/devtools/test
Traceback (most recent call last):
File "/var/lib/jenkins/jobs/cubicweb-3.23/workspace/TOXENV/py34-devtools/cubicweb/devtools/devctl.py", line 412, in update_cubes_catalogs
toedit = update_cube_catalogs(cubedir)
File "/var/lib/jenkins/jobs/cubicweb-3.23/workspace/TOXENV/py34-devtools/cubicweb/devtools/devctl.py", line 457, in update_cube_catalogs
generate_schema_pot(schemapotstream.write, cubedir)
File "/var/lib/jenkins/jobs/cubicweb-3.23/workspace/TOXENV/py34-devtools/cubicweb/devtools/devctl.py", line 129, in generate_schema_pot
vreg.set_schema(schema)
File "/var/lib/jenkins/jobs/cubicweb-3.23/workspace/TOXENV/py34-devtools/cubicweb/cwvreg.py", line 424, in set_schema
self.reload(self.config.appobjects_path(), force_reload=False)
File "/var/lib/jenkins/jobs/cubicweb-3.23/workspace/TOXENV/py34-devtools/cubicweb/cwvreg.py", line 474, in reload
self.register_objects(path)
File "/var/lib/jenkins/jobs/cubicweb-3.23/workspace/TOXENV/py34-devtools/cubicweb/cwvreg.py", line 519, in register_objects
path, self.config.extrapath)
File "/var/lib/jenkins/jobs/cubicweb-3.23/workspace/TOXENV/py34-devtools/.tox/py34-devtools/lib/python3.4/site-packages/logilab/common/registry.py", line 681, in register_objects
self.load_file(filepath, modname)
File "/var/lib/jenkins/jobs/cubicweb-3.23/workspace/TOXENV/py34-devtools/cubicweb/cwvreg.py", line 484, in load_file
return super(CWRegistryStore, self).load_file(filepath, modname)
File "/var/lib/jenkins/jobs/cubicweb-3.23/workspace/TOXENV/py34-devtools/.tox/py34-devtools/lib/python3.4/site-packages/logilab/common/registry.py", line 738, in load_file
module = load_module_from_name(modname)
File "/var/lib/jenkins/jobs/cubicweb-3.23/workspace/TOXENV/py34-devtools/.tox/py34-devtools/lib/python3.4/site-packages/logilab/common/modutils.py", line 125, in load_module_from_name
return load_module_from_modpath(dotted_name.split('.'), path, use_sys)
File "/var/lib/jenkins/jobs/cubicweb-3.23/workspace/TOXENV/py34-devtools/.tox/py34-devtools/lib/python3.4/site-packages/logilab/common/modutils.py", line 169, in load_module_from_modpath
module = load_module(curname, mp_file, mp_filename, mp_desc)
File "/var/lib/jenkins/jobs/cubicweb-3.23/workspace/TOXENV/py34-devtools/.tox/py34-devtools/lib/python3.4/imp.py", line 235, in load_module
return load_source(name, filename, file)
File "/var/lib/jenkins/jobs/cubicweb-3.23/workspace/TOXENV/py34-devtools/.tox/py34-devtools/lib/python3.4/imp.py", line 171, in load_source
module = methods.load()
File "<frozen importlib._bootstrap>", line 1220, in load
File "<frozen importlib._bootstrap>", line 1200, in _load_unlocked
File "<frozen importlib._bootstrap>", line 1129, in _exec
File "<frozen importlib._bootstrap>", line 1471, in exec_module
File "<frozen importlib._bootstrap>", line 321, in _call_with_frames_removed
File "/var/lib/jenkins/jobs/cubicweb-3.23/workspace/TOXENV/py34-devtools/cubicweb/sobjects/ldapparser.py", line 30, in <module>
from cubicweb.server.sources import datafeed
File "/var/lib/jenkins/jobs/cubicweb-3.23/workspace/TOXENV/py34-devtools/cubicweb/server/sources/datafeed.py", line 39, in <module>
from cubicweb.server.repository import preprocess_inlined_relations
File "/var/lib/jenkins/jobs/cubicweb-3.23/workspace/TOXENV/py34-devtools/cubicweb/server/repository.py", line 698
with cnx.security_enabled(read=False, write=False):
^
IndentationError: unindent does not match any outer indentation level
========================= unittest_i18n.py =========================
E
======================================================================
ERROR: test_i18ncube (unittest_i18n.cubePotGeneratorTC)
----------------------------------------------------------------------
Traceback (most recent call last)
File "/usr/lib/python3.4/unittest/case.py", line 58, in testPartExecutor
yield
File "/usr/lib/python3.4/unittest/case.py", line 577, in run
testMethod()
File "/var/lib/jenkins/jobs/cubicweb-3.23/workspace/TOXENV/py34-devtools/cubicweb/devtools/test/unittest_i18n.py", line 68, in test_i18ncube
env=env, stdout=devnull)
File "/usr/lib/python3.4/subprocess.py", line 561, in check_call
raise CalledProcessError(retcode, cmd)
subprocess.CalledProcessError: Command '['/var/lib/jenkins/jobs/cubicweb-3.23/workspace/TOXENV/py34-devtools/.tox/py34-devtools/bin/python', '-m', 'cubicweb', 'i18ncube', 'i18ntestcube']' returned non-zero exit status 2

no stdout
no stderr
======================== unittest_dbfill.py ========================
S........
======================================================================
SKIPPED: test_writeme (unittest_dbfill.ConstraintInsertionTC)
Test automatic insertion / Schema Constraints
========================= unittest_fill.py =========================
...
======================= unittest_testlib.py ========================
ESSSS..........ESSSSEF
======================================================================
ERROR: test_login (unittest_testlib.CWUtilitiesTC)
Calling login should not break hook control
----------------------------------------------------------------------
Traceback (most recent call last)
File "/usr/lib/python3.4/unittest/case.py", line 58, in testPartExecutor
yield
File "/usr/lib/python3.4/unittest/case.py", line 573, in run
self.setUp()
File "/var/lib/jenkins/jobs/cubicweb-3.23/workspace/TOXENV/py34-devtools/cubicweb/devtools/testlib.py", line 446, in setUp
self._init_repo()
File "/var/lib/jenkins/jobs/cubicweb-3.23/workspace/TOXENV/py34-devtools/cubicweb/devtools/testlib.py", line 354, in _init_repo
db_handler.build_db_cache(self.test_db_id, self.pre_setup_database)
File "/var/lib/jenkins/jobs/cubicweb-3.23/workspace/TOXENV/py34-devtools/cubicweb/devtools/__init__.py", line 492, in build_db_cache
self.init_test_database()
File "/var/lib/jenkins/jobs/cubicweb-3.23/workspace/TOXENV/py34-devtools/cubicweb/devtools/__init__.py", line 817, in init_test_database
init_config=self.init_config)
File "/var/lib/jenkins/jobs/cubicweb-3.23/workspace/TOXENV/py34-devtools/cubicweb/server/__init__.py", line 213, in init_repository
from cubicweb.server.repository import Repository
File "/var/lib/jenkins/jobs/cubicweb-3.23/workspace/TOXENV/py34-devtools/cubicweb/server/repository.py", line 698
with cnx.security_enabled(read=False, write=False):
^
IndentationError: unindent does not match any outer indentation level

no stdout
no stderr
======================================================================
ERROR: test_admin_access (unittest_testlib.RepoAccessTC)
----------------------------------------------------------------------
Traceback (most recent call last)
File "/usr/lib/python3.4/unittest/case.py", line 58, in testPartExecutor
yield
File "/usr/lib/python3.4/unittest/case.py", line 573, in run
self.setUp()
File "/var/lib/jenkins/jobs/cubicweb-3.23/workspace/TOXENV/py34-devtools/cubicweb/devtools/testlib.py", line 446, in setUp
self._init_repo()
File "/var/lib/jenkins/jobs/cubicweb-3.23/workspace/TOXENV/py34-devtools/cubicweb/devtools/testlib.py", line 354, in _init_repo
db_handler.build_db_cache(self.test_db_id, self.pre_setup_database)
File "/var/lib/jenkins/jobs/cubicweb-3.23/workspace/TOXENV/py34-devtools/cubicweb/devtools/__init__.py", line 492, in build_db_cache
self.init_test_database()
File "/var/lib/jenkins/jobs/cubicweb-3.23/workspace/TOXENV/py34-devtools/cubicweb/devtools/__init__.py", line 817, in init_test_database
init_config=self.init_config)
File "/var/lib/jenkins/jobs/cubicweb-3.23/workspace/TOXENV/py34-devtools/cubicweb/server/__init__.py", line 213, in init_repository
from cubicweb.server.repository import Repository
File "/var/lib/jenkins/jobs/cubicweb-3.23/workspace/TOXENV/py34-devtools/cubicweb/server/repository.py", line 698
with cnx.security_enabled(read=False, write=False):
^
IndentationError: unindent does not match any outer indentation level

no stdout
no stderr
======================================================================
ERROR: test_pre_setup (unittest_testlib.RepoInstancesConsistencyTC)
----------------------------------------------------------------------
Traceback (most recent call last)
File "/usr/lib/python3.4/unittest/case.py", line 58, in testPartExecutor
yield
File "/usr/lib/python3.4/unittest/case.py", line 573, in run
self.setUp()
File "/var/lib/jenkins/jobs/cubicweb-3.23/workspace/TOXENV/py34-devtools/cubicweb/devtools/testlib.py", line 446, in setUp
self._init_repo()
File "/var/lib/jenkins/jobs/cubicweb-3.23/workspace/TOXENV/py34-devtools/cubicweb/devtools/testlib.py", line 354, in _init_repo
db_handler.build_db_cache(self.test_db_id, self.pre_setup_database)
File "/var/lib/jenkins/jobs/cubicweb-3.23/workspace/TOXENV/py34-devtools/cubicweb/devtools/__init__.py", line 495, in build_db_cache
self.build_db_cache(DEFAULT_EMPTY_DB_ID)
File "/var/lib/jenkins/jobs/cubicweb-3.23/workspace/TOXENV/py34-devtools/cubicweb/devtools/__init__.py", line 492, in build_db_cache
self.init_test_database()
File "/var/lib/jenkins/jobs/cubicweb-3.23/workspace/TOXENV/py34-devtools/cubicweb/devtools/__init__.py", line 817, in init_test_database
init_config=self.init_config)
File "/var/lib/jenkins/jobs/cubicweb-3.23/workspace/TOXENV/py34-devtools/cubicweb/server/__init__.py", line 213, in init_repository
from cubicweb.server.repository import Repository
File "/var/lib/jenkins/jobs/cubicweb-3.23/workspace/TOXENV/py34-devtools/cubicweb/server/repository.py", line 698
with cnx.security_enabled(read=False, write=False):
^
IndentationError: unindent does not match any outer indentation level

no stdout
no stderr
======================================================================
FAIL: test_error_raised (unittest_testlib.WebTestTC)
----------------------------------------------------------------------
Traceback (most recent call last)
File "/var/lib/jenkins/jobs/cubicweb-3.23/workspace/TOXENV/py34-devtools/.tox/py34-devtools/lib/python3.4/site-packages/logilab/common/testlib.py", line 497, in _proceed
testfunc(*args, **kwargs)
File "/var/lib/jenkins/jobs/cubicweb-3.23/workspace/TOXENV/py34-devtools/cubicweb/devtools/test/unittest_testlib.py", line 73, in test_error_raised
self.assertEqual(len(result.errors), 0)
File "/usr/lib/python3.4/unittest/case.py", line 797, in assertEqual
assertion_func(first, second, msg=msg)
File "/usr/lib/python3.4/unittest/case.py", line 790, in _baseAssertEqual
raise self.failureException(msg)
AssertionError: 1 != 0

no stdout
no stderr
======================================================================
SKIPPED: test_temporary_appobjects_registered (unittest_testlib.CWUtilitiesTC)
repository is not initialised: IndentationError('unindent does not match any outer indentation level', ('/var/lib/jenkins/jobs/cubicweb-3.23/workspace/TOXENV/py34-devtools/cubicweb/server/repository.py', 698, 64, ' with cnx.security_enabled(read=False, write=False):\n'))
======================================================================
SKIPPED: test_temporary_permissions_eschema (unittest_testlib.CWUtilitiesTC)
repository is not initialised: IndentationError('unindent does not match any outer indentation level', ('/var/lib/jenkins/jobs/cubicweb-3.23/workspace/TOXENV/py34-devtools/cubicweb/server/repository.py', 698, 64, ' with cnx.security_enabled(read=False, write=False):\n'))
======================================================================
SKIPPED: test_temporary_permissions_rdef (unittest_testlib.CWUtilitiesTC)
repository is not initialised: IndentationError('unindent does not match any outer indentation level', ('/var/lib/jenkins/jobs/cubicweb-3.23/workspace/TOXENV/py34-devtools/cubicweb/server/repository.py', 698, 64, ' with cnx.security_enabled(read=False, write=False):\n'))
======================================================================
SKIPPED: test_temporary_permissions_rdef_with_exception (unittest_testlib.CWUtilitiesTC)
repository is not initialised: IndentationError('unindent does not match any outer indentation level', ('/var/lib/jenkins/jobs/cubicweb-3.23/workspace/TOXENV/py34-devtools/cubicweb/server/repository.py', 698, 64, ' with cnx.security_enabled(read=False, write=False):\n'))
======================================================================
SKIPPED: test_client_connection (unittest_testlib.RepoAccessTC)
repository is not initialised: IndentationError('unindent does not match any outer indentation level', ('/var/lib/jenkins/jobs/cubicweb-3.23/workspace/TOXENV/py34-devtools/cubicweb/server/repository.py', 698, 64, ' with cnx.security_enabled(read=False, write=False):\n'))
======================================================================
SKIPPED: test_close (unittest_testlib.RepoAccessTC)
repository is not initialised: IndentationError('unindent does not match any outer indentation level', ('/var/lib/jenkins/jobs/cubicweb-3.23/workspace/TOXENV/py34-devtools/cubicweb/server/repository.py', 698, 64, ' with cnx.security_enabled(read=False, write=False):\n'))
======================================================================
SKIPPED: test_repo_connection (unittest_testlib.RepoAccessTC)
repository is not initialised: IndentationError('unindent does not match any outer indentation level', ('/var/lib/jenkins/jobs/cubicweb-3.23/workspace/TOXENV/py34-devtools/cubicweb/server/repository.py', 698, 64, ' with cnx.security_enabled(read=False, write=False):\n'))
======================================================================
SKIPPED: test_web_request (unittest_testlib.RepoAccessTC)
repository is not initialised: IndentationError('unindent does not match any outer indentation level', ('/var/lib/jenkins/jobs/cubicweb-3.23/workspace/TOXENV/py34-devtools/cubicweb/server/repository.py', 698, 64, ' with cnx.security_enabled(read=False, write=False):\n'))
======================== unittest_qunit.py =========================
ES
======================================================================
ERROR: test_javascripts (unittest_qunit.QUnitTestCaseTC)
----------------------------------------------------------------------
Traceback (most recent call last)
File "/usr/lib/python3.4/unittest/case.py", line 58, in testPartExecutor
yield
File "/usr/lib/python3.4/unittest/case.py", line 573, in run
self.setUp()
File "/var/lib/jenkins/jobs/cubicweb-3.23/workspace/TOXENV/py34-devtools/cubicweb/devtools/qunit.py", line 85, in setUp
super(QUnitTestCase, self).setUp()
File "/var/lib/jenkins/jobs/cubicweb-3.23/workspace/TOXENV/py34-devtools/cubicweb/devtools/webtest.py", line 11, in setUp
super(CubicWebTestTC, self).setUp()
File "/var/lib/jenkins/jobs/cubicweb-3.23/workspace/TOXENV/py34-devtools/cubicweb/devtools/testlib.py", line 446, in setUp
self._init_repo()
File "/var/lib/jenkins/jobs/cubicweb-3.23/workspace/TOXENV/py34-devtools/cubicweb/devtools/testlib.py", line 354, in _init_repo
db_handler.build_db_cache(self.test_db_id, self.pre_setup_database)
File "/var/lib/jenkins/jobs/cubicweb-3.23/workspace/TOXENV/py34-devtools/cubicweb/devtools/__init__.py", line 492, in build_db_cache
self.init_test_database()
File "/var/lib/jenkins/jobs/cubicweb-3.23/workspace/TOXENV/py34-devtools/cubicweb/devtools/__init__.py", line 817, in init_test_database
init_config=self.init_config)
File "/var/lib/jenkins/jobs/cubicweb-3.23/workspace/TOXENV/py34-devtools/cubicweb/server/__init__.py", line 213, in init_repository
from cubicweb.server.repository import Repository
File "/var/lib/jenkins/jobs/cubicweb-3.23/workspace/TOXENV/py34-devtools/cubicweb/server/repository.py", line 698
with cnx.security_enabled(read=False, write=False):
^
IndentationError: unindent does not match any outer indentation level

no stdout
no stderr
======================================================================
SKIPPED: test_simple_failure (unittest_qunit.QUnitTestCaseTC)
repository is not initialised: IndentationError('unindent does not match any outer indentation level', ('/var/lib/jenkins/jobs/cubicweb-3.23/workspace/TOXENV/py34-devtools/cubicweb/server/repository.py', 698, 64, ' with cnx.security_enabled(read=False, write=False):\n'))
======================= unittest_webtest.py ========================
ESES
======================================================================
ERROR: test_login (unittest_webtest.CWTIdentTC)
----------------------------------------------------------------------
Traceback (most recent call last)
File "/usr/lib/python3.4/unittest/case.py", line 58, in testPartExecutor
yield
File "/usr/lib/python3.4/unittest/case.py", line 573, in run
self.setUp()
File "/var/lib/jenkins/jobs/cubicweb-3.23/workspace/TOXENV/py34-devtools/cubicweb/devtools/webtest.py", line 11, in setUp
super(CubicWebTestTC, self).setUp()
File "/var/lib/jenkins/jobs/cubicweb-3.23/workspace/TOXENV/py34-devtools/cubicweb/devtools/testlib.py", line 446, in setUp
self._init_repo()
File "/var/lib/jenkins/jobs/cubicweb-3.23/workspace/TOXENV/py34-devtools/cubicweb/devtools/testlib.py", line 354, in _init_repo
db_handler.build_db_cache(self.test_db_id, self.pre_setup_database)
File "/var/lib/jenkins/jobs/cubicweb-3.23/workspace/TOXENV/py34-devtools/cubicweb/devtools/__init__.py", line 495, in build_db_cache
self.build_db_cache(DEFAULT_EMPTY_DB_ID)
File "/var/lib/jenkins/jobs/cubicweb-3.23/workspace/TOXENV/py34-devtools/cubicweb/devtools/__init__.py", line 492, in build_db_cache
self.init_test_database()
File "/var/lib/jenkins/jobs/cubicweb-3.23/workspace/TOXENV/py34-devtools/cubicweb/devtools/__init__.py", line 817, in init_test_database
init_config=self.init_config)
File "/var/lib/jenkins/jobs/cubicweb-3.23/workspace/TOXENV/py34-devtools/cubicweb/server/__init__.py", line 213, in init_repository
from cubicweb.server.repository import Repository
File "/var/lib/jenkins/jobs/cubicweb-3.23/workspace/TOXENV/py34-devtools/cubicweb/server/repository.py", line 698
with cnx.security_enabled(read=False, write=False):
^
IndentationError: unindent does not match any outer indentation level

no stdout
no stderr
======================================================================
ERROR: test_base_url (unittest_webtest.CWTTC)
----------------------------------------------------------------------
Traceback (most recent call last)
File "/usr/lib/python3.4/unittest/case.py", line 58, in testPartExecutor
yield
File "/usr/lib/python3.4/unittest/case.py", line 573, in run
self.setUp()
File "/var/lib/jenkins/jobs/cubicweb-3.23/workspace/TOXENV/py34-devtools/cubicweb/devtools/webtest.py", line 11, in setUp
super(CubicWebTestTC, self).setUp()
File "/var/lib/jenkins/jobs/cubicweb-3.23/workspace/TOXENV/py34-devtools/cubicweb/devtools/testlib.py", line 446, in setUp
self._init_repo()
File "/var/lib/jenkins/jobs/cubicweb-3.23/workspace/TOXENV/py34-devtools/cubicweb/devtools/testlib.py", line 354, in _init_repo
db_handler.build_db_cache(self.test_db_id, self.pre_setup_database)
File "/var/lib/jenkins/jobs/cubicweb-3.23/workspace/TOXENV/py34-devtools/cubicweb/devtools/__init__.py", line 492, in build_db_cache
self.init_test_database()
File "/var/lib/jenkins/jobs/cubicweb-3.23/workspace/TOXENV/py34-devtools/cubicweb/devtools/__init__.py", line 817, in init_test_database
init_config=self.init_config)
File "/var/lib/jenkins/jobs/cubicweb-3.23/workspace/TOXENV/py34-devtools/cubicweb/server/__init__.py", line 213, in init_repository
from cubicweb.server.repository import Repository
File "/var/lib/jenkins/jobs/cubicweb-3.23/workspace/TOXENV/py34-devtools/cubicweb/server/repository.py", line 698
with cnx.security_enabled(read=False, write=False):
^
IndentationError: unindent does not match any outer indentation level

no stdout
no stderr
======================================================================
SKIPPED: test_reponse_denied (unittest_webtest.CWTIdentTC)
repository is not initialised: IndentationError('unindent does not match any outer indentation level', ('/var/lib/jenkins/jobs/cubicweb-3.23/workspace/TOXENV/py34-devtools/cubicweb/server/repository.py', 698, 64, ' with cnx.security_enabled(read=False, write=False):\n'))
======================================================================
SKIPPED: test_response (unittest_webtest.CWTTC)
repository is not initialised: IndentationError('unindent does not match any outer indentation level', ('/var/lib/jenkins/jobs/cubicweb-3.23/workspace/TOXENV/py34-devtools/cubicweb/server/repository.py', 698, 64, ' with cnx.security_enabled(read=False, write=False):\n'))
======================== unittest_devctl.py ========================
..
======================= unittest_httptest.py =======================
ESSESESSES
======================================================================
ERROR: test_base_url (unittest_httptest.TwistedCWAnonTC)
----------------------------------------------------------------------
Traceback (most recent call last)
File "/usr/lib/python3.4/unittest/case.py", line 58, in testPartExecutor
yield
File "/usr/lib/python3.4/unittest/case.py", line 573, in run
self.setUp()
File "/var/lib/jenkins/jobs/cubicweb-3.23/workspace/TOXENV/py34-devtools/cubicweb/devtools/httptest.py", line 121, in setUp
super(_CubicWebServerTC, self).setUp()
File "/var/lib/jenkins/jobs/cubicweb-3.23/workspace/TOXENV/py34-devtools/cubicweb/devtools/testlib.py", line 446, in setUp
self._init_repo()
File "/var/lib/jenkins/jobs/cubicweb-3.23/workspace/TOXENV/py34-devtools/cubicweb/devtools/testlib.py", line 354, in _init_repo
db_handler.build_db_cache(self.test_db_id, self.pre_setup_database)
File "/var/lib/jenkins/jobs/cubicweb-3.23/workspace/TOXENV/py34-devtools/cubicweb/devtools/__init__.py", line 492, in build_db_cache
self.init_test_database()
File "/var/lib/jenkins/jobs/cubicweb-3.23/workspace/TOXENV/py34-devtools/cubicweb/devtools/__init__.py", line 817, in init_test_database
init_config=self.init_config)
File "/var/lib/jenkins/jobs/cubicweb-3.23/workspace/TOXENV/py34-devtools/cubicweb/server/__init__.py", line 213, in init_repository
from cubicweb.server.repository import Repository
File "/var/lib/jenkins/jobs/cubicweb-3.23/workspace/TOXENV/py34-devtools/cubicweb/server/repository.py", line 698
with cnx.security_enabled(read=False, write=False):
^
IndentationError: unindent does not match any outer indentation level

no stdout
no stderr
======================================================================
ERROR: test_login (unittest_httptest.TwistedCWIdentTC)
----------------------------------------------------------------------
Traceback (most recent call last)
File "/usr/lib/python3.4/unittest/case.py", line 58, in testPartExecutor
yield
File "/usr/lib/python3.4/unittest/case.py", line 573, in run
self.setUp()
File "/var/lib/jenkins/jobs/cubicweb-3.23/workspace/TOXENV/py34-devtools/cubicweb/devtools/httptest.py", line 121, in setUp
super(_CubicWebServerTC, self).setUp()
File "/var/lib/jenkins/jobs/cubicweb-3.23/workspace/TOXENV/py34-devtools/cubicweb/devtools/testlib.py", line 446, in setUp
self._init_repo()
File "/var/lib/jenkins/jobs/cubicweb-3.23/workspace/TOXENV/py34-devtools/cubicweb/devtools/testlib.py", line 354, in _init_repo
db_handler.build_db_cache(self.test_db_id, self.pre_setup_database)
File "/var/lib/jenkins/jobs/cubicweb-3.23/workspace/TOXENV/py34-devtools/cubicweb/devtools/__init__.py", line 495, in build_db_cache
self.build_db_cache(DEFAULT_EMPTY_DB_ID)
File "/var/lib/jenkins/jobs/cubicweb-3.23/workspace/TOXENV/py34-devtools/cubicweb/devtools/__init__.py", line 492, in build_db_cache
self.init_test_database()
File "/var/lib/jenkins/jobs/cubicweb-3.23/workspace/TOXENV/py34-devtools/cubicweb/devtools/__init__.py", line 817, in init_test_database
init_config=self.init_config)
File "/var/lib/jenkins/jobs/cubicweb-3.23/workspace/TOXENV/py34-devtools/cubicweb/server/__init__.py", line 213, in init_repository
from cubicweb.server.repository import Repository
File "/var/lib/jenkins/jobs/cubicweb-3.23/workspace/TOXENV/py34-devtools/cubicweb/server/repository.py", line 698
with cnx.security_enabled(read=False, write=False):
^
IndentationError: unindent does not match any outer indentation level

no stdout
no stderr
======================================================================
ERROR: test_base_url (unittest_httptest.WsgiCWAnonTC)
----------------------------------------------------------------------
Traceback (most recent call last)
File "/usr/lib/python3.4/unittest/case.py", line 58, in testPartExecutor
yield
File "/usr/lib/python3.4/unittest/case.py", line 573, in run
self.setUp()
File "/var/lib/jenkins/jobs/cubicweb-3.23/workspace/TOXENV/py34-devtools/cubicweb/devtools/httptest.py", line 121, in setUp
super(_CubicWebServerTC, self).setUp()
File "/var/lib/jenkins/jobs/cubicweb-3.23/workspace/TOXENV/py34-devtools/cubicweb/devtools/testlib.py", line 446, in setUp
self._init_repo()
File "/var/lib/jenkins/jobs/cubicweb-3.23/workspace/TOXENV/py34-devtools/cubicweb/devtools/testlib.py", line 354, in _init_repo
db_handler.build_db_cache(self.test_db_id, self.pre_setup_database)
File "/var/lib/jenkins/jobs/cubicweb-3.23/workspace/TOXENV/py34-devtools/cubicweb/devtools/__init__.py", line 492, in build_db_cache
self.init_test_database()
File "/var/lib/jenkins/jobs/cubicweb-3.23/workspace/TOXENV/py34-devtools/cubicweb/devtools/__init__.py", line 817, in init_test_database
init_config=self.init_config)
File "/var/lib/jenkins/jobs/cubicweb-3.23/workspace/TOXENV/py34-devtools/cubicweb/server/__init__.py", line 213, in init_repository
from cubicweb.server.repository import Repository
File "/var/lib/jenkins/jobs/cubicweb-3.23/workspace/TOXENV/py34-devtools/cubicweb/server/repository.py", line 698
with cnx.security_enabled(read=False, write=False):
^
IndentationError: unindent does not match any outer indentation level

no stdout
no stderr
======================================================================
ERROR: test_login (unittest_httptest.WsgiCWIdentTC)
----------------------------------------------------------------------
Traceback (most recent call last)
File "/usr/lib/python3.4/unittest/case.py", line 58, in testPartExecutor
yield
File "/usr/lib/python3.4/unittest/case.py", line 573, in run
self.setUp()
File "/var/lib/jenkins/jobs/cubicweb-3.23/workspace/TOXENV/py34-devtools/cubicweb/devtools/httptest.py", line 121, in setUp
super(_CubicWebServerTC, self).setUp()
File "/var/lib/jenkins/jobs/cubicweb-3.23/workspace/TOXENV/py34-devtools/cubicweb/devtools/testlib.py", line 446, in setUp
self._init_repo()
File "/var/lib/jenkins/jobs/cubicweb-3.23/workspace/TOXENV/py34-devtools/cubicweb/devtools/testlib.py", line 354, in _init_repo
db_handler.build_db_cache(self.test_db_id, self.pre_setup_database)
File "/var/lib/jenkins/jobs/cubicweb-3.23/workspace/TOXENV/py34-devtools/cubicweb/devtools/__init__.py", line 495, in build_db_cache
self.build_db_cache(DEFAULT_EMPTY_DB_ID)
File "/var/lib/jenkins/jobs/cubicweb-3.23/workspace/TOXENV/py34-devtools/cubicweb/devtools/__init__.py", line 492, in build_db_cache
self.init_test_database()
File "/var/lib/jenkins/jobs/cubicweb-3.23/workspace/TOXENV/py34-devtools/cubicweb/devtools/__init__.py", line 817, in init_test_database
init_config=self.init_config)
File "/var/lib/jenkins/jobs/cubicweb-3.23/workspace/TOXENV/py34-devtools/cubicweb/server/__init__.py", line 213, in init_repository
from cubicweb.server.repository import Repository
File "/var/lib/jenkins/jobs/cubicweb-3.23/workspace/TOXENV/py34-devtools/cubicweb/server/repository.py", line 698
with cnx.security_enabled(read=False, write=False):
^
IndentationError: unindent does not match any outer indentation level

no stdout
no stderr
======================================================================
SKIPPED: test_response (unittest_httptest.TwistedCWAnonTC)
repository is not initialised: IndentationError('unindent does not match any outer indentation level', ('/var/lib/jenkins/jobs/cubicweb-3.23/workspace/TOXENV/py34-devtools/cubicweb/server/repository.py', 698, 64, ' with cnx.security_enabled(read=False, write=False):\n'))
======================================================================
SKIPPED: test_response_anon (unittest_httptest.TwistedCWAnonTC)
repository is not initialised: IndentationError('unindent does not match any outer indentation level', ('/var/lib/jenkins/jobs/cubicweb-3.23/workspace/TOXENV/py34-devtools/cubicweb/server/repository.py', 698, 64, ' with cnx.security_enabled(read=False, write=False):\n'))
======================================================================
SKIPPED: test_response_denied (unittest_httptest.TwistedCWIdentTC)
repository is not initialised: IndentationError('unindent does not match any outer indentation level', ('/var/lib/jenkins/jobs/cubicweb-3.23/workspace/TOXENV/py34-devtools/cubicweb/server/repository.py', 698, 64, ' with cnx.security_enabled(read=False, write=False):\n'))
======================================================================
SKIPPED: test_response (unittest_httptest.WsgiCWAnonTC)
repository is not initialised: IndentationError('unindent does not match any outer indentation level', ('/var/lib/jenkins/jobs/cubicweb-3.23/workspace/TOXENV/py34-devtools/cubicweb/server/repository.py', 698, 64, ' with cnx.security_enabled(read=False, write=False):\n'))
======================================================================
SKIPPED: test_response_anon (unittest_httptest.WsgiCWAnonTC)
repository is not initialised: IndentationError('unindent does not match any outer indentation level', ('/var/lib/jenkins/jobs/cubicweb-3.23/workspace/TOXENV/py34-devtools/cubicweb/server/repository.py', 698, 64, ' with cnx.security_enabled(read=False, write=False):\n'))
======================================================================
SKIPPED: test_response_denied (unittest_httptest.WsgiCWIdentTC)
repository is not initialised: IndentationError('unindent does not match any outer indentation level', ('/var/lib/jenkins/jobs/cubicweb-3.23/workspace/TOXENV/py34-devtools/cubicweb/server/repository.py', 698, 64, ' with cnx.security_enabled(read=False, write=False):\n'))
Building RepoInstancesConsistencyTC for database tmpdb
Building webtest-ident for database tmpdb
Building httptest-cwident for database tmpdb
Building httptest-cwident for database tmpdb
*******************************************************************************
Ran 52 test cases in 3.90s (2.07s CPU), 11 errors, 1 failures, 18 skipped
3 modules OK (5 failed)
failures: /var/lib/jenkins/jobs/cubicweb-3.23/workspace/TOXENV/py34-devtools/cubicweb/devtools/test/unittest_i18n [1/1], /var/lib/jenkins/jobs/cubicweb-3.23/workspace/TOXENV/py34-devtools/cubicweb/devtools/test/unittest_testlib [4/22], /var/lib/jenkins/jobs/cubicweb-3.23/workspace/TOXENV/py34-devtools/cubicweb/devtools/test/unittest_qunit [1/2], /var/lib/jenkins/jobs/cubicweb-3.23/workspace/TOXENV/py34-devtools/cubicweb/devtools/test/unittest_webtest [2/4], /var/lib/jenkins/jobs/cubicweb-3.23/workspace/TOXENV/py34-devtools/cubicweb/devtools/test/unittest_httptest [4/10]
ERROR: InvocationError: '/var/lib/jenkins/jobs/cubicweb-3.23/workspace/TOXENV/py34-devtools/.tox/py34-devtools/bin/python -c from logilab.common import pytest; pytest.run() -t /var/lib/jenkins/jobs/cubicweb-3.23/workspace/TOXENV/py34-devtools/cubicweb/devtools/test'
___________________________________ summary ____________________________________
ERROR: py34-devtools: commands failed
Build step 'Execute shell' marked build as failure
Sending e-mails to: dlaxalde@logilab.fr jcr@logilab.fr syt@logilab.fr david@logilab.fr
[PostBuildScript] - Execution post build scripts.
[py34-devtools] $ /bin/bash -xe /tmp/hudson5282322678119238525.sh
+ /var/lib/jenkins/scripts/notify_forge_apycot.py cwo cubicweb 69aa09ec38d5 http://jenkins.logilab.fr/job/cubicweb-3.23/TOXENV=py34-devtools/81/ --status failure
<br/>

log from execution
download