consoleText

download

20 Started by upstream project "cubicweb-3.23" build number 81
originally caused by:
Started by an SCM change
Building in workspace /var/lib/jenkins/jobs/cubicweb-3.23/workspace/TOXENV/py34-entities
[py34-entities] $ hg showconfig paths.default
[py34-entities] $ hg pull
pulling from http://hg.logilab.org/review/cubicweb
searching for changes
adding changesets
adding manifests
adding file changes
added 4 changesets with 10 changes to 8 files (+3 heads)
10 new obsolescence markers
(run 'hg heads .' to see heads, 'hg merge' to merge)
[py34-entities] $ hg update --clean --rev 69aa09ec38d545147b152e6fd12b5ce495a4f053
12 files updated, 0 files merged, 0 files removed, 0 files unresolved
[py34-entities] $ hg --config extensions.purge= clean --all
[py34-entities] $ hg log --rev . --template {node}
[py34-entities] $ hg log --rev . --template {rev}
[py34-entities] $ hg id --branch
[py34-entities] $ /bin/bash -xe /tmp/hudson1180461931601178048.sh
+ find . '(' -name 'pgdb*' -o -name 'tmpdb*' ')' -print0
+ xargs -0 rm -rf
[py34-entities] $ /bin/bash -xe /tmp/hudson8037137884642707802.sh
+ PATH=/usr/lib/postgresql/9.4/bin:/usr/local/bin:/usr/bin:/bin:/usr/local/games:/usr/games
+ tox --recreate
py34-entities create: /var/lib/jenkins/jobs/cubicweb-3.23/workspace/TOXENV/py34-entities/.tox/py34-entities
py34-entities installdeps: -e., -r/var/lib/jenkins/jobs/cubicweb-3.23/workspace/TOXENV/py34-entities/cubicweb/entities/test/requirements.txt
py34-entities develop-inst: /var/lib/jenkins/jobs/cubicweb-3.23/workspace/TOXENV/py34-entities
py34-entities installed: You are using pip version 7.1.2, however version 8.1.0 is available.,You should consider upgrading via the 'pip install --upgrade pip' command.,chardet==2.3.0,colorama==0.3.2,-e hg+http://hg.logilab.org/review/cubicweb@69aa09ec38d545147b152e6fd12b5ce495a4f053#egg=cubicweb-dev,cwclientlib==0.4.1,docutils==0.12,html2text==2016.1.8,html5lib==0.999,linecache2==1.0.0,logilab-common==1.2.0,logilab-constraint==0.6.0,logilab-database==1.15.0,logilab-mtconverter==0.9.0,lxml==3.5.0,Markdown==2.6.5,passlib==1.6.5,psycopg2==2.5.4,py==1.4.25,pyasn1==0.1.7,pyflakes==0.8.1,python-apt==0.9.3.12,python-dateutil==2.5.0,python3-ldap==0.9.4.2,pytz==2016.1,requests==2.4.3,rql==0.34.0,six==1.8.0,tox==1.9.2,traceback2==1.4.0,unattended-upgrades==0.1,unittest2==1.1.0,urllib3==1.9.1,virtualenv==1.11.6,wheel==0.24.0,yams==0.42.0,Yapps==2.2.0,Yapps2==2.2.0
py34-entities runtests: PYTHONHASHSEED='2262066383'
py34-entities runtests: commands[0] | /var/lib/jenkins/jobs/cubicweb-3.23/workspace/TOXENV/py34-entities/.tox/py34-entities/bin/python -c from logilab.common import pytest; pytest.run() -t /var/lib/jenkins/jobs/cubicweb-3.23/workspace/TOXENV/py34-entities/cubicweb/entities/test
======================== unittest_wfobjs.py ========================
ESSESSSSESSESSESSSSSSSSSSSS
======================================================================
ERROR: test_auto_transition_custom_initial_state_fired (unittest_wfobjs.AutoTransitionTC)
----------------------------------------------------------------------
Traceback (most recent call last)
File "/usr/lib/python3.4/unittest/case.py", line 58, in testPartExecutor
yield
File "/usr/lib/python3.4/unittest/case.py", line 573, in run
self.setUp()
File "/var/lib/jenkins/jobs/cubicweb-3.23/workspace/TOXENV/py34-entities/cubicweb/devtools/testlib.py", line 446, in setUp
self._init_repo()
File "/var/lib/jenkins/jobs/cubicweb-3.23/workspace/TOXENV/py34-entities/cubicweb/devtools/testlib.py", line 354, in _init_repo
db_handler.build_db_cache(self.test_db_id, self.pre_setup_database)
File "/var/lib/jenkins/jobs/cubicweb-3.23/workspace/TOXENV/py34-entities/cubicweb/devtools/__init__.py", line 492, in build_db_cache
self.init_test_database()
File "/var/lib/jenkins/jobs/cubicweb-3.23/workspace/TOXENV/py34-entities/cubicweb/devtools/__init__.py", line 817, in init_test_database
init_config=self.init_config)
File "/var/lib/jenkins/jobs/cubicweb-3.23/workspace/TOXENV/py34-entities/cubicweb/server/__init__.py", line 213, in init_repository
from cubicweb.server.repository import Repository
File "/var/lib/jenkins/jobs/cubicweb-3.23/workspace/TOXENV/py34-entities/cubicweb/server/repository.py", line 698
with cnx.security_enabled(read=False, write=False):
^
IndentationError: unindent does not match any outer indentation level

no stdout
no stderr
======================================================================
ERROR: test_custom_wf_bad_etype (unittest_wfobjs.CustomWorkflowTC)
try to set a custom workflow which doesn't apply to entity type
----------------------------------------------------------------------
Traceback (most recent call last)
File "/usr/lib/python3.4/unittest/case.py", line 58, in testPartExecutor
yield
File "/usr/lib/python3.4/unittest/case.py", line 573, in run
self.setUp()
File "/var/lib/jenkins/jobs/cubicweb-3.23/workspace/TOXENV/py34-entities/cubicweb/devtools/testlib.py", line 446, in setUp
self._init_repo()
File "/var/lib/jenkins/jobs/cubicweb-3.23/workspace/TOXENV/py34-entities/cubicweb/devtools/testlib.py", line 354, in _init_repo
db_handler.build_db_cache(self.test_db_id, self.pre_setup_database)
File "/var/lib/jenkins/jobs/cubicweb-3.23/workspace/TOXENV/py34-entities/cubicweb/devtools/__init__.py", line 492, in build_db_cache
self.init_test_database()
File "/var/lib/jenkins/jobs/cubicweb-3.23/workspace/TOXENV/py34-entities/cubicweb/devtools/__init__.py", line 817, in init_test_database
init_config=self.init_config)
File "/var/lib/jenkins/jobs/cubicweb-3.23/workspace/TOXENV/py34-entities/cubicweb/server/__init__.py", line 213, in init_repository
from cubicweb.server.repository import Repository
File "/var/lib/jenkins/jobs/cubicweb-3.23/workspace/TOXENV/py34-entities/cubicweb/server/repository.py", line 698
with cnx.security_enabled(read=False, write=False):
^
IndentationError: unindent does not match any outer indentation level

no stdout
no stderr
======================================================================
ERROR: test_duplicated_state (unittest_wfobjs.WorkflowBuildingTC)
----------------------------------------------------------------------
Traceback (most recent call last)
File "/usr/lib/python3.4/unittest/case.py", line 58, in testPartExecutor
yield
File "/usr/lib/python3.4/unittest/case.py", line 573, in run
self.setUp()
File "/var/lib/jenkins/jobs/cubicweb-3.23/workspace/TOXENV/py34-entities/cubicweb/devtools/testlib.py", line 446, in setUp
self._init_repo()
File "/var/lib/jenkins/jobs/cubicweb-3.23/workspace/TOXENV/py34-entities/cubicweb/devtools/testlib.py", line 354, in _init_repo
db_handler.build_db_cache(self.test_db_id, self.pre_setup_database)
File "/var/lib/jenkins/jobs/cubicweb-3.23/workspace/TOXENV/py34-entities/cubicweb/devtools/__init__.py", line 492, in build_db_cache
self.init_test_database()
File "/var/lib/jenkins/jobs/cubicweb-3.23/workspace/TOXENV/py34-entities/cubicweb/devtools/__init__.py", line 817, in init_test_database
init_config=self.init_config)
File "/var/lib/jenkins/jobs/cubicweb-3.23/workspace/TOXENV/py34-entities/cubicweb/server/__init__.py", line 213, in init_repository
from cubicweb.server.repository import Repository
File "/var/lib/jenkins/jobs/cubicweb-3.23/workspace/TOXENV/py34-entities/cubicweb/server/repository.py", line 698
with cnx.security_enabled(read=False, write=False):
^
IndentationError: unindent does not match any outer indentation level

no stdout
no stderr
======================================================================
ERROR: test_transition_checking1 (unittest_wfobjs.WorkflowHooksTC)
----------------------------------------------------------------------
Traceback (most recent call last)
File "/usr/lib/python3.4/unittest/case.py", line 58, in testPartExecutor
yield
File "/usr/lib/python3.4/unittest/case.py", line 573, in run
self.setUp()
File "/var/lib/jenkins/jobs/cubicweb-3.23/workspace/TOXENV/py34-entities/cubicweb/entities/test/unittest_wfobjs.py", line 623, in setUp
CubicWebTC.setUp(self)
File "/var/lib/jenkins/jobs/cubicweb-3.23/workspace/TOXENV/py34-entities/cubicweb/devtools/testlib.py", line 446, in setUp
self._init_repo()
File "/var/lib/jenkins/jobs/cubicweb-3.23/workspace/TOXENV/py34-entities/cubicweb/devtools/testlib.py", line 354, in _init_repo
db_handler.build_db_cache(self.test_db_id, self.pre_setup_database)
File "/var/lib/jenkins/jobs/cubicweb-3.23/workspace/TOXENV/py34-entities/cubicweb/devtools/__init__.py", line 492, in build_db_cache
self.init_test_database()
File "/var/lib/jenkins/jobs/cubicweb-3.23/workspace/TOXENV/py34-entities/cubicweb/devtools/__init__.py", line 817, in init_test_database
init_config=self.init_config)
File "/var/lib/jenkins/jobs/cubicweb-3.23/workspace/TOXENV/py34-entities/cubicweb/server/__init__.py", line 213, in init_repository
from cubicweb.server.repository import Repository
File "/var/lib/jenkins/jobs/cubicweb-3.23/workspace/TOXENV/py34-entities/cubicweb/server/repository.py", line 698
with cnx.security_enabled(read=False, write=False):
^
IndentationError: unindent does not match any outer indentation level

no stdout
no stderr
======================================================================
ERROR: test_change_state (unittest_wfobjs.WorkflowTC)
----------------------------------------------------------------------
Traceback (most recent call last)
File "/usr/lib/python3.4/unittest/case.py", line 58, in testPartExecutor
yield
File "/usr/lib/python3.4/unittest/case.py", line 573, in run
self.setUp()
File "/var/lib/jenkins/jobs/cubicweb-3.23/workspace/TOXENV/py34-entities/cubicweb/devtools/testlib.py", line 446, in setUp
self._init_repo()
File "/var/lib/jenkins/jobs/cubicweb-3.23/workspace/TOXENV/py34-entities/cubicweb/devtools/testlib.py", line 354, in _init_repo
db_handler.build_db_cache(self.test_db_id, self.pre_setup_database)
File "/var/lib/jenkins/jobs/cubicweb-3.23/workspace/TOXENV/py34-entities/cubicweb/devtools/__init__.py", line 492, in build_db_cache
self.init_test_database()
File "/var/lib/jenkins/jobs/cubicweb-3.23/workspace/TOXENV/py34-entities/cubicweb/devtools/__init__.py", line 817, in init_test_database
init_config=self.init_config)
File "/var/lib/jenkins/jobs/cubicweb-3.23/workspace/TOXENV/py34-entities/cubicweb/server/__init__.py", line 213, in init_repository
from cubicweb.server.repository import Repository
File "/var/lib/jenkins/jobs/cubicweb-3.23/workspace/TOXENV/py34-entities/cubicweb/server/repository.py", line 698
with cnx.security_enabled(read=False, write=False):
^
IndentationError: unindent does not match any outer indentation level

no stdout
no stderr
======================================================================
SKIPPED: test_auto_transition_fired (unittest_wfobjs.AutoTransitionTC)
repository is not initialised: IndentationError('unindent does not match any outer indentation level', ('/var/lib/jenkins/jobs/cubicweb-3.23/workspace/TOXENV/py34-entities/cubicweb/server/repository.py', 698, 64, ' with cnx.security_enabled(read=False, write=False):\n'))
======================================================================
SKIPPED: test_auto_transition_initial_state_fired (unittest_wfobjs.AutoTransitionTC)
repository is not initialised: IndentationError('unindent does not match any outer indentation level', ('/var/lib/jenkins/jobs/cubicweb-3.23/workspace/TOXENV/py34-entities/cubicweb/server/repository.py', 698, 64, ' with cnx.security_enabled(read=False, write=False):\n'))
======================================================================
SKIPPED: test_custom_wf_no_initial_state (unittest_wfobjs.CustomWorkflowTC)
try to set a custom workflow which has no initial state
repository is not initialised: IndentationError('unindent does not match any outer indentation level', ('/var/lib/jenkins/jobs/cubicweb-3.23/workspace/TOXENV/py34-entities/cubicweb/server/repository.py', 698, 64, ' with cnx.security_enabled(read=False, write=False):\n'))
======================================================================
SKIPPED: test_custom_wf_replace_state_keep_history (unittest_wfobjs.CustomWorkflowTC)
member in inital state with some history, state is redirected and
repository is not initialised: IndentationError('unindent does not match any outer indentation level', ('/var/lib/jenkins/jobs/cubicweb-3.23/workspace/TOXENV/py34-entities/cubicweb/server/repository.py', 698, 64, ' with cnx.security_enabled(read=False, write=False):\n'))
======================================================================
SKIPPED: test_custom_wf_replace_state_no_history (unittest_wfobjs.CustomWorkflowTC)
member in inital state with no previous history, state is simply
repository is not initialised: IndentationError('unindent does not match any outer indentation level', ('/var/lib/jenkins/jobs/cubicweb-3.23/workspace/TOXENV/py34-entities/cubicweb/server/repository.py', 698, 64, ' with cnx.security_enabled(read=False, write=False):\n'))
======================================================================
SKIPPED: test_del_custom_wf (unittest_wfobjs.CustomWorkflowTC)
member in some state shared by the new workflow, nothing has to be
repository is not initialised: IndentationError('unindent does not match any outer indentation level', ('/var/lib/jenkins/jobs/cubicweb-3.23/workspace/TOXENV/py34-entities/cubicweb/server/repository.py', 698, 64, ' with cnx.security_enabled(read=False, write=False):\n'))
======================================================================
SKIPPED: test_duplicated_transition (unittest_wfobjs.WorkflowBuildingTC)
repository is not initialised: IndentationError('unindent does not match any outer indentation level', ('/var/lib/jenkins/jobs/cubicweb-3.23/workspace/TOXENV/py34-entities/cubicweb/server/repository.py', 698, 64, ' with cnx.security_enabled(read=False, write=False):\n'))
======================================================================
SKIPPED: test_wf_construction (unittest_wfobjs.WorkflowBuildingTC)
repository is not initialised: IndentationError('unindent does not match any outer indentation level', ('/var/lib/jenkins/jobs/cubicweb-3.23/workspace/TOXENV/py34-entities/cubicweb/server/repository.py', 698, 64, ' with cnx.security_enabled(read=False, write=False):\n'))
======================================================================
SKIPPED: test_transition_checking2 (unittest_wfobjs.WorkflowHooksTC)
repository is not initialised: IndentationError('unindent does not match any outer indentation level', ('/var/lib/jenkins/jobs/cubicweb-3.23/workspace/TOXENV/py34-entities/cubicweb/server/repository.py', 698, 64, ' with cnx.security_enabled(read=False, write=False):\n'))
======================================================================
SKIPPED: test_transition_checking3 (unittest_wfobjs.WorkflowHooksTC)
repository is not initialised: IndentationError('unindent does not match any outer indentation level', ('/var/lib/jenkins/jobs/cubicweb-3.23/workspace/TOXENV/py34-entities/cubicweb/server/repository.py', 698, 64, ' with cnx.security_enabled(read=False, write=False):\n'))
======================================================================
SKIPPED: test_fire_transition (unittest_wfobjs.WorkflowTC)
repository is not initialised: IndentationError('unindent does not match any outer indentation level', ('/var/lib/jenkins/jobs/cubicweb-3.23/workspace/TOXENV/py34-entities/cubicweb/server/repository.py', 698, 64, ' with cnx.security_enabled(read=False, write=False):\n'))
======================================================================
SKIPPED: test_fire_transition_has_update_perm (unittest_wfobjs.WorkflowTC)
repository is not initialised: IndentationError('unindent does not match any outer indentation level', ('/var/lib/jenkins/jobs/cubicweb-3.23/workspace/TOXENV/py34-entities/cubicweb/server/repository.py', 698, 64, ' with cnx.security_enabled(read=False, write=False):\n'))
======================================================================
SKIPPED: test_fire_transition_owned_by (unittest_wfobjs.WorkflowTC)
repository is not initialised: IndentationError('unindent does not match any outer indentation level', ('/var/lib/jenkins/jobs/cubicweb-3.23/workspace/TOXENV/py34-entities/cubicweb/server/repository.py', 698, 64, ' with cnx.security_enabled(read=False, write=False):\n'))
======================================================================
SKIPPED: test_goback_transition (unittest_wfobjs.WorkflowTC)
repository is not initialised: IndentationError('unindent does not match any outer indentation level', ('/var/lib/jenkins/jobs/cubicweb-3.23/workspace/TOXENV/py34-entities/cubicweb/server/repository.py', 698, 64, ' with cnx.security_enabled(read=False, write=False):\n'))
======================================================================
SKIPPED: test_possible_transitions (unittest_wfobjs.WorkflowTC)
repository is not initialised: IndentationError('unindent does not match any outer indentation level', ('/var/lib/jenkins/jobs/cubicweb-3.23/workspace/TOXENV/py34-entities/cubicweb/server/repository.py', 698, 64, ' with cnx.security_enabled(read=False, write=False):\n'))
======================================================================
SKIPPED: test_replace_state (unittest_wfobjs.WorkflowTC)
repository is not initialised: IndentationError('unindent does not match any outer indentation level', ('/var/lib/jenkins/jobs/cubicweb-3.23/workspace/TOXENV/py34-entities/cubicweb/server/repository.py', 698, 64, ' with cnx.security_enabled(read=False, write=False):\n'))
======================================================================
SKIPPED: test_set_in_state_bad_wf (unittest_wfobjs.WorkflowTC)
repository is not initialised: IndentationError('unindent does not match any outer indentation level', ('/var/lib/jenkins/jobs/cubicweb-3.23/workspace/TOXENV/py34-entities/cubicweb/server/repository.py', 698, 64, ' with cnx.security_enabled(read=False, write=False):\n'))
======================================================================
SKIPPED: test_swf_base (unittest_wfobjs.WorkflowTC)
subworkflow
repository is not initialised: IndentationError('unindent does not match any outer indentation level', ('/var/lib/jenkins/jobs/cubicweb-3.23/workspace/TOXENV/py34-entities/cubicweb/server/repository.py', 698, 64, ' with cnx.security_enabled(read=False, write=False):\n'))
======================================================================
SKIPPED: test_swf_exit_consistency (unittest_wfobjs.WorkflowTC)
repository is not initialised: IndentationError('unindent does not match any outer indentation level', ('/var/lib/jenkins/jobs/cubicweb-3.23/workspace/TOXENV/py34-entities/cubicweb/server/repository.py', 698, 64, ' with cnx.security_enabled(read=False, write=False):\n'))
======================================================================
SKIPPED: test_swf_fire_in_a_row (unittest_wfobjs.WorkflowTC)
repository is not initialised: IndentationError('unindent does not match any outer indentation level', ('/var/lib/jenkins/jobs/cubicweb-3.23/workspace/TOXENV/py34-entities/cubicweb/server/repository.py', 698, 64, ' with cnx.security_enabled(read=False, write=False):\n'))
======================================================================
SKIPPED: test_swf_magic_tr (unittest_wfobjs.WorkflowTC)
repository is not initialised: IndentationError('unindent does not match any outer indentation level', ('/var/lib/jenkins/jobs/cubicweb-3.23/workspace/TOXENV/py34-entities/cubicweb/server/repository.py', 698, 64, ' with cnx.security_enabled(read=False, write=False):\n'))
======================================================================
SKIPPED: test_workflow_base (unittest_wfobjs.WorkflowTC)
repository is not initialised: IndentationError('unindent does not match any outer indentation level', ('/var/lib/jenkins/jobs/cubicweb-3.23/workspace/TOXENV/py34-entities/cubicweb/server/repository.py', 698, 64, ' with cnx.security_enabled(read=False, write=False):\n'))
========================= unittest_base.py =========================
ESSSSSESSEEESSSSE
======================================================================
ERROR: test_allowed_massmail_keys (unittest_base.CWUserTC)
----------------------------------------------------------------------
Traceback (most recent call last)
File "/usr/lib/python3.4/unittest/case.py", line 58, in testPartExecutor
yield
File "/usr/lib/python3.4/unittest/case.py", line 573, in run
self.setUp()
File "/var/lib/jenkins/jobs/cubicweb-3.23/workspace/TOXENV/py34-entities/cubicweb/devtools/testlib.py", line 446, in setUp
self._init_repo()
File "/var/lib/jenkins/jobs/cubicweb-3.23/workspace/TOXENV/py34-entities/cubicweb/devtools/testlib.py", line 354, in _init_repo
db_handler.build_db_cache(self.test_db_id, self.pre_setup_database)
File "/var/lib/jenkins/jobs/cubicweb-3.23/workspace/TOXENV/py34-entities/cubicweb/devtools/__init__.py", line 492, in build_db_cache
self.init_test_database()
File "/var/lib/jenkins/jobs/cubicweb-3.23/workspace/TOXENV/py34-entities/cubicweb/devtools/__init__.py", line 817, in init_test_database
init_config=self.init_config)
File "/var/lib/jenkins/jobs/cubicweb-3.23/workspace/TOXENV/py34-entities/cubicweb/server/__init__.py", line 213, in init_repository
from cubicweb.server.repository import Repository
File "/var/lib/jenkins/jobs/cubicweb-3.23/workspace/TOXENV/py34-entities/cubicweb/server/repository.py", line 698
with cnx.security_enabled(read=False, write=False):
^
IndentationError: unindent does not match any outer indentation level

no stdout
no stderr
======================================================================
ERROR: test_canonical_form (unittest_base.EmailAddressTC)
----------------------------------------------------------------------
Traceback (most recent call last)
File "/usr/lib/python3.4/unittest/case.py", line 58, in testPartExecutor
yield
File "/usr/lib/python3.4/unittest/case.py", line 573, in run
self.setUp()
File "/var/lib/jenkins/jobs/cubicweb-3.23/workspace/TOXENV/py34-entities/cubicweb/devtools/testlib.py", line 446, in setUp
self._init_repo()
File "/var/lib/jenkins/jobs/cubicweb-3.23/workspace/TOXENV/py34-entities/cubicweb/devtools/testlib.py", line 354, in _init_repo
db_handler.build_db_cache(self.test_db_id, self.pre_setup_database)
File "/var/lib/jenkins/jobs/cubicweb-3.23/workspace/TOXENV/py34-entities/cubicweb/devtools/__init__.py", line 492, in build_db_cache
self.init_test_database()
File "/var/lib/jenkins/jobs/cubicweb-3.23/workspace/TOXENV/py34-entities/cubicweb/devtools/__init__.py", line 817, in init_test_database
init_config=self.init_config)
File "/var/lib/jenkins/jobs/cubicweb-3.23/workspace/TOXENV/py34-entities/cubicweb/server/__init__.py", line 213, in init_repository
from cubicweb.server.repository import Repository
File "/var/lib/jenkins/jobs/cubicweb-3.23/workspace/TOXENV/py34-entities/cubicweb/server/repository.py", line 698
with cnx.security_enabled(read=False, write=False):
^
IndentationError: unindent does not match any outer indentation level

no stdout
no stderr
======================================================================
ERROR: test_sanitized_html (unittest_base.HTMLtransformTC)
----------------------------------------------------------------------
Traceback (most recent call last)
File "/usr/lib/python3.4/unittest/case.py", line 58, in testPartExecutor
yield
File "/usr/lib/python3.4/unittest/case.py", line 573, in run
self.setUp()
File "/var/lib/jenkins/jobs/cubicweb-3.23/workspace/TOXENV/py34-entities/cubicweb/devtools/testlib.py", line 446, in setUp
self._init_repo()
File "/var/lib/jenkins/jobs/cubicweb-3.23/workspace/TOXENV/py34-entities/cubicweb/devtools/testlib.py", line 354, in _init_repo
db_handler.build_db_cache(self.test_db_id, self.pre_setup_database)
File "/var/lib/jenkins/jobs/cubicweb-3.23/workspace/TOXENV/py34-entities/cubicweb/devtools/__init__.py", line 492, in build_db_cache
self.init_test_database()
File "/var/lib/jenkins/jobs/cubicweb-3.23/workspace/TOXENV/py34-entities/cubicweb/devtools/__init__.py", line 817, in init_test_database
init_config=self.init_config)
File "/var/lib/jenkins/jobs/cubicweb-3.23/workspace/TOXENV/py34-entities/cubicweb/server/__init__.py", line 213, in init_repository
from cubicweb.server.repository import Repository
File "/var/lib/jenkins/jobs/cubicweb-3.23/workspace/TOXENV/py34-entities/cubicweb/server/repository.py", line 698
with cnx.security_enabled(read=False, write=False):
^
IndentationError: unindent does not match any outer indentation level

no stdout
no stderr
======================================================================
ERROR: test_serialization (unittest_base.ISerializableTC)
----------------------------------------------------------------------
Traceback (most recent call last)
File "/usr/lib/python3.4/unittest/case.py", line 58, in testPartExecutor
yield
File "/usr/lib/python3.4/unittest/case.py", line 573, in run
self.setUp()
File "/var/lib/jenkins/jobs/cubicweb-3.23/workspace/TOXENV/py34-entities/cubicweb/devtools/testlib.py", line 446, in setUp
self._init_repo()
File "/var/lib/jenkins/jobs/cubicweb-3.23/workspace/TOXENV/py34-entities/cubicweb/devtools/testlib.py", line 354, in _init_repo
db_handler.build_db_cache(self.test_db_id, self.pre_setup_database)
File "/var/lib/jenkins/jobs/cubicweb-3.23/workspace/TOXENV/py34-entities/cubicweb/devtools/__init__.py", line 492, in build_db_cache
self.init_test_database()
File "/var/lib/jenkins/jobs/cubicweb-3.23/workspace/TOXENV/py34-entities/cubicweb/devtools/__init__.py", line 817, in init_test_database
init_config=self.init_config)
File "/var/lib/jenkins/jobs/cubicweb-3.23/workspace/TOXENV/py34-entities/cubicweb/server/__init__.py", line 213, in init_repository
from cubicweb.server.repository import Repository
File "/var/lib/jenkins/jobs/cubicweb-3.23/workspace/TOXENV/py34-entities/cubicweb/server/repository.py", line 698
with cnx.security_enabled(read=False, write=False):
^
IndentationError: unindent does not match any outer indentation level

no stdout
no stderr
======================================================================
ERROR: test_creator (unittest_base.MetadataTC)
----------------------------------------------------------------------
Traceback (most recent call last)
File "/usr/lib/python3.4/unittest/case.py", line 58, in testPartExecutor
yield
File "/usr/lib/python3.4/unittest/case.py", line 573, in run
self.setUp()
File "/var/lib/jenkins/jobs/cubicweb-3.23/workspace/TOXENV/py34-entities/cubicweb/devtools/testlib.py", line 446, in setUp
self._init_repo()
File "/var/lib/jenkins/jobs/cubicweb-3.23/workspace/TOXENV/py34-entities/cubicweb/devtools/testlib.py", line 354, in _init_repo
db_handler.build_db_cache(self.test_db_id, self.pre_setup_database)
File "/var/lib/jenkins/jobs/cubicweb-3.23/workspace/TOXENV/py34-entities/cubicweb/devtools/__init__.py", line 492, in build_db_cache
self.init_test_database()
File "/var/lib/jenkins/jobs/cubicweb-3.23/workspace/TOXENV/py34-entities/cubicweb/devtools/__init__.py", line 817, in init_test_database
init_config=self.init_config)
File "/var/lib/jenkins/jobs/cubicweb-3.23/workspace/TOXENV/py34-entities/cubicweb/server/__init__.py", line 213, in init_repository
from cubicweb.server.repository import Repository
File "/var/lib/jenkins/jobs/cubicweb-3.23/workspace/TOXENV/py34-entities/cubicweb/server/repository.py", line 698
with cnx.security_enabled(read=False, write=False):
^
IndentationError: unindent does not match any outer indentation level

no stdout
no stderr
======================================================================
ERROR: test_etype_class_selection_and_specialization (unittest_base.SpecializedEntityClassesTC)
----------------------------------------------------------------------
Traceback (most recent call last)
File "/usr/lib/python3.4/unittest/case.py", line 58, in testPartExecutor
yield
File "/usr/lib/python3.4/unittest/case.py", line 573, in run
self.setUp()
File "/var/lib/jenkins/jobs/cubicweb-3.23/workspace/TOXENV/py34-entities/cubicweb/devtools/testlib.py", line 446, in setUp
self._init_repo()
File "/var/lib/jenkins/jobs/cubicweb-3.23/workspace/TOXENV/py34-entities/cubicweb/devtools/testlib.py", line 354, in _init_repo
db_handler.build_db_cache(self.test_db_id, self.pre_setup_database)
File "/var/lib/jenkins/jobs/cubicweb-3.23/workspace/TOXENV/py34-entities/cubicweb/devtools/__init__.py", line 492, in build_db_cache
self.init_test_database()
File "/var/lib/jenkins/jobs/cubicweb-3.23/workspace/TOXENV/py34-entities/cubicweb/devtools/__init__.py", line 817, in init_test_database
init_config=self.init_config)
File "/var/lib/jenkins/jobs/cubicweb-3.23/workspace/TOXENV/py34-entities/cubicweb/server/__init__.py", line 213, in init_repository
from cubicweb.server.repository import Repository
File "/var/lib/jenkins/jobs/cubicweb-3.23/workspace/TOXENV/py34-entities/cubicweb/server/repository.py", line 698
with cnx.security_enabled(read=False, write=False):
^
IndentationError: unindent does not match any outer indentation level

no stdout
no stderr
======================================================================
SKIPPED: test_complete (unittest_base.CWUserTC)
repository is not initialised: IndentationError('unindent does not match any outer indentation level', ('/var/lib/jenkins/jobs/cubicweb-3.23/workspace/TOXENV/py34-entities/cubicweb/server/repository.py', 698, 64, ' with cnx.security_enabled(read=False, write=False):\n'))
======================================================================
SKIPPED: test_cw_instantiate_object_relation (unittest_base.CWUserTC)
a weird non regression test
repository is not initialised: IndentationError('unindent does not match any outer indentation level', ('/var/lib/jenkins/jobs/cubicweb-3.23/workspace/TOXENV/py34-entities/cubicweb/server/repository.py', 698, 64, ' with cnx.security_enabled(read=False, write=False):\n'))
======================================================================
SKIPPED: test_dc_title_and_name (unittest_base.CWUserTC)
repository is not initialised: IndentationError('unindent does not match any outer indentation level', ('/var/lib/jenkins/jobs/cubicweb-3.23/workspace/TOXENV/py34-entities/cubicweb/server/repository.py', 698, 64, ' with cnx.security_enabled(read=False, write=False):\n'))
======================================================================
SKIPPED: test_falsey_dc_title (unittest_base.CWUserTC)
repository is not initialised: IndentationError('unindent does not match any outer indentation level', ('/var/lib/jenkins/jobs/cubicweb-3.23/workspace/TOXENV/py34-entities/cubicweb/server/repository.py', 698, 64, ' with cnx.security_enabled(read=False, write=False):\n'))
======================================================================
SKIPPED: test_matching_groups (unittest_base.CWUserTC)
repository is not initialised: IndentationError('unindent does not match any outer indentation level', ('/var/lib/jenkins/jobs/cubicweb-3.23/workspace/TOXENV/py34-entities/cubicweb/server/repository.py', 698, 64, ' with cnx.security_enabled(read=False, write=False):\n'))
======================================================================
SKIPPED: test_mangling (unittest_base.EmailAddressTC)
repository is not initialised: IndentationError('unindent does not match any outer indentation level', ('/var/lib/jenkins/jobs/cubicweb-3.23/workspace/TOXENV/py34-entities/cubicweb/server/repository.py', 698, 64, ' with cnx.security_enabled(read=False, write=False):\n'))
======================================================================
SKIPPED: test_printable_value_escape (unittest_base.EmailAddressTC)
repository is not initialised: IndentationError('unindent does not match any outer indentation level', ('/var/lib/jenkins/jobs/cubicweb-3.23/workspace/TOXENV/py34-entities/cubicweb/server/repository.py', 698, 64, ' with cnx.security_enabled(read=False, write=False):\n'))
======================================================================
SKIPPED: test_cw_etype (unittest_base.MetadataTC)
repository is not initialised: IndentationError('unindent does not match any outer indentation level', ('/var/lib/jenkins/jobs/cubicweb-3.23/workspace/TOXENV/py34-entities/cubicweb/server/repository.py', 698, 64, ' with cnx.security_enabled(read=False, write=False):\n'))
======================================================================
SKIPPED: test_entity_meta_attributes (unittest_base.MetadataTC)
repository is not initialised: IndentationError('unindent does not match any outer indentation level', ('/var/lib/jenkins/jobs/cubicweb-3.23/workspace/TOXENV/py34-entities/cubicweb/server/repository.py', 698, 64, ' with cnx.security_enabled(read=False, write=False):\n'))
======================================================================
SKIPPED: test_fti_rql_method (unittest_base.MetadataTC)
repository is not initialised: IndentationError('unindent does not match any outer indentation level', ('/var/lib/jenkins/jobs/cubicweb-3.23/workspace/TOXENV/py34-entities/cubicweb/server/repository.py', 698, 64, ' with cnx.security_enabled(read=False, write=False):\n'))
======================================================================
SKIPPED: test_type (unittest_base.MetadataTC)
repository is not initialised: IndentationError('unindent does not match any outer indentation level', ('/var/lib/jenkins/jobs/cubicweb-3.23/workspace/TOXENV/py34-entities/cubicweb/server/repository.py', 698, 64, ' with cnx.security_enabled(read=False, write=False):\n'))
*******************************************************************************
Ran 44 test cases in 0.92s (0.92s CPU), 11 errors, 33 skipped
0 modules OK (2 failed)
failures: /var/lib/jenkins/jobs/cubicweb-3.23/workspace/TOXENV/py34-entities/cubicweb/entities/test/unittest_wfobjs [5/27], /var/lib/jenkins/jobs/cubicweb-3.23/workspace/TOXENV/py34-entities/cubicweb/entities/test/unittest_base [6/17]
ERROR: InvocationError: '/var/lib/jenkins/jobs/cubicweb-3.23/workspace/TOXENV/py34-entities/.tox/py34-entities/bin/python -c from logilab.common import pytest; pytest.run() -t /var/lib/jenkins/jobs/cubicweb-3.23/workspace/TOXENV/py34-entities/cubicweb/entities/test'
___________________________________ summary ____________________________________
ERROR: py34-entities: commands failed
Build step 'Execute shell' marked build as failure
Sending e-mails to: dlaxalde@logilab.fr jcr@logilab.fr syt@logilab.fr david@logilab.fr
[PostBuildScript] - Execution post build scripts.
[py34-entities] $ /bin/bash -xe /tmp/hudson8004071047292246509.sh
+ /var/lib/jenkins/scripts/notify_forge_apycot.py cwo cubicweb 69aa09ec38d5 http://jenkins.logilab.fr/job/cubicweb-3.23/TOXENV=py34-entities/81/ --status failure
<br/>

log from execution
download