consoleText

download

20 Started by upstream project "cubicweb-3.23" build number 81
originally caused by:
Started by an SCM change
Building in workspace /var/lib/jenkins/jobs/cubicweb-3.23/workspace/TOXENV/py34-cubicweb
[py34-cubicweb] $ hg showconfig paths.default
[py34-cubicweb] $ hg pull
pulling from http://hg.logilab.org/review/cubicweb
searching for changes
adding changesets
adding manifests
adding file changes
added 4 changesets with 10 changes to 8 files (+3 heads)
10 new obsolescence markers
(run 'hg heads .' to see heads, 'hg merge' to merge)
[py34-cubicweb] $ hg update --clean --rev 69aa09ec38d545147b152e6fd12b5ce495a4f053
12 files updated, 0 files merged, 0 files removed, 0 files unresolved
[py34-cubicweb] $ hg --config extensions.purge= clean --all
[py34-cubicweb] $ hg log --rev . --template {node}
[py34-cubicweb] $ hg log --rev . --template {rev}
[py34-cubicweb] $ hg id --branch
[py34-cubicweb] $ /bin/bash -xe /tmp/hudson1003904300060180642.sh
+ find . '(' -name 'pgdb*' -o -name 'tmpdb*' ')' -print0
+ xargs -0 rm -rf
[py34-cubicweb] $ /bin/bash -xe /tmp/hudson8081165028926324457.sh
+ PATH=/usr/lib/postgresql/9.4/bin:/usr/local/bin:/usr/bin:/bin:/usr/local/games:/usr/games
+ tox --recreate
py34-cubicweb create: /var/lib/jenkins/jobs/cubicweb-3.23/workspace/TOXENV/py34-cubicweb/.tox/py34-cubicweb
py34-cubicweb installdeps: -e., -r/var/lib/jenkins/jobs/cubicweb-3.23/workspace/TOXENV/py34-cubicweb/cubicweb/test/requirements.txt
py34-cubicweb develop-inst: /var/lib/jenkins/jobs/cubicweb-3.23/workspace/TOXENV/py34-cubicweb
py34-cubicweb installed: You are using pip version 7.1.2, however version 8.1.0 is available.,You should consider upgrading via the 'pip install --upgrade pip' command.,chardet==2.3.0,colorama==0.3.2,-e hg+http://hg.logilab.org/review/cubicweb@69aa09ec38d545147b152e6fd12b5ce495a4f053#egg=cubicweb-dev,cubicweb-card==0.5.8,cubicweb-file==1.18.0,cubicweb-localperms==0.3.2,cubicweb-tag==1.8.3,cwclientlib==0.4.1,docutils==0.12,html2text==2016.1.8,html5lib==0.999,linecache2==1.0.0,logilab-common==1.2.0,logilab-constraint==0.6.0,logilab-database==1.15.0,logilab-mtconverter==0.9.0,lxml==3.5.0,Markdown==2.6.5,passlib==1.6.5,Pillow==3.1.1,psycopg2==2.5.4,py==1.4.25,pyasn1==0.1.7,pyflakes==0.8.1,Pygments==2.1.3,python-apt==0.9.3.12,python-dateutil==2.5.0,python3-ldap==0.9.4.2,pytz==2016.1,requests==2.4.3,rql==0.34.0,six==1.8.0,tox==1.9.2,traceback2==1.4.0,unattended-upgrades==0.1,unittest2==1.1.0,urllib3==1.9.1,virtualenv==1.11.6,wheel==0.24.0,yams==0.42.0,Yapps==2.2.0,Yapps2==2.2.0
py34-cubicweb runtests: PYTHONHASHSEED='2887847544'
py34-cubicweb runtests: commands[0] | touch /var/lib/jenkins/jobs/cubicweb-3.23/workspace/TOXENV/py34-cubicweb/.tox/py34-cubicweb/share/cubicweb/cubes/__init__.py
py34-cubicweb runtests: commands[1] | /var/lib/jenkins/jobs/cubicweb-3.23/workspace/TOXENV/py34-cubicweb/.tox/py34-cubicweb/bin/python -m pip install --upgrade --no-deps --quiet git+git://github.com/logilab/yapps@master
py34-cubicweb runtests: commands[2] | /var/lib/jenkins/jobs/cubicweb-3.23/workspace/TOXENV/py34-cubicweb/.tox/py34-cubicweb/bin/python -c from logilab.common import pytest; pytest.run() -t /var/lib/jenkins/jobs/cubicweb-3.23/workspace/TOXENV/py34-cubicweb/cubicweb/test
======================== unittest_uilib.py =========================
..................
====================== unittest_toolsutils.py ======================
....
====================== unittest_migration.py =======================
E...
======================================================================
ERROR: test_db_creation (unittest_migration.BaseCreationTC)
make sure database can be created
----------------------------------------------------------------------
Traceback (most recent call last)
File "/var/lib/jenkins/jobs/cubicweb-3.23/workspace/TOXENV/py34-cubicweb/.tox/py34-cubicweb/lib/python3.4/site-packages/logilab/common/testlib.py", line 497, in _proceed
testfunc(*args, **kwargs)
File "/var/lib/jenkins/jobs/cubicweb-3.23/workspace/TOXENV/py34-cubicweb/cubicweb/test/unittest_migration.py", line 107, in test_db_creation
handler.init_test_database()
File "/var/lib/jenkins/jobs/cubicweb-3.23/workspace/TOXENV/py34-cubicweb/cubicweb/devtools/__init__.py", line 817, in init_test_database
init_config=self.init_config)
File "/var/lib/jenkins/jobs/cubicweb-3.23/workspace/TOXENV/py34-cubicweb/cubicweb/server/__init__.py", line 213, in init_repository
from cubicweb.server.repository import Repository
File "/var/lib/jenkins/jobs/cubicweb-3.23/workspace/TOXENV/py34-cubicweb/cubicweb/server/repository.py", line 698
with cnx.security_enabled(read=False, write=False):
^
IndentationError: unindent does not match any outer indentation level

no stdout
no stderr
======================== unittest_rtags.py =========================
...
========================= unittest_req.py ==========================
ESSSS...
======================================================================
ERROR: test_base_url (unittest_req.RequestCWTC)
----------------------------------------------------------------------
Traceback (most recent call last)
File "/usr/lib/python3.4/unittest/case.py", line 58, in testPartExecutor
yield
File "/usr/lib/python3.4/unittest/case.py", line 573, in run
self.setUp()
File "/var/lib/jenkins/jobs/cubicweb-3.23/workspace/TOXENV/py34-cubicweb/cubicweb/devtools/testlib.py", line 446, in setUp
self._init_repo()
File "/var/lib/jenkins/jobs/cubicweb-3.23/workspace/TOXENV/py34-cubicweb/cubicweb/devtools/testlib.py", line 354, in _init_repo
db_handler.build_db_cache(self.test_db_id, self.pre_setup_database)
File "/var/lib/jenkins/jobs/cubicweb-3.23/workspace/TOXENV/py34-cubicweb/cubicweb/devtools/__init__.py", line 492, in build_db_cache
self.init_test_database()
File "/var/lib/jenkins/jobs/cubicweb-3.23/workspace/TOXENV/py34-cubicweb/cubicweb/devtools/__init__.py", line 817, in init_test_database
init_config=self.init_config)
File "/var/lib/jenkins/jobs/cubicweb-3.23/workspace/TOXENV/py34-cubicweb/cubicweb/server/__init__.py", line 213, in init_repository
from cubicweb.server.repository import Repository
File "/var/lib/jenkins/jobs/cubicweb-3.23/workspace/TOXENV/py34-cubicweb/cubicweb/server/repository.py", line 698
with cnx.security_enabled(read=False, write=False):
^
IndentationError: unindent does not match any outer indentation level

no stdout
no stderr
======================================================================
SKIPPED: test_find (unittest_req.RequestCWTC)
repository is not initialised: IndentationError('unindent does not match any outer indentation level', ('/var/lib/jenkins/jobs/cubicweb-3.23/workspace/TOXENV/py34-cubicweb/cubicweb/server/repository.py', 698, 64, ' with cnx.security_enabled(read=False, write=False):\n'))
======================================================================
SKIPPED: test_find_entities (unittest_req.RequestCWTC)
repository is not initialised: IndentationError('unindent does not match any outer indentation level', ('/var/lib/jenkins/jobs/cubicweb-3.23/workspace/TOXENV/py34-cubicweb/cubicweb/server/repository.py', 698, 64, ' with cnx.security_enabled(read=False, write=False):\n'))
======================================================================
SKIPPED: test_find_one_entity (unittest_req.RequestCWTC)
repository is not initialised: IndentationError('unindent does not match any outer indentation level', ('/var/lib/jenkins/jobs/cubicweb-3.23/workspace/TOXENV/py34-cubicweb/cubicweb/server/repository.py', 698, 64, ' with cnx.security_enabled(read=False, write=False):\n'))
======================================================================
SKIPPED: test_view_catch_ex (unittest_req.RequestCWTC)
repository is not initialised: IndentationError('unindent does not match any outer indentation level', ('/var/lib/jenkins/jobs/cubicweb-3.23/workspace/TOXENV/py34-cubicweb/cubicweb/server/repository.py', 698, 64, ' with cnx.security_enabled(read=False, write=False):\n'))
======================== unittest_cwctl.py =========================
.E
======================================================================
ERROR: test_process_script_args_context (unittest_cwctl.CubicWebShellTC)
----------------------------------------------------------------------
Traceback (most recent call last)
File "/usr/lib/python3.4/unittest/case.py", line 58, in testPartExecutor
yield
File "/usr/lib/python3.4/unittest/case.py", line 573, in run
self.setUp()
File "/var/lib/jenkins/jobs/cubicweb-3.23/workspace/TOXENV/py34-cubicweb/cubicweb/devtools/testlib.py", line 446, in setUp
self._init_repo()
File "/var/lib/jenkins/jobs/cubicweb-3.23/workspace/TOXENV/py34-cubicweb/cubicweb/devtools/testlib.py", line 354, in _init_repo
db_handler.build_db_cache(self.test_db_id, self.pre_setup_database)
File "/var/lib/jenkins/jobs/cubicweb-3.23/workspace/TOXENV/py34-cubicweb/cubicweb/devtools/__init__.py", line 492, in build_db_cache
self.init_test_database()
File "/var/lib/jenkins/jobs/cubicweb-3.23/workspace/TOXENV/py34-cubicweb/cubicweb/devtools/__init__.py", line 817, in init_test_database
init_config=self.init_config)
File "/var/lib/jenkins/jobs/cubicweb-3.23/workspace/TOXENV/py34-cubicweb/cubicweb/server/__init__.py", line 213, in init_repository
from cubicweb.server.repository import Repository
File "/var/lib/jenkins/jobs/cubicweb-3.23/workspace/TOXENV/py34-cubicweb/cubicweb/server/repository.py", line 698
with cnx.security_enabled(read=False, write=False):
^
IndentationError: unindent does not match any outer indentation level

no stdout
no stderr
========================= unittest_rset.py =========================
....ESSSSSSSSSSSSSSSSSSSSSSSSSSSSSSSSSSSS
======================================================================
ERROR: test_build (unittest_rset.ResultSetTC)
test basic build of a ResultSet
----------------------------------------------------------------------
Traceback (most recent call last)
File "/usr/lib/python3.4/unittest/case.py", line 58, in testPartExecutor
yield
File "/usr/lib/python3.4/unittest/case.py", line 573, in run
self.setUp()
File "/var/lib/jenkins/jobs/cubicweb-3.23/workspace/TOXENV/py34-cubicweb/cubicweb/test/unittest_rset.py", line 87, in setUp
super(ResultSetTC, self).setUp()
File "/var/lib/jenkins/jobs/cubicweb-3.23/workspace/TOXENV/py34-cubicweb/cubicweb/devtools/testlib.py", line 446, in setUp
self._init_repo()
File "/var/lib/jenkins/jobs/cubicweb-3.23/workspace/TOXENV/py34-cubicweb/cubicweb/devtools/testlib.py", line 354, in _init_repo
db_handler.build_db_cache(self.test_db_id, self.pre_setup_database)
File "/var/lib/jenkins/jobs/cubicweb-3.23/workspace/TOXENV/py34-cubicweb/cubicweb/devtools/__init__.py", line 492, in build_db_cache
self.init_test_database()
File "/var/lib/jenkins/jobs/cubicweb-3.23/workspace/TOXENV/py34-cubicweb/cubicweb/devtools/__init__.py", line 817, in init_test_database
init_config=self.init_config)
File "/var/lib/jenkins/jobs/cubicweb-3.23/workspace/TOXENV/py34-cubicweb/cubicweb/server/__init__.py", line 213, in init_repository
from cubicweb.server.repository import Repository
File "/var/lib/jenkins/jobs/cubicweb-3.23/workspace/TOXENV/py34-cubicweb/cubicweb/server/repository.py", line 698
with cnx.security_enabled(read=False, write=False):
^
IndentationError: unindent does not match any outer indentation level

no stdout
no stderr
======================================================================
SKIPPED: test_build_url (unittest_rset.ResultSetTC)
repository is not initialised: IndentationError('unindent does not match any outer indentation level', ('/var/lib/jenkins/jobs/cubicweb-3.23/workspace/TOXENV/py34-cubicweb/cubicweb/server/repository.py', 698, 64, ' with cnx.security_enabled(read=False, write=False):\n'))
======================================================================
SKIPPED: test_cached_syntax_tree (unittest_rset.ResultSetTC)
make sure syntax tree is cached
repository is not initialised: IndentationError('unindent does not match any outer indentation level', ('/var/lib/jenkins/jobs/cubicweb-3.23/workspace/TOXENV/py34-cubicweb/cubicweb/server/repository.py', 698, 64, ' with cnx.security_enabled(read=False, write=False):\n'))
======================================================================
SKIPPED: test_count_users_by_date (unittest_rset.ResultSetTC)
repository is not initialised: IndentationError('unindent does not match any outer indentation level', ('/var/lib/jenkins/jobs/cubicweb-3.23/workspace/TOXENV/py34-cubicweb/cubicweb/server/repository.py', 698, 64, ' with cnx.security_enabled(read=False, write=False):\n'))
======================================================================
SKIPPED: test_entities (unittest_rset.ResultSetTC)
repository is not initialised: IndentationError('unindent does not match any outer indentation level', ('/var/lib/jenkins/jobs/cubicweb-3.23/workspace/TOXENV/py34-cubicweb/cubicweb/server/repository.py', 698, 64, ' with cnx.security_enabled(read=False, write=False):\n'))
======================================================================
SKIPPED: test_filter (unittest_rset.ResultSetTC)
repository is not initialised: IndentationError('unindent does not match any outer indentation level', ('/var/lib/jenkins/jobs/cubicweb-3.23/workspace/TOXENV/py34-cubicweb/cubicweb/server/repository.py', 698, 64, ' with cnx.security_enabled(read=False, write=False):\n'))
======================================================================
SKIPPED: test_get_entity_advanced (unittest_rset.ResultSetTC)
repository is not initialised: IndentationError('unindent does not match any outer indentation level', ('/var/lib/jenkins/jobs/cubicweb-3.23/workspace/TOXENV/py34-cubicweb/cubicweb/server/repository.py', 698, 64, ' with cnx.security_enabled(read=False, write=False):\n'))
======================================================================
SKIPPED: test_get_entity_advanced_prefilled_cache (unittest_rset.ResultSetTC)
repository is not initialised: IndentationError('unindent does not match any outer indentation level', ('/var/lib/jenkins/jobs/cubicweb-3.23/workspace/TOXENV/py34-cubicweb/cubicweb/server/repository.py', 698, 64, ' with cnx.security_enabled(read=False, write=False):\n'))
======================================================================
SKIPPED: test_get_entity_cache_with_left_outer_join (unittest_rset.ResultSetTC)
repository is not initialised: IndentationError('unindent does not match any outer indentation level', ('/var/lib/jenkins/jobs/cubicweb-3.23/workspace/TOXENV/py34-cubicweb/cubicweb/server/repository.py', 698, 64, ' with cnx.security_enabled(read=False, write=False):\n'))
======================================================================
SKIPPED: test_get_entity_recursion (unittest_rset.ResultSetTC)
repository is not initialised: IndentationError('unindent does not match any outer indentation level', ('/var/lib/jenkins/jobs/cubicweb-3.23/workspace/TOXENV/py34-cubicweb/cubicweb/server/repository.py', 698, 64, ' with cnx.security_enabled(read=False, write=False):\n'))
======================================================================
SKIPPED: test_get_entity_relation_cache_compt (unittest_rset.ResultSetTC)
repository is not initialised: IndentationError('unindent does not match any outer indentation level', ('/var/lib/jenkins/jobs/cubicweb-3.23/workspace/TOXENV/py34-cubicweb/cubicweb/server/repository.py', 698, 64, ' with cnx.security_enabled(read=False, write=False):\n'))
======================================================================
SKIPPED: test_get_entity_simple (unittest_rset.ResultSetTC)
repository is not initialised: IndentationError('unindent does not match any outer indentation level', ('/var/lib/jenkins/jobs/cubicweb-3.23/workspace/TOXENV/py34-cubicweb/cubicweb/server/repository.py', 698, 64, ' with cnx.security_enabled(read=False, write=False):\n'))
======================================================================
SKIPPED: test_get_entity_union (unittest_rset.ResultSetTC)
repository is not initialised: IndentationError('unindent does not match any outer indentation level', ('/var/lib/jenkins/jobs/cubicweb-3.23/workspace/TOXENV/py34-cubicweb/cubicweb/server/repository.py', 698, 64, ' with cnx.security_enabled(read=False, write=False):\n'))
======================================================================
SKIPPED: test_iter_rows_with_entities (unittest_rset.ResultSetTC)
repository is not initialised: IndentationError('unindent does not match any outer indentation level', ('/var/lib/jenkins/jobs/cubicweb-3.23/workspace/TOXENV/py34-cubicweb/cubicweb/server/repository.py', 698, 64, ' with cnx.security_enabled(read=False, write=False):\n'))
======================================================================
SKIPPED: test_limit (unittest_rset.ResultSetTC)
repository is not initialised: IndentationError('unindent does not match any outer indentation level', ('/var/lib/jenkins/jobs/cubicweb-3.23/workspace/TOXENV/py34-cubicweb/cubicweb/server/repository.py', 698, 64, ' with cnx.security_enabled(read=False, write=False):\n'))
======================================================================
SKIPPED: test_limit_2 (unittest_rset.ResultSetTC)
repository is not initialised: IndentationError('unindent does not match any outer indentation level', ('/var/lib/jenkins/jobs/cubicweb-3.23/workspace/TOXENV/py34-cubicweb/cubicweb/server/repository.py', 698, 64, ' with cnx.security_enabled(read=False, write=False):\n'))
======================================================================
SKIPPED: test_nonregr_symmetric_relation (unittest_rset.ResultSetTC)
repository is not initialised: IndentationError('unindent does not match any outer indentation level', ('/var/lib/jenkins/jobs/cubicweb-3.23/workspace/TOXENV/py34-cubicweb/cubicweb/server/repository.py', 698, 64, ' with cnx.security_enabled(read=False, write=False):\n'))
======================================================================
SKIPPED: test_one (unittest_rset.ResultSetTC)
repository is not initialised: IndentationError('unindent does not match any outer indentation level', ('/var/lib/jenkins/jobs/cubicweb-3.23/workspace/TOXENV/py34-cubicweb/cubicweb/server/repository.py', 698, 64, ' with cnx.security_enabled(read=False, write=False):\n'))
======================================================================
SKIPPED: test_one_multiple_rows (unittest_rset.ResultSetTC)
repository is not initialised: IndentationError('unindent does not match any outer indentation level', ('/var/lib/jenkins/jobs/cubicweb-3.23/workspace/TOXENV/py34-cubicweb/cubicweb/server/repository.py', 698, 64, ' with cnx.security_enabled(read=False, write=False):\n'))
======================================================================
SKIPPED: test_one_no_rows (unittest_rset.ResultSetTC)
repository is not initialised: IndentationError('unindent does not match any outer indentation level', ('/var/lib/jenkins/jobs/cubicweb-3.23/workspace/TOXENV/py34-cubicweb/cubicweb/server/repository.py', 698, 64, ' with cnx.security_enabled(read=False, write=False):\n'))
======================================================================
SKIPPED: test_pickle (unittest_rset.ResultSetTC)
repository is not initialised: IndentationError('unindent does not match any outer indentation level', ('/var/lib/jenkins/jobs/cubicweb-3.23/workspace/TOXENV/py34-cubicweb/cubicweb/server/repository.py', 698, 64, ' with cnx.security_enabled(read=False, write=False):\n'))
======================================================================
SKIPPED: test_printable_rql (unittest_rset.ResultSetTC)
repository is not initialised: IndentationError('unindent does not match any outer indentation level', ('/var/lib/jenkins/jobs/cubicweb-3.23/workspace/TOXENV/py34-cubicweb/cubicweb/server/repository.py', 698, 64, ' with cnx.security_enabled(read=False, write=False):\n'))
======================================================================
SKIPPED: test_related_entity_optional (unittest_rset.ResultSetTC)
repository is not initialised: IndentationError('unindent does not match any outer indentation level', ('/var/lib/jenkins/jobs/cubicweb-3.23/workspace/TOXENV/py34-cubicweb/cubicweb/server/repository.py', 698, 64, ' with cnx.security_enabled(read=False, write=False):\n'))
======================================================================
SKIPPED: test_related_entity_subquery_outerjoin (unittest_rset.ResultSetTC)
repository is not initialised: IndentationError('unindent does not match any outer indentation level', ('/var/lib/jenkins/jobs/cubicweb-3.23/workspace/TOXENV/py34-cubicweb/cubicweb/server/repository.py', 698, 64, ' with cnx.security_enabled(read=False, write=False):\n'))
======================================================================
SKIPPED: test_related_entity_trap_subquery (unittest_rset.ResultSetTC)
repository is not initialised: IndentationError('unindent does not match any outer indentation level', ('/var/lib/jenkins/jobs/cubicweb-3.23/workspace/TOXENV/py34-cubicweb/cubicweb/server/repository.py', 698, 64, ' with cnx.security_enabled(read=False, write=False):\n'))
======================================================================
SKIPPED: test_related_entity_union_subquery_1 (unittest_rset.ResultSetTC)
repository is not initialised: IndentationError('unindent does not match any outer indentation level', ('/var/lib/jenkins/jobs/cubicweb-3.23/workspace/TOXENV/py34-cubicweb/cubicweb/server/repository.py', 698, 64, ' with cnx.security_enabled(read=False, write=False):\n'))
======================================================================
SKIPPED: test_related_entity_union_subquery_2 (unittest_rset.ResultSetTC)
repository is not initialised: IndentationError('unindent does not match any outer indentation level', ('/var/lib/jenkins/jobs/cubicweb-3.23/workspace/TOXENV/py34-cubicweb/cubicweb/server/repository.py', 698, 64, ' with cnx.security_enabled(read=False, write=False):\n'))
======================================================================
SKIPPED: test_related_entity_union_subquery_3 (unittest_rset.ResultSetTC)
repository is not initialised: IndentationError('unindent does not match any outer indentation level', ('/var/lib/jenkins/jobs/cubicweb-3.23/workspace/TOXENV/py34-cubicweb/cubicweb/server/repository.py', 698, 64, ' with cnx.security_enabled(read=False, write=False):\n'))
======================================================================
SKIPPED: test_related_entity_union_subquery_4 (unittest_rset.ResultSetTC)
repository is not initialised: IndentationError('unindent does not match any outer indentation level', ('/var/lib/jenkins/jobs/cubicweb-3.23/workspace/TOXENV/py34-cubicweb/cubicweb/server/repository.py', 698, 64, ' with cnx.security_enabled(read=False, write=False):\n'))
======================================================================
SKIPPED: test_repr (unittest_rset.ResultSetTC)
repository is not initialised: IndentationError('unindent does not match any outer indentation level', ('/var/lib/jenkins/jobs/cubicweb-3.23/workspace/TOXENV/py34-cubicweb/cubicweb/server/repository.py', 698, 64, ' with cnx.security_enabled(read=False, write=False):\n'))
======================================================================
SKIPPED: test_searched_text (unittest_rset.ResultSetTC)
repository is not initialised: IndentationError('unindent does not match any outer indentation level', ('/var/lib/jenkins/jobs/cubicweb-3.23/workspace/TOXENV/py34-cubicweb/cubicweb/server/repository.py', 698, 64, ' with cnx.security_enabled(read=False, write=False):\n'))
======================================================================
SKIPPED: test_slice (unittest_rset.ResultSetTC)
repository is not initialised: IndentationError('unindent does not match any outer indentation level', ('/var/lib/jenkins/jobs/cubicweb-3.23/workspace/TOXENV/py34-cubicweb/cubicweb/server/repository.py', 698, 64, ' with cnx.security_enabled(read=False, write=False):\n'))
======================================================================
SKIPPED: test_sort (unittest_rset.ResultSetTC)
repository is not initialised: IndentationError('unindent does not match any outer indentation level', ('/var/lib/jenkins/jobs/cubicweb-3.23/workspace/TOXENV/py34-cubicweb/cubicweb/server/repository.py', 698, 64, ' with cnx.security_enabled(read=False, write=False):\n'))
======================================================================
SKIPPED: test_split (unittest_rset.ResultSetTC)
repository is not initialised: IndentationError('unindent does not match any outer indentation level', ('/var/lib/jenkins/jobs/cubicweb-3.23/workspace/TOXENV/py34-cubicweb/cubicweb/server/repository.py', 698, 64, ' with cnx.security_enabled(read=False, write=False):\n'))
======================================================================
SKIPPED: test_str (unittest_rset.ResultSetTC)
repository is not initialised: IndentationError('unindent does not match any outer indentation level', ('/var/lib/jenkins/jobs/cubicweb-3.23/workspace/TOXENV/py34-cubicweb/cubicweb/server/repository.py', 698, 64, ' with cnx.security_enabled(read=False, write=False):\n'))
======================================================================
SKIPPED: test_transform (unittest_rset.ResultSetTC)
repository is not initialised: IndentationError('unindent does not match any outer indentation level', ('/var/lib/jenkins/jobs/cubicweb-3.23/workspace/TOXENV/py34-cubicweb/cubicweb/server/repository.py', 698, 64, ' with cnx.security_enabled(read=False, write=False):\n'))
======================================================================
SKIPPED: test_union_limited_rql (unittest_rset.ResultSetTC)
repository is not initialised: IndentationError('unindent does not match any outer indentation level', ('/var/lib/jenkins/jobs/cubicweb-3.23/workspace/TOXENV/py34-cubicweb/cubicweb/server/repository.py', 698, 64, ' with cnx.security_enabled(read=False, write=False):\n'))
======================== unittest_entity.py ========================
ESSSSSSSSSSSSSSSSSSSSSSSSSSSSSSSSSSSSSSSSSSSSSSSSSSSSS
======================================================================
ERROR: test_absolute_url_empty_field (unittest_entity.EntityTC)
----------------------------------------------------------------------
Traceback (most recent call last)
File "/usr/lib/python3.4/unittest/case.py", line 58, in testPartExecutor
yield
File "/usr/lib/python3.4/unittest/case.py", line 573, in run
self.setUp()
File "/var/lib/jenkins/jobs/cubicweb-3.23/workspace/TOXENV/py34-cubicweb/cubicweb/test/unittest_entity.py", line 39, in setUp
super(EntityTC, self).setUp()
File "/var/lib/jenkins/jobs/cubicweb-3.23/workspace/TOXENV/py34-cubicweb/cubicweb/devtools/testlib.py", line 446, in setUp
self._init_repo()
File "/var/lib/jenkins/jobs/cubicweb-3.23/workspace/TOXENV/py34-cubicweb/cubicweb/devtools/testlib.py", line 354, in _init_repo
db_handler.build_db_cache(self.test_db_id, self.pre_setup_database)
File "/var/lib/jenkins/jobs/cubicweb-3.23/workspace/TOXENV/py34-cubicweb/cubicweb/devtools/__init__.py", line 492, in build_db_cache
self.init_test_database()
File "/var/lib/jenkins/jobs/cubicweb-3.23/workspace/TOXENV/py34-cubicweb/cubicweb/devtools/__init__.py", line 817, in init_test_database
init_config=self.init_config)
File "/var/lib/jenkins/jobs/cubicweb-3.23/workspace/TOXENV/py34-cubicweb/cubicweb/server/__init__.py", line 213, in init_repository
from cubicweb.server.repository import Repository
File "/var/lib/jenkins/jobs/cubicweb-3.23/workspace/TOXENV/py34-cubicweb/cubicweb/server/repository.py", line 698
with cnx.security_enabled(read=False, write=False):
^
IndentationError: unindent does not match any outer indentation level

no stdout
no stderr
======================================================================
SKIPPED: test_boolean_value (unittest_entity.EntityTC)
repository is not initialised: IndentationError('unindent does not match any outer indentation level', ('/var/lib/jenkins/jobs/cubicweb-3.23/workspace/TOXENV/py34-cubicweb/cubicweb/server/repository.py', 698, 64, ' with cnx.security_enabled(read=False, write=False):\n'))
======================================================================
SKIPPED: test_can_use_rest_path (unittest_entity.EntityTC)
repository is not initialised: IndentationError('unindent does not match any outer indentation level', ('/var/lib/jenkins/jobs/cubicweb-3.23/workspace/TOXENV/py34-cubicweb/cubicweb/server/repository.py', 698, 64, ' with cnx.security_enabled(read=False, write=False):\n'))
======================================================================
SKIPPED: test_complete_relation (unittest_entity.EntityTC)
repository is not initialised: IndentationError('unindent does not match any outer indentation level', ('/var/lib/jenkins/jobs/cubicweb-3.23/workspace/TOXENV/py34-cubicweb/cubicweb/server/repository.py', 698, 64, ' with cnx.security_enabled(read=False, write=False):\n'))
======================================================================
SKIPPED: test_copy (unittest_entity.EntityTC)
repository is not initialised: IndentationError('unindent does not match any outer indentation level', ('/var/lib/jenkins/jobs/cubicweb-3.23/workspace/TOXENV/py34-cubicweb/cubicweb/server/repository.py', 698, 64, ' with cnx.security_enabled(read=False, write=False):\n'))
======================================================================
SKIPPED: test_copy_with_composite (unittest_entity.EntityTC)
repository is not initialised: IndentationError('unindent does not match any outer indentation level', ('/var/lib/jenkins/jobs/cubicweb-3.23/workspace/TOXENV/py34-cubicweb/cubicweb/server/repository.py', 698, 64, ' with cnx.security_enabled(read=False, write=False):\n'))
======================================================================
SKIPPED: test_copy_with_non_initial_state (unittest_entity.EntityTC)
repository is not initialised: IndentationError('unindent does not match any outer indentation level', ('/var/lib/jenkins/jobs/cubicweb-3.23/workspace/TOXENV/py34-cubicweb/cubicweb/server/repository.py', 698, 64, ' with cnx.security_enabled(read=False, write=False):\n'))
======================================================================
SKIPPED: test_copy_with_nonmeta_composite_inlined (unittest_entity.EntityTC)
repository is not initialised: IndentationError('unindent does not match any outer indentation level', ('/var/lib/jenkins/jobs/cubicweb-3.23/workspace/TOXENV/py34-cubicweb/cubicweb/server/repository.py', 698, 64, ' with cnx.security_enabled(read=False, write=False):\n'))
======================================================================
SKIPPED: test_create_and_compare_entity (unittest_entity.EntityTC)
repository is not initialised: IndentationError('unindent does not match any outer indentation level', ('/var/lib/jenkins/jobs/cubicweb-3.23/workspace/TOXENV/py34-cubicweb/cubicweb/server/repository.py', 698, 64, ' with cnx.security_enabled(read=False, write=False):\n'))
======================================================================
SKIPPED: test_cw_instantiate_relation (unittest_entity.EntityTC)
repository is not initialised: IndentationError('unindent does not match any outer indentation level', ('/var/lib/jenkins/jobs/cubicweb-3.23/workspace/TOXENV/py34-cubicweb/cubicweb/server/repository.py', 698, 64, ' with cnx.security_enabled(read=False, write=False):\n'))
======================================================================
SKIPPED: test_cw_instantiate_reverse_relation (unittest_entity.EntityTC)
repository is not initialised: IndentationError('unindent does not match any outer indentation level', ('/var/lib/jenkins/jobs/cubicweb-3.23/workspace/TOXENV/py34-cubicweb/cubicweb/server/repository.py', 698, 64, ' with cnx.security_enabled(read=False, write=False):\n'))
======================================================================
SKIPPED: test_cw_linkable_rql (unittest_entity.EntityTC)
repository is not initialised: IndentationError('unindent does not match any outer indentation level', ('/var/lib/jenkins/jobs/cubicweb-3.23/workspace/TOXENV/py34-cubicweb/cubicweb/server/repository.py', 698, 64, ' with cnx.security_enabled(read=False, write=False):\n'))
======================================================================
SKIPPED: test_cw_set_attributes (unittest_entity.EntityTC)
repository is not initialised: IndentationError('unindent does not match any outer indentation level', ('/var/lib/jenkins/jobs/cubicweb-3.23/workspace/TOXENV/py34-cubicweb/cubicweb/server/repository.py', 698, 64, ' with cnx.security_enabled(read=False, write=False):\n'))
======================================================================
SKIPPED: test_cw_set_relations (unittest_entity.EntityTC)
repository is not initialised: IndentationError('unindent does not match any outer indentation level', ('/var/lib/jenkins/jobs/cubicweb-3.23/workspace/TOXENV/py34-cubicweb/cubicweb/server/repository.py', 698, 64, ' with cnx.security_enabled(read=False, write=False):\n'))
======================================================================
SKIPPED: test_fetch_rql (unittest_entity.EntityTC)
repository is not initialised: IndentationError('unindent does not match any outer indentation level', ('/var/lib/jenkins/jobs/cubicweb-3.23/workspace/TOXENV/py34-cubicweb/cubicweb/server/repository.py', 698, 64, ' with cnx.security_enabled(read=False, write=False):\n'))
======================================================================
SKIPPED: test_fulltextindex (unittest_entity.EntityTC)
repository is not initialised: IndentationError('unindent does not match any outer indentation level', ('/var/lib/jenkins/jobs/cubicweb-3.23/workspace/TOXENV/py34-cubicweb/cubicweb/server/repository.py', 698, 64, ' with cnx.security_enabled(read=False, write=False):\n'))
======================================================================
SKIPPED: test_has_eid (unittest_entity.EntityTC)
repository is not initialised: IndentationError('unindent does not match any outer indentation level', ('/var/lib/jenkins/jobs/cubicweb-3.23/workspace/TOXENV/py34-cubicweb/cubicweb/server/repository.py', 698, 64, ' with cnx.security_enabled(read=False, write=False):\n'))
======================================================================
SKIPPED: test_markdown_printable_value_string (unittest_entity.EntityTC)
repository is not initialised: IndentationError('unindent does not match any outer indentation level', ('/var/lib/jenkins/jobs/cubicweb-3.23/workspace/TOXENV/py34-cubicweb/cubicweb/server/repository.py', 698, 64, ' with cnx.security_enabled(read=False, write=False):\n'))
======================================================================
SKIPPED: test_metainformation_and_external_absolute_url (unittest_entity.EntityTC)
repository is not initialised: IndentationError('unindent does not match any outer indentation level', ('/var/lib/jenkins/jobs/cubicweb-3.23/workspace/TOXENV/py34-cubicweb/cubicweb/server/repository.py', 698, 64, ' with cnx.security_enabled(read=False, write=False):\n'))
======================================================================
SKIPPED: test_no_prefill_related_cache_bug (unittest_entity.EntityTC)
repository is not initialised: IndentationError('unindent does not match any outer indentation level', ('/var/lib/jenkins/jobs/cubicweb-3.23/workspace/TOXENV/py34-cubicweb/cubicweb/server/repository.py', 698, 64, ' with cnx.security_enabled(read=False, write=False):\n'))
======================================================================
SKIPPED: test_nonregr_relation_cache (unittest_entity.EntityTC)
repository is not initialised: IndentationError('unindent does not match any outer indentation level', ('/var/lib/jenkins/jobs/cubicweb-3.23/workspace/TOXENV/py34-cubicweb/cubicweb/server/repository.py', 698, 64, ' with cnx.security_enabled(read=False, write=False):\n'))
======================================================================
SKIPPED: test_printable_value_bad_html (unittest_entity.EntityTC)
make sure we don't crash if we try to render invalid XHTML strings
repository is not initialised: IndentationError('unindent does not match any outer indentation level', ('/var/lib/jenkins/jobs/cubicweb-3.23/workspace/TOXENV/py34-cubicweb/cubicweb/server/repository.py', 698, 64, ' with cnx.security_enabled(read=False, write=False):\n'))
======================================================================
SKIPPED: test_printable_value_bad_html_ms (unittest_entity.EntityTC)
repository is not initialised: IndentationError('unindent does not match any outer indentation level', ('/var/lib/jenkins/jobs/cubicweb-3.23/workspace/TOXENV/py34-cubicweb/cubicweb/server/repository.py', 698, 64, ' with cnx.security_enabled(read=False, write=False):\n'))
======================================================================
SKIPPED: test_printable_value_bytes (unittest_entity.EntityTC)
repository is not initialised: IndentationError('unindent does not match any outer indentation level', ('/var/lib/jenkins/jobs/cubicweb-3.23/workspace/TOXENV/py34-cubicweb/cubicweb/server/repository.py', 698, 64, ' with cnx.security_enabled(read=False, write=False):\n'))
======================================================================
SKIPPED: test_printable_value_string (unittest_entity.EntityTC)
repository is not initialised: IndentationError('unindent does not match any outer indentation level', ('/var/lib/jenkins/jobs/cubicweb-3.23/workspace/TOXENV/py34-cubicweb/cubicweb/server/repository.py', 698, 64, ' with cnx.security_enabled(read=False, write=False):\n'))
======================================================================
SKIPPED: test_related_cache_both (unittest_entity.EntityTC)
repository is not initialised: IndentationError('unindent does not match any outer indentation level', ('/var/lib/jenkins/jobs/cubicweb-3.23/workspace/TOXENV/py34-cubicweb/cubicweb/server/repository.py', 698, 64, ' with cnx.security_enabled(read=False, write=False):\n'))
======================================================================
SKIPPED: test_related_limit (unittest_entity.EntityTC)
repository is not initialised: IndentationError('unindent does not match any outer indentation level', ('/var/lib/jenkins/jobs/cubicweb-3.23/workspace/TOXENV/py34-cubicweb/cubicweb/server/repository.py', 698, 64, ' with cnx.security_enabled(read=False, write=False):\n'))
======================================================================
SKIPPED: test_related_rql_ambiguous_cant_use_fetch_order (unittest_entity.EntityTC)
repository is not initialised: IndentationError('unindent does not match any outer indentation level', ('/var/lib/jenkins/jobs/cubicweb-3.23/workspace/TOXENV/py34-cubicweb/cubicweb/server/repository.py', 698, 64, ' with cnx.security_enabled(read=False, write=False):\n'))
======================================================================
SKIPPED: test_related_rql_base (unittest_entity.EntityTC)
repository is not initialised: IndentationError('unindent does not match any outer indentation level', ('/var/lib/jenkins/jobs/cubicweb-3.23/workspace/TOXENV/py34-cubicweb/cubicweb/server/repository.py', 698, 64, ' with cnx.security_enabled(read=False, write=False):\n'))
======================================================================
SKIPPED: test_related_rql_fetch_ambiguous_rtype (unittest_entity.EntityTC)
repository is not initialised: IndentationError('unindent does not match any outer indentation level', ('/var/lib/jenkins/jobs/cubicweb-3.23/workspace/TOXENV/py34-cubicweb/cubicweb/server/repository.py', 698, 64, ' with cnx.security_enabled(read=False, write=False):\n'))
======================================================================
SKIPPED: test_related_targettypes (unittest_entity.EntityTC)
repository is not initialised: IndentationError('unindent does not match any outer indentation level', ('/var/lib/jenkins/jobs/cubicweb-3.23/workspace/TOXENV/py34-cubicweb/cubicweb/server/repository.py', 698, 64, ' with cnx.security_enabled(read=False, write=False):\n'))
======================================================================
SKIPPED: test_request_cache (unittest_entity.EntityTC)
repository is not initialised: IndentationError('unindent does not match any outer indentation level', ('/var/lib/jenkins/jobs/cubicweb-3.23/workspace/TOXENV/py34-cubicweb/cubicweb/server/repository.py', 698, 64, ' with cnx.security_enabled(read=False, write=False):\n'))
======================================================================
SKIPPED: test_rest_path (unittest_entity.EntityTC)
repository is not initialised: IndentationError('unindent does not match any outer indentation level', ('/var/lib/jenkins/jobs/cubicweb-3.23/workspace/TOXENV/py34-cubicweb/cubicweb/server/repository.py', 698, 64, ' with cnx.security_enabled(read=False, write=False):\n'))
======================================================================
SKIPPED: test_unrelated_base (unittest_entity.EntityTC)
repository is not initialised: IndentationError('unindent does not match any outer indentation level', ('/var/lib/jenkins/jobs/cubicweb-3.23/workspace/TOXENV/py34-cubicweb/cubicweb/server/repository.py', 698, 64, ' with cnx.security_enabled(read=False, write=False):\n'))
======================================================================
SKIPPED: test_unrelated_limit (unittest_entity.EntityTC)
repository is not initialised: IndentationError('unindent does not match any outer indentation level', ('/var/lib/jenkins/jobs/cubicweb-3.23/workspace/TOXENV/py34-cubicweb/cubicweb/server/repository.py', 698, 64, ' with cnx.security_enabled(read=False, write=False):\n'))
======================================================================
SKIPPED: test_unrelated_new_entity (unittest_entity.EntityTC)
repository is not initialised: IndentationError('unindent does not match any outer indentation level', ('/var/lib/jenkins/jobs/cubicweb-3.23/workspace/TOXENV/py34-cubicweb/cubicweb/server/repository.py', 698, 64, ' with cnx.security_enabled(read=False, write=False):\n'))
======================================================================
SKIPPED: test_unrelated_rql_constraints_creation_object (unittest_entity.EntityTC)
repository is not initialised: IndentationError('unindent does not match any outer indentation level', ('/var/lib/jenkins/jobs/cubicweb-3.23/workspace/TOXENV/py34-cubicweb/cubicweb/server/repository.py', 698, 64, ' with cnx.security_enabled(read=False, write=False):\n'))
======================================================================
SKIPPED: test_unrelated_rql_constraints_creation_subject (unittest_entity.EntityTC)
repository is not initialised: IndentationError('unindent does not match any outer indentation level', ('/var/lib/jenkins/jobs/cubicweb-3.23/workspace/TOXENV/py34-cubicweb/cubicweb/server/repository.py', 698, 64, ' with cnx.security_enabled(read=False, write=False):\n'))
======================================================================
SKIPPED: test_unrelated_rql_constraints_edition_object (unittest_entity.EntityTC)
repository is not initialised: IndentationError('unindent does not match any outer indentation level', ('/var/lib/jenkins/jobs/cubicweb-3.23/workspace/TOXENV/py34-cubicweb/cubicweb/server/repository.py', 698, 64, ' with cnx.security_enabled(read=False, write=False):\n'))
======================================================================
SKIPPED: test_unrelated_rql_constraints_edition_subject (unittest_entity.EntityTC)
repository is not initialised: IndentationError('unindent does not match any outer indentation level', ('/var/lib/jenkins/jobs/cubicweb-3.23/workspace/TOXENV/py34-cubicweb/cubicweb/server/repository.py', 698, 64, ' with cnx.security_enabled(read=False, write=False):\n'))
======================================================================
SKIPPED: test_unrelated_rql_o_linkto_o (unittest_entity.EntityTC)
repository is not initialised: IndentationError('unindent does not match any outer indentation level', ('/var/lib/jenkins/jobs/cubicweb-3.23/workspace/TOXENV/py34-cubicweb/cubicweb/server/repository.py', 698, 64, ' with cnx.security_enabled(read=False, write=False):\n'))
======================================================================
SKIPPED: test_unrelated_rql_o_linkto_s (unittest_entity.EntityTC)
repository is not initialised: IndentationError('unindent does not match any outer indentation level', ('/var/lib/jenkins/jobs/cubicweb-3.23/workspace/TOXENV/py34-cubicweb/cubicweb/server/repository.py', 698, 64, ' with cnx.security_enabled(read=False, write=False):\n'))
======================================================================
SKIPPED: test_unrelated_rql_s_linkto_o (unittest_entity.EntityTC)
repository is not initialised: IndentationError('unindent does not match any outer indentation level', ('/var/lib/jenkins/jobs/cubicweb-3.23/workspace/TOXENV/py34-cubicweb/cubicweb/server/repository.py', 698, 64, ' with cnx.security_enabled(read=False, write=False):\n'))
======================================================================
SKIPPED: test_unrelated_rql_s_linkto_s (unittest_entity.EntityTC)
repository is not initialised: IndentationError('unindent does not match any outer indentation level', ('/var/lib/jenkins/jobs/cubicweb-3.23/workspace/TOXENV/py34-cubicweb/cubicweb/server/repository.py', 698, 64, ' with cnx.security_enabled(read=False, write=False):\n'))
======================================================================
SKIPPED: test_unrelated_rql_s_linkto_s_no_info (unittest_entity.EntityTC)
repository is not initialised: IndentationError('unindent does not match any outer indentation level', ('/var/lib/jenkins/jobs/cubicweb-3.23/workspace/TOXENV/py34-cubicweb/cubicweb/server/repository.py', 698, 64, ' with cnx.security_enabled(read=False, write=False):\n'))
======================================================================
SKIPPED: test_unrelated_rql_s_linkto_s_unused_info (unittest_entity.EntityTC)
repository is not initialised: IndentationError('unindent does not match any outer indentation level', ('/var/lib/jenkins/jobs/cubicweb-3.23/workspace/TOXENV/py34-cubicweb/cubicweb/server/repository.py', 698, 64, ' with cnx.security_enabled(read=False, write=False):\n'))
======================================================================
SKIPPED: test_unrelated_rql_security_1_anon (unittest_entity.EntityTC)
repository is not initialised: IndentationError('unindent does not match any outer indentation level', ('/var/lib/jenkins/jobs/cubicweb-3.23/workspace/TOXENV/py34-cubicweb/cubicweb/server/repository.py', 698, 64, ' with cnx.security_enabled(read=False, write=False):\n'))
======================================================================
SKIPPED: test_unrelated_rql_security_1_manager (unittest_entity.EntityTC)
repository is not initialised: IndentationError('unindent does not match any outer indentation level', ('/var/lib/jenkins/jobs/cubicweb-3.23/workspace/TOXENV/py34-cubicweb/cubicweb/server/repository.py', 698, 64, ' with cnx.security_enabled(read=False, write=False):\n'))
======================================================================
SKIPPED: test_unrelated_rql_security_1_user (unittest_entity.EntityTC)
repository is not initialised: IndentationError('unindent does not match any outer indentation level', ('/var/lib/jenkins/jobs/cubicweb-3.23/workspace/TOXENV/py34-cubicweb/cubicweb/server/repository.py', 698, 64, ' with cnx.security_enabled(read=False, write=False):\n'))
======================================================================
SKIPPED: test_unrelated_rql_security_2 (unittest_entity.EntityTC)
repository is not initialised: IndentationError('unindent does not match any outer indentation level', ('/var/lib/jenkins/jobs/cubicweb-3.23/workspace/TOXENV/py34-cubicweb/cubicweb/server/repository.py', 698, 64, ' with cnx.security_enabled(read=False, write=False):\n'))
======================================================================
SKIPPED: test_unrelated_rql_security_nonexistant (unittest_entity.EntityTC)
repository is not initialised: IndentationError('unindent does not match any outer indentation level', ('/var/lib/jenkins/jobs/cubicweb-3.23/workspace/TOXENV/py34-cubicweb/cubicweb/server/repository.py', 698, 64, ' with cnx.security_enabled(read=False, write=False):\n'))
======================================================================
SKIPPED: test_unrelated_rql_security_rel_perms (unittest_entity.EntityTC)
check `connait` add permission has no effect for a new entity on the
repository is not initialised: IndentationError('unindent does not match any outer indentation level', ('/var/lib/jenkins/jobs/cubicweb-3.23/workspace/TOXENV/py34-cubicweb/cubicweb/server/repository.py', 698, 64, ' with cnx.security_enabled(read=False, write=False):\n'))
======================================================================
SKIPPED: test_unrelated_security (unittest_entity.EntityTC)
repository is not initialised: IndentationError('unindent does not match any outer indentation level', ('/var/lib/jenkins/jobs/cubicweb-3.23/workspace/TOXENV/py34-cubicweb/cubicweb/server/repository.py', 698, 64, ' with cnx.security_enabled(read=False, write=False):\n'))
======================================================================
SKIPPED: test_yams_inheritance (unittest_entity.EntityTC)
repository is not initialised: IndentationError('unindent does not match any outer indentation level', ('/var/lib/jenkins/jobs/cubicweb-3.23/workspace/TOXENV/py34-cubicweb/cubicweb/server/repository.py', 698, 64, ' with cnx.security_enabled(read=False, write=False):\n'))
======================= unittest_spa2rql.py ========================
unhandled exception occurred while testing unittest_spa2rql
Traceback (most recent call last):
File "/var/lib/jenkins/jobs/cubicweb-3.23/workspace/TOXENV/py34-cubicweb/.tox/py34-cubicweb/lib/python3.4/site-packages/logilab/common/pytest.py", line 390, in testfile
options=self.options, outstream=sys.stderr)
File "/var/lib/jenkins/jobs/cubicweb-3.23/workspace/TOXENV/py34-cubicweb/.tox/py34-cubicweb/lib/python3.4/site-packages/logilab/common/pytest.py", line 706, in __init__
testLoader=NonStrictTestLoader())
File "/usr/lib/python3.4/unittest/main.py", line 63, in __init__
self.module = __import__(module)
File "/var/lib/jenkins/jobs/cubicweb-3.23/workspace/TOXENV/py34-cubicweb/cubicweb/test/unittest_spa2rql.py", line 37, in <module>
config.bootstrap_cubes()
File "/var/lib/jenkins/jobs/cubicweb-3.23/workspace/TOXENV/py34-cubicweb/cubicweb/devtools/__init__.py", line 184, in bootstrap_cubes
super(TestServerConfiguration, self).bootstrap_cubes()
File "/var/lib/jenkins/jobs/cubicweb-3.23/workspace/TOXENV/py34-cubicweb/cubicweb/server/serverconfig.py", line 244, in bootstrap_cubes
self.init_cubes(self.expand_cubes(splitstrip(line)))
File "/var/lib/jenkins/jobs/cubicweb-3.23/workspace/TOXENV/py34-cubicweb/cubicweb/cwconfig.py", line 1069, in init_cubes
super(CubicWebConfiguration, self).init_cubes(cubes)
File "/var/lib/jenkins/jobs/cubicweb-3.23/workspace/TOXENV/py34-cubicweb/cubicweb/cwconfig.py", line 824, in init_cubes
self.load_site_cubicweb()
File "/var/lib/jenkins/jobs/cubicweb-3.23/workspace/TOXENV/py34-cubicweb/cubicweb/cwconfig.py", line 779, in load_site_cubicweb
self._load_site_cubicweb(sitefile)
File "/var/lib/jenkins/jobs/cubicweb-3.23/workspace/TOXENV/py34-cubicweb/cubicweb/cwconfig.py", line 1152, in _load_site_cubicweb
mod = super(CubicWebConfiguration, self)._load_site_cubicweb(sitefile)
File "/var/lib/jenkins/jobs/cubicweb-3.23/workspace/TOXENV/py34-cubicweb/cubicweb/cwconfig.py", line 785, in _load_site_cubicweb
module = load_module_from_modpath(modpath_from_file(sitefile, self.extrapath))
File "/var/lib/jenkins/jobs/cubicweb-3.23/workspace/TOXENV/py34-cubicweb/.tox/py34-cubicweb/lib/python3.4/site-packages/logilab/common/modutils.py", line 169, in load_module_from_modpath
module = load_module(curname, mp_file, mp_filename, mp_desc)
File "/var/lib/jenkins/jobs/cubicweb-3.23/workspace/TOXENV/py34-cubicweb/.tox/py34-cubicweb/lib/python3.4/imp.py", line 235, in load_module
return load_source(name, filename, file)
File "/var/lib/jenkins/jobs/cubicweb-3.23/workspace/TOXENV/py34-cubicweb/.tox/py34-cubicweb/lib/python3.4/imp.py", line 171, in load_source
module = methods.load()
File "/var/lib/jenkins/jobs/cubicweb-3.23/workspace/TOXENV/py34-cubicweb/.tox/py34-cubicweb/share/cubicweb/cubes/localperms/site_cubicweb.py", line 18, in <module>
from cubicweb.server import repository, session
File "/var/lib/jenkins/jobs/cubicweb-3.23/workspace/TOXENV/py34-cubicweb/cubicweb/server/repository.py", line 698
with cnx.security_enabled(read=False, write=False):
^
IndentationError: unindent does not match any outer indentation level
======================= unittest_repoapi.py ========================
ESSS
======================================================================
ERROR: test_anonymous_connect (unittest_repoapi.REPOAPITC)
check that you can get anonymous connection when the data exist
----------------------------------------------------------------------
Traceback (most recent call last)
File "/usr/lib/python3.4/unittest/case.py", line 58, in testPartExecutor
yield
File "/usr/lib/python3.4/unittest/case.py", line 573, in run
self.setUp()
File "/var/lib/jenkins/jobs/cubicweb-3.23/workspace/TOXENV/py34-cubicweb/cubicweb/devtools/testlib.py", line 446, in setUp
self._init_repo()
File "/var/lib/jenkins/jobs/cubicweb-3.23/workspace/TOXENV/py34-cubicweb/cubicweb/devtools/testlib.py", line 354, in _init_repo
db_handler.build_db_cache(self.test_db_id, self.pre_setup_database)
File "/var/lib/jenkins/jobs/cubicweb-3.23/workspace/TOXENV/py34-cubicweb/cubicweb/devtools/__init__.py", line 492, in build_db_cache
self.init_test_database()
File "/var/lib/jenkins/jobs/cubicweb-3.23/workspace/TOXENV/py34-cubicweb/cubicweb/devtools/__init__.py", line 817, in init_test_database
init_config=self.init_config)
File "/var/lib/jenkins/jobs/cubicweb-3.23/workspace/TOXENV/py34-cubicweb/cubicweb/server/__init__.py", line 213, in init_repository
from cubicweb.server.repository import Repository
File "/var/lib/jenkins/jobs/cubicweb-3.23/workspace/TOXENV/py34-cubicweb/cubicweb/server/repository.py", line 698
with cnx.security_enabled(read=False, write=False):
^
IndentationError: unindent does not match any outer indentation level

no stdout
no stderr
======================================================================
SKIPPED: test_cnx_basic_usage (unittest_repoapi.REPOAPITC)
Test that a client connection can be used to access the database
repository is not initialised: IndentationError('unindent does not match any outer indentation level', ('/var/lib/jenkins/jobs/cubicweb-3.23/workspace/TOXENV/py34-cubicweb/cubicweb/server/repository.py', 698, 64, ' with cnx.security_enabled(read=False, write=False):\n'))
======================================================================
SKIPPED: test_cnx_life_cycle (unittest_repoapi.REPOAPITC)
Check that ClientConnection requires explicit open and close
repository is not initialised: IndentationError('unindent does not match any outer indentation level', ('/var/lib/jenkins/jobs/cubicweb-3.23/workspace/TOXENV/py34-cubicweb/cubicweb/server/repository.py', 698, 64, ' with cnx.security_enabled(read=False, write=False):\n'))
======================================================================
SKIPPED: test_connect (unittest_repoapi.REPOAPITC)
check that repoapi.connect works and returns a usable connection
repository is not initialised: IndentationError('unindent does not match any outer indentation level', ('/var/lib/jenkins/jobs/cubicweb-3.23/workspace/TOXENV/py34-cubicweb/cubicweb/server/repository.py', 698, 64, ' with cnx.security_enabled(read=False, write=False):\n'))
======================== unittest_binary.py ========================
....
======================== unittest_schema.py ========================
unhandled exception occurred while testing unittest_schema
Traceback (most recent call last):
File "/var/lib/jenkins/jobs/cubicweb-3.23/workspace/TOXENV/py34-cubicweb/.tox/py34-cubicweb/lib/python3.4/site-packages/logilab/common/pytest.py", line 390, in testfile
options=self.options, outstream=sys.stderr)
File "/var/lib/jenkins/jobs/cubicweb-3.23/workspace/TOXENV/py34-cubicweb/.tox/py34-cubicweb/lib/python3.4/site-packages/logilab/common/pytest.py", line 706, in __init__
testLoader=NonStrictTestLoader())
File "/usr/lib/python3.4/unittest/main.py", line 63, in __init__
self.module = __import__(module)
File "/var/lib/jenkins/jobs/cubicweb-3.23/workspace/TOXENV/py34-cubicweb/cubicweb/test/unittest_schema.py", line 147, in <module>
config.bootstrap_cubes()
File "/var/lib/jenkins/jobs/cubicweb-3.23/workspace/TOXENV/py34-cubicweb/cubicweb/devtools/__init__.py", line 184, in bootstrap_cubes
super(TestServerConfiguration, self).bootstrap_cubes()
File "/var/lib/jenkins/jobs/cubicweb-3.23/workspace/TOXENV/py34-cubicweb/cubicweb/server/serverconfig.py", line 244, in bootstrap_cubes
self.init_cubes(self.expand_cubes(splitstrip(line)))
File "/var/lib/jenkins/jobs/cubicweb-3.23/workspace/TOXENV/py34-cubicweb/cubicweb/cwconfig.py", line 1069, in init_cubes
super(CubicWebConfiguration, self).init_cubes(cubes)
File "/var/lib/jenkins/jobs/cubicweb-3.23/workspace/TOXENV/py34-cubicweb/cubicweb/cwconfig.py", line 824, in init_cubes
self.load_site_cubicweb()
File "/var/lib/jenkins/jobs/cubicweb-3.23/workspace/TOXENV/py34-cubicweb/cubicweb/cwconfig.py", line 779, in load_site_cubicweb
self._load_site_cubicweb(sitefile)
File "/var/lib/jenkins/jobs/cubicweb-3.23/workspace/TOXENV/py34-cubicweb/cubicweb/cwconfig.py", line 1152, in _load_site_cubicweb
mod = super(CubicWebConfiguration, self)._load_site_cubicweb(sitefile)
File "/var/lib/jenkins/jobs/cubicweb-3.23/workspace/TOXENV/py34-cubicweb/cubicweb/cwconfig.py", line 785, in _load_site_cubicweb
module = load_module_from_modpath(modpath_from_file(sitefile, self.extrapath))
File "/var/lib/jenkins/jobs/cubicweb-3.23/workspace/TOXENV/py34-cubicweb/.tox/py34-cubicweb/lib/python3.4/site-packages/logilab/common/modutils.py", line 169, in load_module_from_modpath
module = load_module(curname, mp_file, mp_filename, mp_desc)
File "/var/lib/jenkins/jobs/cubicweb-3.23/workspace/TOXENV/py34-cubicweb/.tox/py34-cubicweb/lib/python3.4/imp.py", line 235, in load_module
return load_source(name, filename, file)
File "/var/lib/jenkins/jobs/cubicweb-3.23/workspace/TOXENV/py34-cubicweb/.tox/py34-cubicweb/lib/python3.4/imp.py", line 171, in load_source
module = methods.load()
File "/var/lib/jenkins/jobs/cubicweb-3.23/workspace/TOXENV/py34-cubicweb/.tox/py34-cubicweb/share/cubicweb/cubes/localperms/site_cubicweb.py", line 18, in <module>
from cubicweb.server import repository, session
File "/var/lib/jenkins/jobs/cubicweb-3.23/workspace/TOXENV/py34-cubicweb/cubicweb/server/repository.py", line 698
with cnx.security_enabled(read=False, write=False):
^
IndentationError: unindent does not match any outer indentation level
====================== unittest_predicates.py ======================
EESSSESSSS..EESSEESSESSESSSS
======================================================================
ERROR: test_multiple_entity_types_rset (unittest_predicates.AdaptablePredicateTC)
----------------------------------------------------------------------
Traceback (most recent call last)
File "/usr/lib/python3.4/unittest/case.py", line 58, in testPartExecutor
yield
File "/usr/lib/python3.4/unittest/case.py", line 573, in run
self.setUp()
File "/var/lib/jenkins/jobs/cubicweb-3.23/workspace/TOXENV/py34-cubicweb/cubicweb/devtools/testlib.py", line 446, in setUp
self._init_repo()
File "/var/lib/jenkins/jobs/cubicweb-3.23/workspace/TOXENV/py34-cubicweb/cubicweb/devtools/testlib.py", line 354, in _init_repo
db_handler.build_db_cache(self.test_db_id, self.pre_setup_database)
File "/var/lib/jenkins/jobs/cubicweb-3.23/workspace/TOXENV/py34-cubicweb/cubicweb/devtools/__init__.py", line 492, in build_db_cache
self.init_test_database()
File "/var/lib/jenkins/jobs/cubicweb-3.23/workspace/TOXENV/py34-cubicweb/cubicweb/devtools/__init__.py", line 817, in init_test_database
init_config=self.init_config)
File "/var/lib/jenkins/jobs/cubicweb-3.23/workspace/TOXENV/py34-cubicweb/cubicweb/server/__init__.py", line 213, in init_repository
from cubicweb.server.repository import Repository
File "/var/lib/jenkins/jobs/cubicweb-3.23/workspace/TOXENV/py34-cubicweb/cubicweb/server/repository.py", line 698
with cnx.security_enabled(read=False, write=False):
^
IndentationError: unindent does not match any outer indentation level

no stdout
no stderr
======================================================================
ERROR: test_etype_inheritance_no_yams_inheritance (unittest_predicates.ImplementsTC)
----------------------------------------------------------------------
Traceback (most recent call last)
File "/usr/lib/python3.4/unittest/case.py", line 58, in testPartExecutor
yield
File "/usr/lib/python3.4/unittest/case.py", line 573, in run
self.setUp()
File "/var/lib/jenkins/jobs/cubicweb-3.23/workspace/TOXENV/py34-cubicweb/cubicweb/devtools/testlib.py", line 446, in setUp
self._init_repo()
File "/var/lib/jenkins/jobs/cubicweb-3.23/workspace/TOXENV/py34-cubicweb/cubicweb/devtools/testlib.py", line 354, in _init_repo
db_handler.build_db_cache(self.test_db_id, self.pre_setup_database)
File "/var/lib/jenkins/jobs/cubicweb-3.23/workspace/TOXENV/py34-cubicweb/cubicweb/devtools/__init__.py", line 492, in build_db_cache
self.init_test_database()
File "/var/lib/jenkins/jobs/cubicweb-3.23/workspace/TOXENV/py34-cubicweb/cubicweb/devtools/__init__.py", line 817, in init_test_database
init_config=self.init_config)
File "/var/lib/jenkins/jobs/cubicweb-3.23/workspace/TOXENV/py34-cubicweb/cubicweb/server/__init__.py", line 213, in init_repository
from cubicweb.server.repository import Repository
File "/var/lib/jenkins/jobs/cubicweb-3.23/workspace/TOXENV/py34-cubicweb/cubicweb/server/repository.py", line 698
with cnx.security_enabled(read=False, write=False):
^
IndentationError: unindent does not match any outer indentation level

no stdout
no stderr
======================================================================
ERROR: test_invalid_calls (unittest_predicates.MatchFormParamsTC)
checks invalid calls raise a ValueError
----------------------------------------------------------------------
Traceback (most recent call last)
File "/usr/lib/python3.4/unittest/case.py", line 58, in testPartExecutor
yield
File "/usr/lib/python3.4/unittest/case.py", line 573, in run
self.setUp()
File "/var/lib/jenkins/jobs/cubicweb-3.23/workspace/TOXENV/py34-cubicweb/cubicweb/devtools/testlib.py", line 446, in setUp
self._init_repo()
File "/var/lib/jenkins/jobs/cubicweb-3.23/workspace/TOXENV/py34-cubicweb/cubicweb/devtools/testlib.py", line 354, in _init_repo
db_handler.build_db_cache(self.test_db_id, self.pre_setup_database)
File "/var/lib/jenkins/jobs/cubicweb-3.23/workspace/TOXENV/py34-cubicweb/cubicweb/devtools/__init__.py", line 492, in build_db_cache
self.init_test_database()
File "/var/lib/jenkins/jobs/cubicweb-3.23/workspace/TOXENV/py34-cubicweb/cubicweb/devtools/__init__.py", line 817, in init_test_database
init_config=self.init_config)
File "/var/lib/jenkins/jobs/cubicweb-3.23/workspace/TOXENV/py34-cubicweb/cubicweb/server/__init__.py", line 213, in init_repository
from cubicweb.server.repository import Repository
File "/var/lib/jenkins/jobs/cubicweb-3.23/workspace/TOXENV/py34-cubicweb/cubicweb/server/repository.py", line 698
with cnx.security_enabled(read=False, write=False):
^
IndentationError: unindent does not match any outer indentation level

no stdout
no stderr
======================================================================
ERROR: test_owners_group (unittest_predicates.MatchUserGroupsTC)
tests usage of 'owners' group with match_user_group
----------------------------------------------------------------------
Traceback (most recent call last)
File "/usr/lib/python3.4/unittest/case.py", line 58, in testPartExecutor
yield
File "/usr/lib/python3.4/unittest/case.py", line 573, in run
self.setUp()
File "/var/lib/jenkins/jobs/cubicweb-3.23/workspace/TOXENV/py34-cubicweb/cubicweb/devtools/testlib.py", line 446, in setUp
self._init_repo()
File "/var/lib/jenkins/jobs/cubicweb-3.23/workspace/TOXENV/py34-cubicweb/cubicweb/devtools/testlib.py", line 354, in _init_repo
db_handler.build_db_cache(self.test_db_id, self.pre_setup_database)
File "/var/lib/jenkins/jobs/cubicweb-3.23/workspace/TOXENV/py34-cubicweb/cubicweb/devtools/__init__.py", line 492, in build_db_cache
self.init_test_database()
File "/var/lib/jenkins/jobs/cubicweb-3.23/workspace/TOXENV/py34-cubicweb/cubicweb/devtools/__init__.py", line 817, in init_test_database
init_config=self.init_config)
File "/var/lib/jenkins/jobs/cubicweb-3.23/workspace/TOXENV/py34-cubicweb/cubicweb/server/__init__.py", line 213, in init_repository
from cubicweb.server.repository import Repository
File "/var/lib/jenkins/jobs/cubicweb-3.23/workspace/TOXENV/py34-cubicweb/cubicweb/server/repository.py", line 698
with cnx.security_enabled(read=False, write=False):
^
IndentationError: unindent does not match any outer indentation level

no stdout
no stderr
======================================================================
ERROR: test_default_op_in_selector (unittest_predicates.MultiLinesRsetTC)
----------------------------------------------------------------------
Traceback (most recent call last)
File "/usr/lib/python3.4/unittest/case.py", line 58, in testPartExecutor
yield
File "/usr/lib/python3.4/unittest/case.py", line 573, in run
self.setUp()
File "/var/lib/jenkins/jobs/cubicweb-3.23/workspace/TOXENV/py34-cubicweb/cubicweb/devtools/testlib.py", line 446, in setUp
self._init_repo()
File "/var/lib/jenkins/jobs/cubicweb-3.23/workspace/TOXENV/py34-cubicweb/cubicweb/devtools/testlib.py", line 354, in _init_repo
db_handler.build_db_cache(self.test_db_id, self.pre_setup_database)
File "/var/lib/jenkins/jobs/cubicweb-3.23/workspace/TOXENV/py34-cubicweb/cubicweb/devtools/__init__.py", line 492, in build_db_cache
self.init_test_database()
File "/var/lib/jenkins/jobs/cubicweb-3.23/workspace/TOXENV/py34-cubicweb/cubicweb/devtools/__init__.py", line 817, in init_test_database
init_config=self.init_config)
File "/var/lib/jenkins/jobs/cubicweb-3.23/workspace/TOXENV/py34-cubicweb/cubicweb/server/__init__.py", line 213, in init_repository
from cubicweb.server.repository import Repository
File "/var/lib/jenkins/jobs/cubicweb-3.23/workspace/TOXENV/py34-cubicweb/cubicweb/server/repository.py", line 698
with cnx.security_enabled(read=False, write=False):
^
IndentationError: unindent does not match any outer indentation level

no stdout
no stderr
======================================================================
ERROR: test_paginated_rset (unittest_predicates.PaginatedTC)
----------------------------------------------------------------------
Traceback (most recent call last)
File "/usr/lib/python3.4/unittest/case.py", line 58, in testPartExecutor
yield
File "/usr/lib/python3.4/unittest/case.py", line 573, in run
self.setUp()
File "/var/lib/jenkins/jobs/cubicweb-3.23/workspace/TOXENV/py34-cubicweb/cubicweb/devtools/testlib.py", line 446, in setUp
self._init_repo()
File "/var/lib/jenkins/jobs/cubicweb-3.23/workspace/TOXENV/py34-cubicweb/cubicweb/devtools/testlib.py", line 354, in _init_repo
db_handler.build_db_cache(self.test_db_id, self.pre_setup_database)
File "/var/lib/jenkins/jobs/cubicweb-3.23/workspace/TOXENV/py34-cubicweb/cubicweb/devtools/__init__.py", line 492, in build_db_cache
self.init_test_database()
File "/var/lib/jenkins/jobs/cubicweb-3.23/workspace/TOXENV/py34-cubicweb/cubicweb/devtools/__init__.py", line 817, in init_test_database
init_config=self.init_config)
File "/var/lib/jenkins/jobs/cubicweb-3.23/workspace/TOXENV/py34-cubicweb/cubicweb/server/__init__.py", line 213, in init_repository
from cubicweb.server.repository import Repository
File "/var/lib/jenkins/jobs/cubicweb-3.23/workspace/TOXENV/py34-cubicweb/cubicweb/server/repository.py", line 698
with cnx.security_enabled(read=False, write=False):
^
IndentationError: unindent does not match any outer indentation level

no stdout
no stderr
======================================================================
ERROR: test_ambiguous (unittest_predicates.RelationPossibleTC)
----------------------------------------------------------------------
Traceback (most recent call last)
File "/usr/lib/python3.4/unittest/case.py", line 58, in testPartExecutor
yield
File "/usr/lib/python3.4/unittest/case.py", line 573, in run
self.setUp()
File "/var/lib/jenkins/jobs/cubicweb-3.23/workspace/TOXENV/py34-cubicweb/cubicweb/devtools/testlib.py", line 446, in setUp
self._init_repo()
File "/var/lib/jenkins/jobs/cubicweb-3.23/workspace/TOXENV/py34-cubicweb/cubicweb/devtools/testlib.py", line 354, in _init_repo
db_handler.build_db_cache(self.test_db_id, self.pre_setup_database)
File "/var/lib/jenkins/jobs/cubicweb-3.23/workspace/TOXENV/py34-cubicweb/cubicweb/devtools/__init__.py", line 492, in build_db_cache
self.init_test_database()
File "/var/lib/jenkins/jobs/cubicweb-3.23/workspace/TOXENV/py34-cubicweb/cubicweb/devtools/__init__.py", line 817, in init_test_database
init_config=self.init_config)
File "/var/lib/jenkins/jobs/cubicweb-3.23/workspace/TOXENV/py34-cubicweb/cubicweb/server/__init__.py", line 213, in init_repository
from cubicweb.server.repository import Repository
File "/var/lib/jenkins/jobs/cubicweb-3.23/workspace/TOXENV/py34-cubicweb/cubicweb/server/repository.py", line 698
with cnx.security_enabled(read=False, write=False):
^
IndentationError: unindent does not match any outer indentation level

no stdout
no stderr
======================================================================
ERROR: test_intscore_entity_selector (unittest_predicates.ScoreEntityTC)
----------------------------------------------------------------------
Traceback (most recent call last)
File "/usr/lib/python3.4/unittest/case.py", line 58, in testPartExecutor
yield
File "/usr/lib/python3.4/unittest/case.py", line 573, in run
self.setUp()
File "/var/lib/jenkins/jobs/cubicweb-3.23/workspace/TOXENV/py34-cubicweb/cubicweb/devtools/testlib.py", line 446, in setUp
self._init_repo()
File "/var/lib/jenkins/jobs/cubicweb-3.23/workspace/TOXENV/py34-cubicweb/cubicweb/devtools/testlib.py", line 354, in _init_repo
db_handler.build_db_cache(self.test_db_id, self.pre_setup_database)
File "/var/lib/jenkins/jobs/cubicweb-3.23/workspace/TOXENV/py34-cubicweb/cubicweb/devtools/__init__.py", line 492, in build_db_cache
self.init_test_database()
File "/var/lib/jenkins/jobs/cubicweb-3.23/workspace/TOXENV/py34-cubicweb/cubicweb/devtools/__init__.py", line 817, in init_test_database
init_config=self.init_config)
File "/var/lib/jenkins/jobs/cubicweb-3.23/workspace/TOXENV/py34-cubicweb/cubicweb/server/__init__.py", line 213, in init_repository
from cubicweb.server.repository import Repository
File "/var/lib/jenkins/jobs/cubicweb-3.23/workspace/TOXENV/py34-cubicweb/cubicweb/server/repository.py", line 698
with cnx.security_enabled(read=False, write=False):
^
IndentationError: unindent does not match any outer indentation level

no stdout
no stderr
======================================================================
ERROR: test_is_in_state (unittest_predicates.WorkflowSelectorTC)
----------------------------------------------------------------------
Traceback (most recent call last)
File "/usr/lib/python3.4/unittest/case.py", line 58, in testPartExecutor
yield
File "/usr/lib/python3.4/unittest/case.py", line 573, in run
self.setUp()
File "/var/lib/jenkins/jobs/cubicweb-3.23/workspace/TOXENV/py34-cubicweb/cubicweb/test/unittest_predicates.py", line 73, in setUp
super(WorkflowSelectorTC, self).setUp()
File "/var/lib/jenkins/jobs/cubicweb-3.23/workspace/TOXENV/py34-cubicweb/cubicweb/devtools/testlib.py", line 446, in setUp
self._init_repo()
File "/var/lib/jenkins/jobs/cubicweb-3.23/workspace/TOXENV/py34-cubicweb/cubicweb/devtools/testlib.py", line 354, in _init_repo
db_handler.build_db_cache(self.test_db_id, self.pre_setup_database)
File "/var/lib/jenkins/jobs/cubicweb-3.23/workspace/TOXENV/py34-cubicweb/cubicweb/devtools/__init__.py", line 492, in build_db_cache
self.init_test_database()
File "/var/lib/jenkins/jobs/cubicweb-3.23/workspace/TOXENV/py34-cubicweb/cubicweb/devtools/__init__.py", line 817, in init_test_database
init_config=self.init_config)
File "/var/lib/jenkins/jobs/cubicweb-3.23/workspace/TOXENV/py34-cubicweb/cubicweb/server/__init__.py", line 213, in init_repository
from cubicweb.server.repository import Repository
File "/var/lib/jenkins/jobs/cubicweb-3.23/workspace/TOXENV/py34-cubicweb/cubicweb/server/repository.py", line 698
with cnx.security_enabled(read=False, write=False):
^
IndentationError: unindent does not match any outer indentation level

no stdout
no stderr
======================================================================
SKIPPED: test_etype_priority (unittest_predicates.ImplementsTC)
repository is not initialised: IndentationError('unindent does not match any outer indentation level', ('/var/lib/jenkins/jobs/cubicweb-3.23/workspace/TOXENV/py34-cubicweb/cubicweb/server/repository.py', 698, 64, ' with cnx.security_enabled(read=False, write=False):\n'))
======================================================================
SKIPPED: test_outer_join (unittest_predicates.ImplementsTC)
repository is not initialised: IndentationError('unindent does not match any outer indentation level', ('/var/lib/jenkins/jobs/cubicweb-3.23/workspace/TOXENV/py34-cubicweb/cubicweb/server/repository.py', 698, 64, ' with cnx.security_enabled(read=False, write=False):\n'))
======================================================================
SKIPPED: test_yams_inheritance (unittest_predicates.ImplementsTC)
repository is not initialised: IndentationError('unindent does not match any outer indentation level', ('/var/lib/jenkins/jobs/cubicweb-3.23/workspace/TOXENV/py34-cubicweb/cubicweb/server/repository.py', 698, 64, ' with cnx.security_enabled(read=False, write=False):\n'))
======================================================================
SKIPPED: test_keyonly_match (unittest_predicates.MatchFormParamsTC)
test standard usage: ``match_form_params('param1', 'param2')``
repository is not initialised: IndentationError('unindent does not match any outer indentation level', ('/var/lib/jenkins/jobs/cubicweb-3.23/workspace/TOXENV/py34-cubicweb/cubicweb/server/repository.py', 698, 64, ' with cnx.security_enabled(read=False, write=False):\n'))
======================================================================
SKIPPED: test_keyvalue_match_one_parameter (unittest_predicates.MatchFormParamsTC)
test dict usage: ``match_form_params(param1=value1)``
repository is not initialised: IndentationError('unindent does not match any outer indentation level', ('/var/lib/jenkins/jobs/cubicweb-3.23/workspace/TOXENV/py34-cubicweb/cubicweb/server/repository.py', 698, 64, ' with cnx.security_enabled(read=False, write=False):\n'))
======================================================================
SKIPPED: test_keyvalue_match_two_parameters (unittest_predicates.MatchFormParamsTC)
test dict usage: ``match_form_params(param1=value1, param2=value2)``
repository is not initialised: IndentationError('unindent does not match any outer indentation level', ('/var/lib/jenkins/jobs/cubicweb-3.23/workspace/TOXENV/py34-cubicweb/cubicweb/server/repository.py', 698, 64, ' with cnx.security_enabled(read=False, write=False):\n'))
======================================================================
SKIPPED: test_keyvalue_multiple_match (unittest_predicates.MatchFormParamsTC)
test dict usage with multiple values
repository is not initialised: IndentationError('unindent does not match any outer indentation level', ('/var/lib/jenkins/jobs/cubicweb-3.23/workspace/TOXENV/py34-cubicweb/cubicweb/server/repository.py', 698, 64, ' with cnx.security_enabled(read=False, write=False):\n'))
======================================================================
SKIPPED: test_with_operators (unittest_predicates.MultiLinesRsetTC)
repository is not initialised: IndentationError('unindent does not match any outer indentation level', ('/var/lib/jenkins/jobs/cubicweb-3.23/workspace/TOXENV/py34-cubicweb/cubicweb/server/repository.py', 698, 64, ' with cnx.security_enabled(read=False, write=False):\n'))
======================================================================
SKIPPED: test_without_rset (unittest_predicates.MultiLinesRsetTC)
repository is not initialised: IndentationError('unindent does not match any outer indentation level', ('/var/lib/jenkins/jobs/cubicweb-3.23/workspace/TOXENV/py34-cubicweb/cubicweb/server/repository.py', 698, 64, ' with cnx.security_enabled(read=False, write=False):\n'))
======================================================================
SKIPPED: test_rqlst_1 (unittest_predicates.RelationPossibleTC)
repository is not initialised: IndentationError('unindent does not match any outer indentation level', ('/var/lib/jenkins/jobs/cubicweb-3.23/workspace/TOXENV/py34-cubicweb/cubicweb/server/repository.py', 698, 64, ' with cnx.security_enabled(read=False, write=False):\n'))
======================================================================
SKIPPED: test_rqlst_2 (unittest_predicates.RelationPossibleTC)
repository is not initialised: IndentationError('unindent does not match any outer indentation level', ('/var/lib/jenkins/jobs/cubicweb-3.23/workspace/TOXENV/py34-cubicweb/cubicweb/server/repository.py', 698, 64, ' with cnx.security_enabled(read=False, write=False):\n'))
======================================================================
SKIPPED: test_rql_condition_entity (unittest_predicates.ScoreEntityTC)
repository is not initialised: IndentationError('unindent does not match any outer indentation level', ('/var/lib/jenkins/jobs/cubicweb-3.23/workspace/TOXENV/py34-cubicweb/cubicweb/server/repository.py', 698, 64, ' with cnx.security_enabled(read=False, write=False):\n'))
======================================================================
SKIPPED: test_rql_condition_user (unittest_predicates.ScoreEntityTC)
repository is not initialised: IndentationError('unindent does not match any outer indentation level', ('/var/lib/jenkins/jobs/cubicweb-3.23/workspace/TOXENV/py34-cubicweb/cubicweb/server/repository.py', 698, 64, ' with cnx.security_enabled(read=False, write=False):\n'))
======================================================================
SKIPPED: test_is_in_state_unvalid_names (unittest_predicates.WorkflowSelectorTC)
repository is not initialised: IndentationError('unindent does not match any outer indentation level', ('/var/lib/jenkins/jobs/cubicweb-3.23/workspace/TOXENV/py34-cubicweb/cubicweb/server/repository.py', 698, 64, ' with cnx.security_enabled(read=False, write=False):\n'))
======================================================================
SKIPPED: test_on_transition (unittest_predicates.WorkflowSelectorTC)
repository is not initialised: IndentationError('unindent does not match any outer indentation level', ('/var/lib/jenkins/jobs/cubicweb-3.23/workspace/TOXENV/py34-cubicweb/cubicweb/server/repository.py', 698, 64, ' with cnx.security_enabled(read=False, write=False):\n'))
======================================================================
SKIPPED: test_on_transition_unvalid_names (unittest_predicates.WorkflowSelectorTC)
repository is not initialised: IndentationError('unindent does not match any outer indentation level', ('/var/lib/jenkins/jobs/cubicweb-3.23/workspace/TOXENV/py34-cubicweb/cubicweb/server/repository.py', 698, 64, ' with cnx.security_enabled(read=False, write=False):\n'))
======================================================================
SKIPPED: test_on_transition_with_no_effect (unittest_predicates.WorkflowSelectorTC)
selector will not be triggered with `change_state()`
repository is not initialised: IndentationError('unindent does not match any outer indentation level', ('/var/lib/jenkins/jobs/cubicweb-3.23/workspace/TOXENV/py34-cubicweb/cubicweb/server/repository.py', 698, 64, ' with cnx.security_enabled(read=False, write=False):\n'))
======================= unittest_cwconfig.py =======================
................
======================== unittest_utils.py =========================
ESSS..............2016-03-16 11:32:10 - (cubicweb.utils) WARNING: Cache 139705361674480 is full.
....
======================================================================
ERROR: test_concat_urls (unittest_utils.HTMLHeadTC)
----------------------------------------------------------------------
Traceback (most recent call last)
File "/usr/lib/python3.4/unittest/case.py", line 58, in testPartExecutor
yield
File "/usr/lib/python3.4/unittest/case.py", line 573, in run
self.setUp()
File "/var/lib/jenkins/jobs/cubicweb-3.23/workspace/TOXENV/py34-cubicweb/cubicweb/devtools/testlib.py", line 446, in setUp
self._init_repo()
File "/var/lib/jenkins/jobs/cubicweb-3.23/workspace/TOXENV/py34-cubicweb/cubicweb/devtools/testlib.py", line 354, in _init_repo
db_handler.build_db_cache(self.test_db_id, self.pre_setup_database)
File "/var/lib/jenkins/jobs/cubicweb-3.23/workspace/TOXENV/py34-cubicweb/cubicweb/devtools/__init__.py", line 492, in build_db_cache
self.init_test_database()
File "/var/lib/jenkins/jobs/cubicweb-3.23/workspace/TOXENV/py34-cubicweb/cubicweb/devtools/__init__.py", line 817, in init_test_database
init_config=self.init_config)
File "/var/lib/jenkins/jobs/cubicweb-3.23/workspace/TOXENV/py34-cubicweb/cubicweb/server/__init__.py", line 213, in init_repository
from cubicweb.server.repository import Repository
File "/var/lib/jenkins/jobs/cubicweb-3.23/workspace/TOXENV/py34-cubicweb/cubicweb/server/repository.py", line 698
with cnx.security_enabled(read=False, write=False):
^
IndentationError: unindent does not match any outer indentation level

no stdout
no stderr
======================================================================
SKIPPED: test_getvalue_with_concat (unittest_utils.HTMLHeadTC)
repository is not initialised: IndentationError('unindent does not match any outer indentation level', ('/var/lib/jenkins/jobs/cubicweb-3.23/workspace/TOXENV/py34-cubicweb/cubicweb/server/repository.py', 698, 64, ' with cnx.security_enabled(read=False, write=False):\n'))
======================================================================
SKIPPED: test_getvalue_without_concat (unittest_utils.HTMLHeadTC)
repository is not initialised: IndentationError('unindent does not match any outer indentation level', ('/var/lib/jenkins/jobs/cubicweb-3.23/workspace/TOXENV/py34-cubicweb/cubicweb/server/repository.py', 698, 64, ' with cnx.security_enabled(read=False, write=False):\n'))
======================================================================
SKIPPED: test_group_urls (unittest_utils.HTMLHeadTC)
repository is not initialised: IndentationError('unindent does not match any outer indentation level', ('/var/lib/jenkins/jobs/cubicweb-3.23/workspace/TOXENV/py34-cubicweb/cubicweb/server/repository.py', 698, 64, ' with cnx.security_enabled(read=False, write=False):\n'))
========================= unittest_mail.py =========================
ESS....
======================================================================
ERROR: test_format_mail (unittest_mail.EmailTC)
----------------------------------------------------------------------
Traceback (most recent call last)
File "/usr/lib/python3.4/unittest/case.py", line 58, in testPartExecutor
yield
File "/usr/lib/python3.4/unittest/case.py", line 573, in run
self.setUp()
File "/var/lib/jenkins/jobs/cubicweb-3.23/workspace/TOXENV/py34-cubicweb/cubicweb/devtools/testlib.py", line 446, in setUp
self._init_repo()
File "/var/lib/jenkins/jobs/cubicweb-3.23/workspace/TOXENV/py34-cubicweb/cubicweb/devtools/testlib.py", line 354, in _init_repo
db_handler.build_db_cache(self.test_db_id, self.pre_setup_database)
File "/var/lib/jenkins/jobs/cubicweb-3.23/workspace/TOXENV/py34-cubicweb/cubicweb/devtools/__init__.py", line 492, in build_db_cache
self.init_test_database()
File "/var/lib/jenkins/jobs/cubicweb-3.23/workspace/TOXENV/py34-cubicweb/cubicweb/devtools/__init__.py", line 817, in init_test_database
init_config=self.init_config)
File "/var/lib/jenkins/jobs/cubicweb-3.23/workspace/TOXENV/py34-cubicweb/cubicweb/server/__init__.py", line 213, in init_repository
from cubicweb.server.repository import Repository
File "/var/lib/jenkins/jobs/cubicweb-3.23/workspace/TOXENV/py34-cubicweb/cubicweb/server/repository.py", line 698
with cnx.security_enabled(read=False, write=False):
^
IndentationError: unindent does not match any outer indentation level

no stdout
no stderr
======================================================================
SKIPPED: test_format_mail_euro (unittest_mail.EmailTC)
repository is not initialised: IndentationError('unindent does not match any outer indentation level', ('/var/lib/jenkins/jobs/cubicweb-3.23/workspace/TOXENV/py34-cubicweb/cubicweb/server/repository.py', 698, 64, ' with cnx.security_enabled(read=False, write=False):\n'))
======================================================================
SKIPPED: test_format_mail_from_reply_to (unittest_mail.EmailTC)
repository is not initialised: IndentationError('unindent does not match any outer indentation level', ('/var/lib/jenkins/jobs/cubicweb-3.23/workspace/TOXENV/py34-cubicweb/cubicweb/server/repository.py', 698, 64, ' with cnx.security_enabled(read=False, write=False):\n'))
====================== unittest_vregistry.py =======================
EEEE
======================================================================
ERROR: test_property_default_overriding (unittest_vregistry.CWVregTC)
----------------------------------------------------------------------
Traceback (most recent call last)
File "/usr/lib/python3.4/unittest/case.py", line 58, in testPartExecutor
yield
File "/usr/lib/python3.4/unittest/case.py", line 573, in run
self.setUp()
File "/var/lib/jenkins/jobs/cubicweb-3.23/workspace/TOXENV/py34-cubicweb/cubicweb/devtools/testlib.py", line 446, in setUp
self._init_repo()
File "/var/lib/jenkins/jobs/cubicweb-3.23/workspace/TOXENV/py34-cubicweb/cubicweb/devtools/testlib.py", line 354, in _init_repo
db_handler.build_db_cache(self.test_db_id, self.pre_setup_database)
File "/var/lib/jenkins/jobs/cubicweb-3.23/workspace/TOXENV/py34-cubicweb/cubicweb/devtools/__init__.py", line 492, in build_db_cache
self.init_test_database()
File "/var/lib/jenkins/jobs/cubicweb-3.23/workspace/TOXENV/py34-cubicweb/cubicweb/devtools/__init__.py", line 817, in init_test_database
init_config=self.init_config)
File "/var/lib/jenkins/jobs/cubicweb-3.23/workspace/TOXENV/py34-cubicweb/cubicweb/server/__init__.py", line 213, in init_repository
from cubicweb.server.repository import Repository
File "/var/lib/jenkins/jobs/cubicweb-3.23/workspace/TOXENV/py34-cubicweb/cubicweb/server/repository.py", line 698
with cnx.security_enabled(read=False, write=False):
^
IndentationError: unindent does not match any outer indentation level

no stdout
no stderr
======================================================================
ERROR: test_load_interface_based_vojects (unittest_vregistry.VRegistryTC)
----------------------------------------------------------------------
Traceback (most recent call last)
File "/var/lib/jenkins/jobs/cubicweb-3.23/workspace/TOXENV/py34-cubicweb/.tox/py34-cubicweb/lib/python3.4/site-packages/logilab/common/testlib.py", line 375, in quiet_run
func(*args, **kwargs)
File "/var/lib/jenkins/jobs/cubicweb-3.23/workspace/TOXENV/py34-cubicweb/cubicweb/test/unittest_vregistry.py", line 43, in setUp
config.bootstrap_cubes()
File "/var/lib/jenkins/jobs/cubicweb-3.23/workspace/TOXENV/py34-cubicweb/cubicweb/devtools/__init__.py", line 184, in bootstrap_cubes
super(TestServerConfiguration, self).bootstrap_cubes()
File "/var/lib/jenkins/jobs/cubicweb-3.23/workspace/TOXENV/py34-cubicweb/cubicweb/server/serverconfig.py", line 244, in bootstrap_cubes
self.init_cubes(self.expand_cubes(splitstrip(line)))
File "/var/lib/jenkins/jobs/cubicweb-3.23/workspace/TOXENV/py34-cubicweb/cubicweb/cwconfig.py", line 1069, in init_cubes
super(CubicWebConfiguration, self).init_cubes(cubes)
File "/var/lib/jenkins/jobs/cubicweb-3.23/workspace/TOXENV/py34-cubicweb/cubicweb/cwconfig.py", line 824, in init_cubes
self.load_site_cubicweb()
File "/var/lib/jenkins/jobs/cubicweb-3.23/workspace/TOXENV/py34-cubicweb/cubicweb/cwconfig.py", line 779, in load_site_cubicweb
self._load_site_cubicweb(sitefile)
File "/var/lib/jenkins/jobs/cubicweb-3.23/workspace/TOXENV/py34-cubicweb/cubicweb/cwconfig.py", line 1152, in _load_site_cubicweb
mod = super(CubicWebConfiguration, self)._load_site_cubicweb(sitefile)
File "/var/lib/jenkins/jobs/cubicweb-3.23/workspace/TOXENV/py34-cubicweb/cubicweb/cwconfig.py", line 785, in _load_site_cubicweb
module = load_module_from_modpath(modpath_from_file(sitefile, self.extrapath))
File "/var/lib/jenkins/jobs/cubicweb-3.23/workspace/TOXENV/py34-cubicweb/.tox/py34-cubicweb/lib/python3.4/site-packages/logilab/common/modutils.py", line 169, in load_module_from_modpath
module = load_module(curname, mp_file, mp_filename, mp_desc)
File "/var/lib/jenkins/jobs/cubicweb-3.23/workspace/TOXENV/py34-cubicweb/.tox/py34-cubicweb/lib/python3.4/imp.py", line 235, in load_module
return load_source(name, filename, file)
File "/var/lib/jenkins/jobs/cubicweb-3.23/workspace/TOXENV/py34-cubicweb/.tox/py34-cubicweb/lib/python3.4/imp.py", line 171, in load_source
module = methods.load()
File "/var/lib/jenkins/jobs/cubicweb-3.23/workspace/TOXENV/py34-cubicweb/cubicweb/test/<frozen importlib._bootstrap>", line 1220, in load
<no source available>
File "/var/lib/jenkins/jobs/cubicweb-3.23/workspace/TOXENV/py34-cubicweb/cubicweb/test/<frozen importlib._bootstrap>", line 1200, in _load_unlocked
<no source available>
File "/var/lib/jenkins/jobs/cubicweb-3.23/workspace/TOXENV/py34-cubicweb/cubicweb/test/<frozen importlib._bootstrap>", line 1129, in _exec
<no source available>
File "/var/lib/jenkins/jobs/cubicweb-3.23/workspace/TOXENV/py34-cubicweb/cubicweb/test/<frozen importlib._bootstrap>", line 1471, in exec_module
<no source available>
File "/var/lib/jenkins/jobs/cubicweb-3.23/workspace/TOXENV/py34-cubicweb/cubicweb/test/<frozen importlib._bootstrap>", line 321, in _call_with_frames_removed
<no source available>
File "/var/lib/jenkins/jobs/cubicweb-3.23/workspace/TOXENV/py34-cubicweb/.tox/py34-cubicweb/share/cubicweb/cubes/localperms/site_cubicweb.py", line 18, in <module>
from cubicweb.server import repository, session
File "/var/lib/jenkins/jobs/cubicweb-3.23/workspace/TOXENV/py34-cubicweb/cubicweb/server/repository.py", line 698
with cnx.security_enabled(read=False, write=False):
^
IndentationError: unindent does not match any outer indentation level

no stdout
no stderr
======================================================================
ERROR: test_load_subinterface_based_appobjects (unittest_vregistry.VRegistryTC)
----------------------------------------------------------------------
Traceback (most recent call last)
File "/var/lib/jenkins/jobs/cubicweb-3.23/workspace/TOXENV/py34-cubicweb/.tox/py34-cubicweb/lib/python3.4/site-packages/logilab/common/testlib.py", line 375, in quiet_run
func(*args, **kwargs)
File "/var/lib/jenkins/jobs/cubicweb-3.23/workspace/TOXENV/py34-cubicweb/cubicweb/test/unittest_vregistry.py", line 43, in setUp
config.bootstrap_cubes()
File "/var/lib/jenkins/jobs/cubicweb-3.23/workspace/TOXENV/py34-cubicweb/cubicweb/devtools/__init__.py", line 184, in bootstrap_cubes
super(TestServerConfiguration, self).bootstrap_cubes()
File "/var/lib/jenkins/jobs/cubicweb-3.23/workspace/TOXENV/py34-cubicweb/cubicweb/server/serverconfig.py", line 244, in bootstrap_cubes
self.init_cubes(self.expand_cubes(splitstrip(line)))
File "/var/lib/jenkins/jobs/cubicweb-3.23/workspace/TOXENV/py34-cubicweb/cubicweb/cwconfig.py", line 1069, in init_cubes
super(CubicWebConfiguration, self).init_cubes(cubes)
File "/var/lib/jenkins/jobs/cubicweb-3.23/workspace/TOXENV/py34-cubicweb/cubicweb/cwconfig.py", line 824, in init_cubes
self.load_site_cubicweb()
File "/var/lib/jenkins/jobs/cubicweb-3.23/workspace/TOXENV/py34-cubicweb/cubicweb/cwconfig.py", line 779, in load_site_cubicweb
self._load_site_cubicweb(sitefile)
File "/var/lib/jenkins/jobs/cubicweb-3.23/workspace/TOXENV/py34-cubicweb/cubicweb/cwconfig.py", line 1152, in _load_site_cubicweb
mod = super(CubicWebConfiguration, self)._load_site_cubicweb(sitefile)
File "/var/lib/jenkins/jobs/cubicweb-3.23/workspace/TOXENV/py34-cubicweb/cubicweb/cwconfig.py", line 785, in _load_site_cubicweb
module = load_module_from_modpath(modpath_from_file(sitefile, self.extrapath))
File "/var/lib/jenkins/jobs/cubicweb-3.23/workspace/TOXENV/py34-cubicweb/.tox/py34-cubicweb/lib/python3.4/site-packages/logilab/common/modutils.py", line 169, in load_module_from_modpath
module = load_module(curname, mp_file, mp_filename, mp_desc)
File "/var/lib/jenkins/jobs/cubicweb-3.23/workspace/TOXENV/py34-cubicweb/.tox/py34-cubicweb/lib/python3.4/imp.py", line 235, in load_module
return load_source(name, filename, file)
File "/var/lib/jenkins/jobs/cubicweb-3.23/workspace/TOXENV/py34-cubicweb/.tox/py34-cubicweb/lib/python3.4/imp.py", line 171, in load_source
module = methods.load()
File "/var/lib/jenkins/jobs/cubicweb-3.23/workspace/TOXENV/py34-cubicweb/cubicweb/test/<frozen importlib._bootstrap>", line 1220, in load
<no source available>
File "/var/lib/jenkins/jobs/cubicweb-3.23/workspace/TOXENV/py34-cubicweb/cubicweb/test/<frozen importlib._bootstrap>", line 1200, in _load_unlocked
<no source available>
File "/var/lib/jenkins/jobs/cubicweb-3.23/workspace/TOXENV/py34-cubicweb/cubicweb/test/<frozen importlib._bootstrap>", line 1129, in _exec
<no source available>
File "/var/lib/jenkins/jobs/cubicweb-3.23/workspace/TOXENV/py34-cubicweb/cubicweb/test/<frozen importlib._bootstrap>", line 1471, in exec_module
<no source available>
File "/var/lib/jenkins/jobs/cubicweb-3.23/workspace/TOXENV/py34-cubicweb/cubicweb/test/<frozen importlib._bootstrap>", line 321, in _call_with_frames_removed
<no source available>
File "/var/lib/jenkins/jobs/cubicweb-3.23/workspace/TOXENV/py34-cubicweb/.tox/py34-cubicweb/share/cubicweb/cubes/localperms/site_cubicweb.py", line 18, in <module>
from cubicweb.server import repository, session
File "/var/lib/jenkins/jobs/cubicweb-3.23/workspace/TOXENV/py34-cubicweb/cubicweb/server/repository.py", line 698
with cnx.security_enabled(read=False, write=False):
^
IndentationError: unindent does not match any outer indentation level

no stdout
no stderr
======================================================================
ERROR: test_properties (unittest_vregistry.VRegistryTC)
----------------------------------------------------------------------
Traceback (most recent call last)
File "/var/lib/jenkins/jobs/cubicweb-3.23/workspace/TOXENV/py34-cubicweb/.tox/py34-cubicweb/lib/python3.4/site-packages/logilab/common/testlib.py", line 375, in quiet_run
func(*args, **kwargs)
File "/var/lib/jenkins/jobs/cubicweb-3.23/workspace/TOXENV/py34-cubicweb/cubicweb/test/unittest_vregistry.py", line 43, in setUp
config.bootstrap_cubes()
File "/var/lib/jenkins/jobs/cubicweb-3.23/workspace/TOXENV/py34-cubicweb/cubicweb/devtools/__init__.py", line 184, in bootstrap_cubes
super(TestServerConfiguration, self).bootstrap_cubes()
File "/var/lib/jenkins/jobs/cubicweb-3.23/workspace/TOXENV/py34-cubicweb/cubicweb/server/serverconfig.py", line 244, in bootstrap_cubes
self.init_cubes(self.expand_cubes(splitstrip(line)))
File "/var/lib/jenkins/jobs/cubicweb-3.23/workspace/TOXENV/py34-cubicweb/cubicweb/cwconfig.py", line 1069, in init_cubes
super(CubicWebConfiguration, self).init_cubes(cubes)
File "/var/lib/jenkins/jobs/cubicweb-3.23/workspace/TOXENV/py34-cubicweb/cubicweb/cwconfig.py", line 824, in init_cubes
self.load_site_cubicweb()
File "/var/lib/jenkins/jobs/cubicweb-3.23/workspace/TOXENV/py34-cubicweb/cubicweb/cwconfig.py", line 779, in load_site_cubicweb
self._load_site_cubicweb(sitefile)
File "/var/lib/jenkins/jobs/cubicweb-3.23/workspace/TOXENV/py34-cubicweb/cubicweb/cwconfig.py", line 1152, in _load_site_cubicweb
mod = super(CubicWebConfiguration, self)._load_site_cubicweb(sitefile)
File "/var/lib/jenkins/jobs/cubicweb-3.23/workspace/TOXENV/py34-cubicweb/cubicweb/cwconfig.py", line 785, in _load_site_cubicweb
module = load_module_from_modpath(modpath_from_file(sitefile, self.extrapath))
File "/var/lib/jenkins/jobs/cubicweb-3.23/workspace/TOXENV/py34-cubicweb/.tox/py34-cubicweb/lib/python3.4/site-packages/logilab/common/modutils.py", line 169, in load_module_from_modpath
module = load_module(curname, mp_file, mp_filename, mp_desc)
File "/var/lib/jenkins/jobs/cubicweb-3.23/workspace/TOXENV/py34-cubicweb/.tox/py34-cubicweb/lib/python3.4/imp.py", line 235, in load_module
return load_source(name, filename, file)
File "/var/lib/jenkins/jobs/cubicweb-3.23/workspace/TOXENV/py34-cubicweb/.tox/py34-cubicweb/lib/python3.4/imp.py", line 171, in load_source
module = methods.load()
File "/var/lib/jenkins/jobs/cubicweb-3.23/workspace/TOXENV/py34-cubicweb/cubicweb/test/<frozen importlib._bootstrap>", line 1220, in load
<no source available>
File "/var/lib/jenkins/jobs/cubicweb-3.23/workspace/TOXENV/py34-cubicweb/cubicweb/test/<frozen importlib._bootstrap>", line 1200, in _load_unlocked
<no source available>
File "/var/lib/jenkins/jobs/cubicweb-3.23/workspace/TOXENV/py34-cubicweb/cubicweb/test/<frozen importlib._bootstrap>", line 1129, in _exec
<no source available>
File "/var/lib/jenkins/jobs/cubicweb-3.23/workspace/TOXENV/py34-cubicweb/cubicweb/test/<frozen importlib._bootstrap>", line 1471, in exec_module
<no source available>
File "/var/lib/jenkins/jobs/cubicweb-3.23/workspace/TOXENV/py34-cubicweb/cubicweb/test/<frozen importlib._bootstrap>", line 321, in _call_with_frames_removed
<no source available>
File "/var/lib/jenkins/jobs/cubicweb-3.23/workspace/TOXENV/py34-cubicweb/.tox/py34-cubicweb/share/cubicweb/cubes/localperms/site_cubicweb.py", line 18, in <module>
from cubicweb.server import repository, session
File "/var/lib/jenkins/jobs/cubicweb-3.23/workspace/TOXENV/py34-cubicweb/cubicweb/server/repository.py", line 698
with cnx.security_enabled(read=False, write=False):
^
IndentationError: unindent does not match any outer indentation level

no stdout
no stderr
====================== unittest_rqlrewrite.py ======================
E
======================================================================
ERROR: setUpModule (unittest_rqlrewrite)
----------------------------------------------------------------------
Traceback (most recent call last)
File "/usr/lib/python3.4/unittest/suite.py", line 203, in _handleModuleFixture
setUpModule()
File "/var/lib/jenkins/jobs/cubicweb-3.23/workspace/TOXENV/py34-cubicweb/cubicweb/test/unittest_rqlrewrite.py", line 35, in setUpModule
config.bootstrap_cubes()
File "/var/lib/jenkins/jobs/cubicweb-3.23/workspace/TOXENV/py34-cubicweb/cubicweb/devtools/__init__.py", line 184, in bootstrap_cubes
super(TestServerConfiguration, self).bootstrap_cubes()
File "/var/lib/jenkins/jobs/cubicweb-3.23/workspace/TOXENV/py34-cubicweb/cubicweb/server/serverconfig.py", line 244, in bootstrap_cubes
self.init_cubes(self.expand_cubes(splitstrip(line)))
File "/var/lib/jenkins/jobs/cubicweb-3.23/workspace/TOXENV/py34-cubicweb/cubicweb/cwconfig.py", line 1069, in init_cubes
super(CubicWebConfiguration, self).init_cubes(cubes)
File "/var/lib/jenkins/jobs/cubicweb-3.23/workspace/TOXENV/py34-cubicweb/cubicweb/cwconfig.py", line 824, in init_cubes
self.load_site_cubicweb()
File "/var/lib/jenkins/jobs/cubicweb-3.23/workspace/TOXENV/py34-cubicweb/cubicweb/cwconfig.py", line 779, in load_site_cubicweb
self._load_site_cubicweb(sitefile)
File "/var/lib/jenkins/jobs/cubicweb-3.23/workspace/TOXENV/py34-cubicweb/cubicweb/cwconfig.py", line 1152, in _load_site_cubicweb
mod = super(CubicWebConfiguration, self)._load_site_cubicweb(sitefile)
File "/var/lib/jenkins/jobs/cubicweb-3.23/workspace/TOXENV/py34-cubicweb/cubicweb/cwconfig.py", line 785, in _load_site_cubicweb
module = load_module_from_modpath(modpath_from_file(sitefile, self.extrapath))
File "/var/lib/jenkins/jobs/cubicweb-3.23/workspace/TOXENV/py34-cubicweb/.tox/py34-cubicweb/lib/python3.4/site-packages/logilab/common/modutils.py", line 169, in load_module_from_modpath
module = load_module(curname, mp_file, mp_filename, mp_desc)
File "/var/lib/jenkins/jobs/cubicweb-3.23/workspace/TOXENV/py34-cubicweb/.tox/py34-cubicweb/lib/python3.4/imp.py", line 235, in load_module
return load_source(name, filename, file)
File "/var/lib/jenkins/jobs/cubicweb-3.23/workspace/TOXENV/py34-cubicweb/.tox/py34-cubicweb/lib/python3.4/imp.py", line 171, in load_source
module = methods.load()
File "/var/lib/jenkins/jobs/cubicweb-3.23/workspace/TOXENV/py34-cubicweb/cubicweb/test/<frozen importlib._bootstrap>", line 1220, in load
<no source available>
File "/var/lib/jenkins/jobs/cubicweb-3.23/workspace/TOXENV/py34-cubicweb/cubicweb/test/<frozen importlib._bootstrap>", line 1200, in _load_unlocked
<no source available>
File "/var/lib/jenkins/jobs/cubicweb-3.23/workspace/TOXENV/py34-cubicweb/cubicweb/test/<frozen importlib._bootstrap>", line 1129, in _exec
<no source available>
File "/var/lib/jenkins/jobs/cubicweb-3.23/workspace/TOXENV/py34-cubicweb/cubicweb/test/<frozen importlib._bootstrap>", line 1471, in exec_module
<no source available>
File "/var/lib/jenkins/jobs/cubicweb-3.23/workspace/TOXENV/py34-cubicweb/cubicweb/test/<frozen importlib._bootstrap>", line 321, in _call_with_frames_removed
<no source available>
File "/var/lib/jenkins/jobs/cubicweb-3.23/workspace/TOXENV/py34-cubicweb/.tox/py34-cubicweb/share/cubicweb/cubes/localperms/site_cubicweb.py", line 18, in <module>
from cubicweb.server import repository, session
File "/var/lib/jenkins/jobs/cubicweb-3.23/workspace/TOXENV/py34-cubicweb/cubicweb/server/repository.py", line 698
with cnx.security_enabled(read=False, write=False):
^
IndentationError: unindent does not match any outer indentation level

no stdout
no stderr
*******************************************************************************
Ran 221 test cases in 1.28s (1.25s CPU), 24 errors, 118 skipped
5 modules OK (13 failed)
failures: /var/lib/jenkins/jobs/cubicweb-3.23/workspace/TOXENV/py34-cubicweb/cubicweb/test/unittest_migration [1/4], /var/lib/jenkins/jobs/cubicweb-3.23/workspace/TOXENV/py34-cubicweb/cubicweb/test/unittest_req [1/8], /var/lib/jenkins/jobs/cubicweb-3.23/workspace/TOXENV/py34-cubicweb/cubicweb/test/unittest_cwctl [1/2], /var/lib/jenkins/jobs/cubicweb-3.23/workspace/TOXENV/py34-cubicweb/cubicweb/test/unittest_rset [1/41], /var/lib/jenkins/jobs/cubicweb-3.23/workspace/TOXENV/py34-cubicweb/cubicweb/test/unittest_entity [1/54], /var/lib/jenkins/jobs/cubicweb-3.23/workspace/TOXENV/py34-cubicweb/cubicweb/test/unittest_spa2rql [1/1], /var/lib/jenkins/jobs/cubicweb-3.23/workspace/TOXENV/py34-cubicweb/cubicweb/test/unittest_repoapi [1/4], /var/lib/jenkins/jobs/cubicweb-3.23/workspace/TOXENV/py34-cubicweb/cubicweb/test/unittest_schema [1/1], /var/lib/jenkins/jobs/cubicweb-3.23/workspace/TOXENV/py34-cubicweb/cubicweb/test/unittest_predicates [9/28], /var/lib/jenkins/jobs/cubicweb-3.23/workspace/TOXENV/py34-cubicweb/cubicweb/test/unittest_utils [1/22], /var/lib/jenkins/jobs/cubicweb-3.23/workspace/TOXENV/py34-cubicweb/cubicweb/test/unittest_mail [1/7], /var/lib/jenkins/jobs/cubicweb-3.23/workspace/TOXENV/py34-cubicweb/cubicweb/test/unittest_vregistry [4/4], /var/lib/jenkins/jobs/cubicweb-3.23/workspace/TOXENV/py34-cubicweb/cubicweb/test/unittest_rqlrewrite [1/0]
ERROR: InvocationError: '/var/lib/jenkins/jobs/cubicweb-3.23/workspace/TOXENV/py34-cubicweb/.tox/py34-cubicweb/bin/python -c from logilab.common import pytest; pytest.run() -t /var/lib/jenkins/jobs/cubicweb-3.23/workspace/TOXENV/py34-cubicweb/cubicweb/test'
___________________________________ summary ____________________________________
ERROR: py34-cubicweb: commands failed
Build step 'Execute shell' marked build as failure
Sending e-mails to: dlaxalde@logilab.fr jcr@logilab.fr syt@logilab.fr david@logilab.fr
[PostBuildScript] - Execution post build scripts.
[py34-cubicweb] $ /bin/bash -xe /tmp/hudson6102455747533962793.sh
+ /var/lib/jenkins/scripts/notify_forge_apycot.py cwo cubicweb 69aa09ec38d5 http://jenkins.logilab.fr/job/cubicweb-3.23/TOXENV=py34-cubicweb/81/ --status failure
<br/>

log from execution
download