consoleText

download

20 Started by upstream project "cubicweb-3.23" build number 81
originally caused by:
Started by an SCM change
Building in workspace /var/lib/jenkins/jobs/cubicweb-3.23/workspace/TOXENV/py34-sobjects
[py34-sobjects] $ hg showconfig paths.default
[py34-sobjects] $ hg pull
pulling from http://hg.logilab.org/review/cubicweb
searching for changes
adding changesets
adding manifests
adding file changes
added 4 changesets with 10 changes to 8 files (+3 heads)
10 new obsolescence markers
(run 'hg heads .' to see heads, 'hg merge' to merge)
[py34-sobjects] $ hg update --clean --rev 69aa09ec38d545147b152e6fd12b5ce495a4f053
12 files updated, 0 files merged, 0 files removed, 0 files unresolved
[py34-sobjects] $ hg --config extensions.purge= clean --all
[py34-sobjects] $ hg log --rev . --template {node}
[py34-sobjects] $ hg log --rev . --template {rev}
[py34-sobjects] $ hg id --branch
[py34-sobjects] $ /bin/bash -xe /tmp/hudson5082830477310027217.sh
+ find . '(' -name 'pgdb*' -o -name 'tmpdb*' ')' -print0
+ xargs -0 rm -rf
[py34-sobjects] $ /bin/bash -xe /tmp/hudson7184362366181251773.sh
+ PATH=/usr/lib/postgresql/9.4/bin:/usr/local/bin:/usr/bin:/bin:/usr/local/games:/usr/games
+ tox --recreate
py34-sobjects create: /var/lib/jenkins/jobs/cubicweb-3.23/workspace/TOXENV/py34-sobjects/.tox/py34-sobjects
py34-sobjects installdeps: -e., -r/var/lib/jenkins/jobs/cubicweb-3.23/workspace/TOXENV/py34-sobjects/cubicweb/sobjects/test/requirements.txt
py34-sobjects develop-inst: /var/lib/jenkins/jobs/cubicweb-3.23/workspace/TOXENV/py34-sobjects
py34-sobjects installed: You are using pip version 7.1.2, however version 8.1.0 is available.,You should consider upgrading via the 'pip install --upgrade pip' command.,chardet==2.3.0,colorama==0.3.2,-e hg+http://hg.logilab.org/review/cubicweb@69aa09ec38d545147b152e6fd12b5ce495a4f053#egg=cubicweb-dev,cubicweb-card==0.5.8,cubicweb-comment==1.12.1,cwclientlib==0.4.1,docutils==0.12,html2text==2016.1.8,html5lib==0.999,linecache2==1.0.0,logilab-common==1.2.0,logilab-constraint==0.6.0,logilab-database==1.15.0,logilab-mtconverter==0.9.0,lxml==3.5.0,Markdown==2.6.5,passlib==1.6.5,psycopg2==2.5.4,py==1.4.25,pyasn1==0.1.7,pyflakes==0.8.1,python-apt==0.9.3.12,python-dateutil==2.5.0,python3-ldap==0.9.4.2,pytz==2016.1,requests==2.4.3,rql==0.34.0,six==1.8.0,tox==1.9.2,traceback2==1.4.0,unattended-upgrades==0.1,unittest2==1.1.0,urllib3==1.9.1,virtualenv==1.11.6,wheel==0.24.0,yams==0.42.0,Yapps==2.2.0,Yapps2==2.2.0
py34-sobjects runtests: PYTHONHASHSEED='2894476305'
py34-sobjects runtests: commands[0] | touch /var/lib/jenkins/jobs/cubicweb-3.23/workspace/TOXENV/py34-sobjects/.tox/py34-sobjects/share/cubicweb/cubes/__init__.py
py34-sobjects runtests: commands[1] | /var/lib/jenkins/jobs/cubicweb-3.23/workspace/TOXENV/py34-sobjects/.tox/py34-sobjects/bin/python -c from logilab.common import pytest; pytest.run() -t /var/lib/jenkins/jobs/cubicweb-3.23/workspace/TOXENV/py34-sobjects/cubicweb/sobjects/test
===================== unittest_notification.py =====================
ES
======================================================================
ERROR: test_recipients_finder (unittest_notification.NotificationTC)
----------------------------------------------------------------------
Traceback (most recent call last)
File "/usr/lib/python3.4/unittest/case.py", line 58, in testPartExecutor
yield
File "/usr/lib/python3.4/unittest/case.py", line 573, in run
self.setUp()
File "/var/lib/jenkins/jobs/cubicweb-3.23/workspace/TOXENV/py34-sobjects/cubicweb/devtools/testlib.py", line 446, in setUp
self._init_repo()
File "/var/lib/jenkins/jobs/cubicweb-3.23/workspace/TOXENV/py34-sobjects/cubicweb/devtools/testlib.py", line 354, in _init_repo
db_handler.build_db_cache(self.test_db_id, self.pre_setup_database)
File "/var/lib/jenkins/jobs/cubicweb-3.23/workspace/TOXENV/py34-sobjects/cubicweb/devtools/__init__.py", line 492, in build_db_cache
self.init_test_database()
File "/var/lib/jenkins/jobs/cubicweb-3.23/workspace/TOXENV/py34-sobjects/cubicweb/devtools/__init__.py", line 817, in init_test_database
init_config=self.init_config)
File "/var/lib/jenkins/jobs/cubicweb-3.23/workspace/TOXENV/py34-sobjects/cubicweb/server/__init__.py", line 213, in init_repository
from cubicweb.server.repository import Repository
File "/var/lib/jenkins/jobs/cubicweb-3.23/workspace/TOXENV/py34-sobjects/cubicweb/server/repository.py", line 698
with cnx.security_enabled(read=False, write=False):
^
IndentationError: unindent does not match any outer indentation level

no stdout
no stderr
======================================================================
SKIPPED: test_status_change_view (unittest_notification.NotificationTC)
repository is not initialised: IndentationError('unindent does not match any outer indentation level', ('/var/lib/jenkins/jobs/cubicweb-3.23/workspace/TOXENV/py34-sobjects/cubicweb/server/repository.py', 698, 64, ' with cnx.security_enabled(read=False, write=False):\n'))
===================== unittest_cwxmlparser.py ======================
unhandled exception occurred while testing unittest_cwxmlparser
Traceback (most recent call last):
File "/var/lib/jenkins/jobs/cubicweb-3.23/workspace/TOXENV/py34-sobjects/.tox/py34-sobjects/lib/python3.4/site-packages/logilab/common/pytest.py", line 390, in testfile
options=self.options, outstream=sys.stderr)
File "/var/lib/jenkins/jobs/cubicweb-3.23/workspace/TOXENV/py34-sobjects/.tox/py34-sobjects/lib/python3.4/site-packages/logilab/common/pytest.py", line 706, in __init__
testLoader=NonStrictTestLoader())
File "/usr/lib/python3.4/unittest/main.py", line 63, in __init__
self.module = __import__(module)
File "/var/lib/jenkins/jobs/cubicweb-3.23/workspace/TOXENV/py34-sobjects/cubicweb/sobjects/test/unittest_cwxmlparser.py", line 25, in <module>
from cubicweb.sobjects.cwxmlparser import CWEntityXMLParser
File "/var/lib/jenkins/jobs/cubicweb-3.23/workspace/TOXENV/py34-sobjects/cubicweb/sobjects/cwxmlparser.py", line 50, in <module>
from cubicweb.server.sources import datafeed
File "/var/lib/jenkins/jobs/cubicweb-3.23/workspace/TOXENV/py34-sobjects/cubicweb/server/sources/datafeed.py", line 39, in <module>
from cubicweb.server.repository import preprocess_inlined_relations
File "/var/lib/jenkins/jobs/cubicweb-3.23/workspace/TOXENV/py34-sobjects/cubicweb/server/repository.py", line 698
with cnx.security_enabled(read=False, write=False):
^
IndentationError: unindent does not match any outer indentation level
======================== unittest_email.py =========================
ESSS
======================================================================
ERROR: test_cardinality_check (unittest_email.EmailAddressHooksTC)
----------------------------------------------------------------------
Traceback (most recent call last)
File "/usr/lib/python3.4/unittest/case.py", line 58, in testPartExecutor
yield
File "/usr/lib/python3.4/unittest/case.py", line 573, in run
self.setUp()
File "/var/lib/jenkins/jobs/cubicweb-3.23/workspace/TOXENV/py34-sobjects/cubicweb/devtools/testlib.py", line 446, in setUp
self._init_repo()
File "/var/lib/jenkins/jobs/cubicweb-3.23/workspace/TOXENV/py34-sobjects/cubicweb/devtools/testlib.py", line 354, in _init_repo
db_handler.build_db_cache(self.test_db_id, self.pre_setup_database)
File "/var/lib/jenkins/jobs/cubicweb-3.23/workspace/TOXENV/py34-sobjects/cubicweb/devtools/__init__.py", line 492, in build_db_cache
self.init_test_database()
File "/var/lib/jenkins/jobs/cubicweb-3.23/workspace/TOXENV/py34-sobjects/cubicweb/devtools/__init__.py", line 817, in init_test_database
init_config=self.init_config)
File "/var/lib/jenkins/jobs/cubicweb-3.23/workspace/TOXENV/py34-sobjects/cubicweb/server/__init__.py", line 213, in init_repository
from cubicweb.server.repository import Repository
File "/var/lib/jenkins/jobs/cubicweb-3.23/workspace/TOXENV/py34-sobjects/cubicweb/server/repository.py", line 698
with cnx.security_enabled(read=False, write=False):
^
IndentationError: unindent does not match any outer indentation level

no stdout
no stderr
======================================================================
SKIPPED: test_primary_email_set_use_email (unittest_email.EmailAddressHooksTC)
repository is not initialised: IndentationError('unindent does not match any outer indentation level', ('/var/lib/jenkins/jobs/cubicweb-3.23/workspace/TOXENV/py34-sobjects/cubicweb/server/repository.py', 698, 64, ' with cnx.security_enabled(read=False, write=False):\n'))
======================================================================
SKIPPED: test_security_check (unittest_email.EmailAddressHooksTC)
repository is not initialised: IndentationError('unindent does not match any outer indentation level', ('/var/lib/jenkins/jobs/cubicweb-3.23/workspace/TOXENV/py34-sobjects/cubicweb/server/repository.py', 698, 64, ' with cnx.security_enabled(read=False, write=False):\n'))
======================================================================
SKIPPED: test_use_email_set_primary_email (unittest_email.EmailAddressHooksTC)
repository is not initialised: IndentationError('unindent does not match any outer indentation level', ('/var/lib/jenkins/jobs/cubicweb-3.23/workspace/TOXENV/py34-sobjects/cubicweb/server/repository.py', 698, 64, ' with cnx.security_enabled(read=False, write=False):\n'))
===================== unittest_supervising.py ======================
ES
======================================================================
ERROR: test_nonregr1 (unittest_supervising.SupervisingTC)
----------------------------------------------------------------------
Traceback (most recent call last)
File "/usr/lib/python3.4/unittest/case.py", line 58, in testPartExecutor
yield
File "/usr/lib/python3.4/unittest/case.py", line 573, in run
self.setUp()
File "/var/lib/jenkins/jobs/cubicweb-3.23/workspace/TOXENV/py34-sobjects/cubicweb/devtools/testlib.py", line 446, in setUp
self._init_repo()
File "/var/lib/jenkins/jobs/cubicweb-3.23/workspace/TOXENV/py34-sobjects/cubicweb/devtools/testlib.py", line 354, in _init_repo
db_handler.build_db_cache(self.test_db_id, self.pre_setup_database)
File "/var/lib/jenkins/jobs/cubicweb-3.23/workspace/TOXENV/py34-sobjects/cubicweb/devtools/__init__.py", line 492, in build_db_cache
self.init_test_database()
File "/var/lib/jenkins/jobs/cubicweb-3.23/workspace/TOXENV/py34-sobjects/cubicweb/devtools/__init__.py", line 817, in init_test_database
init_config=self.init_config)
File "/var/lib/jenkins/jobs/cubicweb-3.23/workspace/TOXENV/py34-sobjects/cubicweb/server/__init__.py", line 213, in init_repository
from cubicweb.server.repository import Repository
File "/var/lib/jenkins/jobs/cubicweb-3.23/workspace/TOXENV/py34-sobjects/cubicweb/server/repository.py", line 698
with cnx.security_enabled(read=False, write=False):
^
IndentationError: unindent does not match any outer indentation level

no stdout
no stderr
======================================================================
SKIPPED: test_supervision (unittest_supervising.SupervisingTC)
repository is not initialised: IndentationError('unindent does not match any outer indentation level', ('/var/lib/jenkins/jobs/cubicweb-3.23/workspace/TOXENV/py34-sobjects/cubicweb/server/repository.py', 698, 64, ' with cnx.security_enabled(read=False, write=False):\n'))
==================== unittest_register_user.py =====================
ESS
======================================================================
ERROR: test_register_user_attributes (unittest_register_user.RegisterUserTC)
----------------------------------------------------------------------
Traceback (most recent call last)
File "/usr/lib/python3.4/unittest/case.py", line 58, in testPartExecutor
yield
File "/usr/lib/python3.4/unittest/case.py", line 573, in run
self.setUp()
File "/var/lib/jenkins/jobs/cubicweb-3.23/workspace/TOXENV/py34-sobjects/cubicweb/devtools/testlib.py", line 446, in setUp
self._init_repo()
File "/var/lib/jenkins/jobs/cubicweb-3.23/workspace/TOXENV/py34-sobjects/cubicweb/devtools/testlib.py", line 354, in _init_repo
db_handler.build_db_cache(self.test_db_id, self.pre_setup_database)
File "/var/lib/jenkins/jobs/cubicweb-3.23/workspace/TOXENV/py34-sobjects/cubicweb/devtools/__init__.py", line 492, in build_db_cache
self.init_test_database()
File "/var/lib/jenkins/jobs/cubicweb-3.23/workspace/TOXENV/py34-sobjects/cubicweb/devtools/__init__.py", line 817, in init_test_database
init_config=self.init_config)
File "/var/lib/jenkins/jobs/cubicweb-3.23/workspace/TOXENV/py34-sobjects/cubicweb/server/__init__.py", line 213, in init_repository
from cubicweb.server.repository import Repository
File "/var/lib/jenkins/jobs/cubicweb-3.23/workspace/TOXENV/py34-sobjects/cubicweb/server/repository.py", line 698
with cnx.security_enabled(read=False, write=False):
^
IndentationError: unindent does not match any outer indentation level

no stdout
no stderr
======================================================================
SKIPPED: test_register_user_groups (unittest_register_user.RegisterUserTC)
repository is not initialised: IndentationError('unindent does not match any outer indentation level', ('/var/lib/jenkins/jobs/cubicweb-3.23/workspace/TOXENV/py34-sobjects/cubicweb/server/repository.py', 698, 64, ' with cnx.security_enabled(read=False, write=False):\n'))
======================================================================
SKIPPED: test_register_user_service (unittest_register_user.RegisterUserTC)
repository is not initialised: IndentationError('unindent does not match any outer indentation level', ('/var/lib/jenkins/jobs/cubicweb-3.23/workspace/TOXENV/py34-sobjects/cubicweb/server/repository.py', 698, 64, ' with cnx.security_enabled(read=False, write=False):\n'))
*******************************************************************************
Ran 12 test cases in 0.60s (0.60s CPU), 5 errors, 7 skipped
0 modules OK (5 failed)
failures: /var/lib/jenkins/jobs/cubicweb-3.23/workspace/TOXENV/py34-sobjects/cubicweb/sobjects/test/unittest_notification [1/2], /var/lib/jenkins/jobs/cubicweb-3.23/workspace/TOXENV/py34-sobjects/cubicweb/sobjects/test/unittest_cwxmlparser [1/1], /var/lib/jenkins/jobs/cubicweb-3.23/workspace/TOXENV/py34-sobjects/cubicweb/sobjects/test/unittest_email [1/4], /var/lib/jenkins/jobs/cubicweb-3.23/workspace/TOXENV/py34-sobjects/cubicweb/sobjects/test/unittest_supervising [1/2], /var/lib/jenkins/jobs/cubicweb-3.23/workspace/TOXENV/py34-sobjects/cubicweb/sobjects/test/unittest_register_user [1/3]
ERROR: InvocationError: '/var/lib/jenkins/jobs/cubicweb-3.23/workspace/TOXENV/py34-sobjects/.tox/py34-sobjects/bin/python -c from logilab.common import pytest; pytest.run() -t /var/lib/jenkins/jobs/cubicweb-3.23/workspace/TOXENV/py34-sobjects/cubicweb/sobjects/test'
___________________________________ summary ____________________________________
ERROR: py34-sobjects: commands failed
Build step 'Execute shell' marked build as failure
Sending e-mails to: dlaxalde@logilab.fr jcr@logilab.fr syt@logilab.fr david@logilab.fr
[PostBuildScript] - Execution post build scripts.
[py34-sobjects] $ /bin/bash -xe /tmp/hudson3537598037564874915.sh
+ /var/lib/jenkins/scripts/notify_forge_apycot.py cwo cubicweb 69aa09ec38d5 http://jenkins.logilab.fr/job/cubicweb-3.23/TOXENV=py34-sobjects/81/ --status failure
<br/>

log from execution
download