consoleText

download

20 Started by upstream project "cubicweb-3.23" build number 92
originally caused by:
Started by an SCM change
Building in workspace /var/lib/jenkins/jobs/cubicweb-3.23/workspace/TOXENV/py34-hooks
[py34-hooks] $ hg showconfig paths.default
[py34-hooks] $ hg pull
pulling from http://hg.logilab.org/review/cubicweb
searching for changes
no changes found
2 new obsolescence markers
[py34-hooks] $ hg update --clean --rev 41a817cd961ca2cc8f0a4c925cc8b13f9f24de2a
10 files updated, 0 files merged, 0 files removed, 0 files unresolved
[py34-hooks] $ hg --config extensions.purge= clean --all
[py34-hooks] $ hg log --rev . --template {node}
[py34-hooks] $ hg log --rev . --template {rev}
[py34-hooks] $ hg id --branch
[py34-hooks] $ /bin/bash -xe /tmp/hudson1615152062348352048.sh
+ find . '(' -name 'pgdb*' -o -name 'tmpdb*' ')' -print0
+ xargs -0 rm -rf
[py34-hooks] $ /bin/bash -xe /tmp/hudson4731402673411475393.sh
+ PATH=/usr/lib/postgresql/9.4/bin:/usr/local/bin:/usr/bin:/bin:/usr/local/games:/usr/games
+ tox --recreate
py34-hooks create: /var/lib/jenkins/jobs/cubicweb-3.23/workspace/TOXENV/py34-hooks/.tox/py34-hooks
py34-hooks installdeps: -e., -r/var/lib/jenkins/jobs/cubicweb-3.23/workspace/TOXENV/py34-hooks/cubicweb/hooks/test/requirements.txt
py34-hooks develop-inst: /var/lib/jenkins/jobs/cubicweb-3.23/workspace/TOXENV/py34-hooks
py34-hooks installed: You are using pip version 7.1.2, however version 8.1.0 is available.,You should consider upgrading via the 'pip install --upgrade pip' command.,chardet==2.3.0,colorama==0.3.2,-e hg+http://hg.logilab.org/review/cubicweb@41a817cd961ca2cc8f0a4c925cc8b13f9f24de2a#egg=cubicweb-dev,cwclientlib==0.4.1,html2text==2016.1.8,html5lib==0.999,linecache2==1.0.0,logilab-common==1.2.0,logilab-constraint==0.6.0,logilab-database==1.15.0,logilab-mtconverter==0.9.0,lxml==3.5.0,Markdown==2.6.5,passlib==1.6.5,psycopg2==2.5.4,py==1.4.25,pyasn1==0.1.7,pyflakes==0.8.1,python-apt==0.9.3.12,python-dateutil==2.5.0,python3-ldap==0.9.4.2,pytz==2016.1,requests==2.4.3,rql==0.34.0,six==1.8.0,tox==1.9.2,traceback2==1.4.0,unattended-upgrades==0.1,unittest2==1.1.0,urllib3==1.9.1,virtualenv==1.11.6,wheel==0.24.0,yams==0.42.0,Yapps==2.2.0,Yapps2==2.2.0
py34-hooks runtests: PYTHONHASHSEED='3732787252'
py34-hooks runtests: commands[0] | /var/lib/jenkins/jobs/cubicweb-3.23/workspace/TOXENV/py34-hooks/.tox/py34-hooks/bin/python -c from logilab.common import pytest; pytest.run() -t /var/lib/jenkins/jobs/cubicweb-3.23/workspace/TOXENV/py34-hooks/cubicweb/hooks/test
===================== unittest_synccomputed.py =====================
ESSS...
======================================================================
ERROR: test_init_on_entity_creation (unittest_synccomputed.ComputedAttributeTC)
check the computed attribute is initialized on entity creation
----------------------------------------------------------------------
Traceback (most recent call last)
File "/usr/lib/python3.4/unittest/case.py", line 58, in testPartExecutor
yield
File "/usr/lib/python3.4/unittest/case.py", line 573, in run
self.setUp()
File "/var/lib/jenkins/jobs/cubicweb-3.23/workspace/TOXENV/py34-hooks/cubicweb/devtools/testlib.py", line 445, in setUp
self._init_repo()
File "/var/lib/jenkins/jobs/cubicweb-3.23/workspace/TOXENV/py34-hooks/cubicweb/devtools/testlib.py", line 353, in _init_repo
db_handler.build_db_cache(self.test_db_id, self.pre_setup_database)
File "/var/lib/jenkins/jobs/cubicweb-3.23/workspace/TOXENV/py34-hooks/cubicweb/devtools/__init__.py", line 492, in build_db_cache
self.init_test_database()
File "/var/lib/jenkins/jobs/cubicweb-3.23/workspace/TOXENV/py34-hooks/cubicweb/devtools/__init__.py", line 817, in init_test_database
init_config=self.init_config)
File "/var/lib/jenkins/jobs/cubicweb-3.23/workspace/TOXENV/py34-hooks/cubicweb/server/__init__.py", line 252, in init_repository
handler = config.migration_handler(schema, interactive=False, repo=repo, cnx=cnx)
TypeError: migration_handler() got an unexpected keyword argument 'repo'

no stdout
no stderr
======================================================================
SKIPPED: test_recompute_on_ambiguous_relation (unittest_synccomputed.ComputedAttributeTC)
repository is not initialised: TypeError("migration_handler() got an unexpected keyword argument 'repo'",)
======================================================================
SKIPPED: test_recompute_on_attribute_update (unittest_synccomputed.ComputedAttributeTC)
check the modification of an attribute triggers the update of the
repository is not initialised: TypeError("migration_handler() got an unexpected keyword argument 'repo'",)
======================================================================
SKIPPED: test_update_on_add_remove_relation (unittest_synccomputed.ComputedAttributeTC)
check the rewriting of a computed attribute
repository is not initialised: TypeError("migration_handler() got an unexpected keyword argument 'repo'",)
===================== unittest_syncsession.py ======================
EThe files belonging to this database system will be owned by user "jenkins".
This user must also own the server process.

The database cluster will be initialized with locale "C".
The default text search configuration will be set to "english".

Data page checksums are disabled.

creating directory /var/lib/jenkins/jobs/cubicweb-3.23/workspace/TOXENV/py34-hooks/cubicweb/hooks/test/data/database/pgdb-unittest_syncschema ... ok
creating subdirectories ... ok
selecting default max_connections ... 100
selecting default shared_buffers ... 128MB
selecting dynamic shared memory implementation ... posix
creating configuration files ... ok
creating template1 database in /var/lib/jenkins/jobs/cubicweb-3.23/workspace/TOXENV/py34-hooks/cubicweb/hooks/test/data/database/pgdb-unittest_syncschema/base/1 ... ok
initializing pg_authid ... ok
initializing dependencies ... ok
creating system views ... ok
loading system objects' descriptions ... ok
creating collations ... ok
creating conversions ... ok
creating dictionaries ... ok
setting privileges on built-in objects ... ok
creating information schema ... ok
loading PL/pgSQL server-side language ... ok
vacuuming database template1 ... ok
copying template1 to template0 ... ok
copying template1 to postgres ... ok
syncing data to disk ... ok

WARNING: enabling "trust" authentication for local connections
You can change this by editing pg_hba.conf or using the option -A, or
--auth-local and --auth-host, the next time you run initdb.

Success. You can now start the database server using:

postgres -D /var/lib/jenkins/jobs/cubicweb-3.23/workspace/TOXENV/py34-hooks/cubicweb/hooks/test/data/database/pgdb-unittest_syncschema
or
pg_ctl -D /var/lib/jenkins/jobs/cubicweb-3.23/workspace/TOXENV/py34-hooks/cubicweb/hooks/test/data/database/pgdb-unittest_syncschema -l logfile start

waiting for server to start....LOG: database system was shut down at 2016-03-16 16:41:22 CET
LOG: MultiXact member wraparound protections are now enabled
LOG: autovacuum launcher started
LOG: database system is ready to accept connections
done
server started
SSSS
======================================================================
ERROR: test_bad_type_cwproperty (unittest_syncsession.CWPropertyHooksTC)
----------------------------------------------------------------------
Traceback (most recent call last)
File "/usr/lib/python3.4/unittest/case.py", line 58, in testPartExecutor
yield
File "/usr/lib/python3.4/unittest/case.py", line 573, in run
self.setUp()
File "/var/lib/jenkins/jobs/cubicweb-3.23/workspace/TOXENV/py34-hooks/cubicweb/devtools/testlib.py", line 445, in setUp
self._init_repo()
File "/var/lib/jenkins/jobs/cubicweb-3.23/workspace/TOXENV/py34-hooks/cubicweb/devtools/testlib.py", line 353, in _init_repo
db_handler.build_db_cache(self.test_db_id, self.pre_setup_database)
File "/var/lib/jenkins/jobs/cubicweb-3.23/workspace/TOXENV/py34-hooks/cubicweb/devtools/__init__.py", line 492, in build_db_cache
self.init_test_database()
File "/var/lib/jenkins/jobs/cubicweb-3.23/workspace/TOXENV/py34-hooks/cubicweb/devtools/__init__.py", line 817, in init_test_database
init_config=self.init_config)
File "/var/lib/jenkins/jobs/cubicweb-3.23/workspace/TOXENV/py34-hooks/cubicweb/server/__init__.py", line 252, in init_repository
handler = config.migration_handler(schema, interactive=False, repo=repo, cnx=cnx)
TypeError: migration_handler() got an unexpected keyword argument 'repo'

no stdout
no stderr
======================================================================
SKIPPED: test_site_wide_cwproperty (unittest_syncsession.CWPropertyHooksTC)
repository is not initialised: TypeError("migration_handler() got an unexpected keyword argument 'repo'",)
======================================================================
SKIPPED: test_system_cwproperty (unittest_syncsession.CWPropertyHooksTC)
repository is not initialised: TypeError("migration_handler() got an unexpected keyword argument 'repo'",)
======================================================================
SKIPPED: test_unexistant_cwproperty (unittest_syncsession.CWPropertyHooksTC)
repository is not initialised: TypeError("migration_handler() got an unexpected keyword argument 'repo'",)
======================================================================
SKIPPED: test_vreg_propertyvalues_update (unittest_syncsession.CWPropertyHooksTC)
repository is not initialised: TypeError("migration_handler() got an unexpected keyword argument 'repo'",)
====================== unittest_syncschema.py ======================
2016-03-16 16:41:23 - (logilab.database) WARNING: plpgsql language already installed
building tmpdb failed
Ewaiting for server to shut down....LOG: received fast shutdown request
LOG: aborting any active transactions
FATAL: terminating connection due to administrator command
FATAL: terminating connection due to administrator command
FATAL: terminating connection due to administrator command
LOG: autovacuum launcher shutting down
FATAL: terminating connection due to administrator command
FATAL: terminating connection due to administrator command
LOG: shutting down
LOG: database system is shut down
done
server stopped
SSSSSSSSSSSSSSSSE
======================================================================
ERROR: test_add_attribute_to_base_class (unittest_syncschema.SchemaModificationHooksTC)
----------------------------------------------------------------------
Traceback (most recent call last)
File "/usr/lib/python3.4/unittest/case.py", line 58, in testPartExecutor
yield
File "/usr/lib/python3.4/unittest/case.py", line 573, in run
self.setUp()
File "/var/lib/jenkins/jobs/cubicweb-3.23/workspace/TOXENV/py34-hooks/cubicweb/hooks/test/unittest_syncschema.py", line 44, in setUp
super(SchemaModificationHooksTC, self).setUp()
File "/var/lib/jenkins/jobs/cubicweb-3.23/workspace/TOXENV/py34-hooks/cubicweb/devtools/testlib.py", line 445, in setUp
self._init_repo()
File "/var/lib/jenkins/jobs/cubicweb-3.23/workspace/TOXENV/py34-hooks/cubicweb/devtools/testlib.py", line 353, in _init_repo
db_handler.build_db_cache(self.test_db_id, self.pre_setup_database)
File "/var/lib/jenkins/jobs/cubicweb-3.23/workspace/TOXENV/py34-hooks/cubicweb/devtools/__init__.py", line 492, in build_db_cache
self.init_test_database()
File "/var/lib/jenkins/jobs/cubicweb-3.23/workspace/TOXENV/py34-hooks/cubicweb/devtools/__init__.py", line 665, in init_test_database
init_config=self.init_config)
File "/var/lib/jenkins/jobs/cubicweb-3.23/workspace/TOXENV/py34-hooks/cubicweb/server/__init__.py", line 252, in init_repository
handler = config.migration_handler(schema, interactive=False, repo=repo, cnx=cnx)
TypeError: migration_handler() got an unexpected keyword argument 'repo'

no stdout
no stderr
======================================================================
ERROR: tearDownModule (unittest_syncschema)
----------------------------------------------------------------------
Traceback (most recent call last)
File "/usr/lib/python3.4/unittest/suite.py", line 237, in _handleModuleTearDown
tearDownModule()
File "/var/lib/jenkins/jobs/cubicweb-3.23/workspace/TOXENV/py34-hooks/cubicweb/hooks/test/unittest_syncschema.py", line 37, in tearDownModule
del SchemaModificationHooksTC.schema_eids
AttributeError: schema_eids

no stdout
no stderr
======================================================================
SKIPPED: test_add_constraint (unittest_syncschema.SchemaModificationHooksTC)
repository is not initialised: TypeError("migration_handler() got an unexpected keyword argument 'repo'",)
======================================================================
SKIPPED: test_base (unittest_syncschema.SchemaModificationHooksTC)
repository is not initialised: TypeError("migration_handler() got an unexpected keyword argument 'repo'",)
======================================================================
SKIPPED: test_change_fulltext_container (unittest_syncschema.SchemaModificationHooksTC)
repository is not initialised: TypeError("migration_handler() got an unexpected keyword argument 'repo'",)
======================================================================
SKIPPED: test_change_fulltextindexed (unittest_syncschema.SchemaModificationHooksTC)
repository is not initialised: TypeError("migration_handler() got an unexpected keyword argument 'repo'",)
======================================================================
SKIPPED: test_indexed_change (unittest_syncschema.SchemaModificationHooksTC)
repository is not initialised: TypeError("migration_handler() got an unexpected keyword argument 'repo'",)
======================================================================
SKIPPED: test_is_instance_of_insertions (unittest_syncschema.SchemaModificationHooksTC)
repository is not initialised: TypeError("migration_handler() got an unexpected keyword argument 'repo'",)
======================================================================
SKIPPED: test_metartype_with_nordefs (unittest_syncschema.SchemaModificationHooksTC)
repository is not initialised: TypeError("migration_handler() got an unexpected keyword argument 'repo'",)
======================================================================
SKIPPED: test_metartype_with_somerdefs (unittest_syncschema.SchemaModificationHooksTC)
repository is not initialised: TypeError("migration_handler() got an unexpected keyword argument 'repo'",)
======================================================================
SKIPPED: test_nonregr_user_edit_itself (unittest_syncschema.SchemaModificationHooksTC)
repository is not initialised: TypeError("migration_handler() got an unexpected keyword argument 'repo'",)
======================================================================
SKIPPED: test_perms_synchronization_1 (unittest_syncschema.SchemaModificationHooksTC)
repository is not initialised: TypeError("migration_handler() got an unexpected keyword argument 'repo'",)
======================================================================
SKIPPED: test_perms_synchronization_2 (unittest_syncschema.SchemaModificationHooksTC)
repository is not initialised: TypeError("migration_handler() got an unexpected keyword argument 'repo'",)
======================================================================
SKIPPED: test_required_change_1 (unittest_syncschema.SchemaModificationHooksTC)
repository is not initialised: TypeError("migration_handler() got an unexpected keyword argument 'repo'",)
======================================================================
SKIPPED: test_required_change_2 (unittest_syncschema.SchemaModificationHooksTC)
repository is not initialised: TypeError("migration_handler() got an unexpected keyword argument 'repo'",)
======================================================================
SKIPPED: test_uninline_relation (unittest_syncschema.SchemaModificationHooksTC)
repository is not initialised: TypeError("migration_handler() got an unexpected keyword argument 'repo'",)
======================================================================
SKIPPED: test_unique_change (unittest_syncschema.SchemaModificationHooksTC)
repository is not initialised: TypeError("migration_handler() got an unexpected keyword argument 'repo'",)
======================================================================
SKIPPED: test_update_constraint (unittest_syncschema.SchemaModificationHooksTC)
repository is not initialised: TypeError("migration_handler() got an unexpected keyword argument 'repo'",)
===================== unittest_notification.py =====================
E
======================================================================
ERROR: test_entity_update (unittest_notification.NotificationHooksTC)
Check transaction_data['changes'] filled by "notifentityupdated" hook.
----------------------------------------------------------------------
Traceback (most recent call last)
File "/usr/lib/python3.4/unittest/case.py", line 58, in testPartExecutor
yield
File "/usr/lib/python3.4/unittest/case.py", line 573, in run
self.setUp()
File "/var/lib/jenkins/jobs/cubicweb-3.23/workspace/TOXENV/py34-hooks/cubicweb/devtools/testlib.py", line 445, in setUp
self._init_repo()
File "/var/lib/jenkins/jobs/cubicweb-3.23/workspace/TOXENV/py34-hooks/cubicweb/devtools/testlib.py", line 353, in _init_repo
db_handler.build_db_cache(self.test_db_id, self.pre_setup_database)
File "/var/lib/jenkins/jobs/cubicweb-3.23/workspace/TOXENV/py34-hooks/cubicweb/devtools/__init__.py", line 492, in build_db_cache
self.init_test_database()
File "/var/lib/jenkins/jobs/cubicweb-3.23/workspace/TOXENV/py34-hooks/cubicweb/devtools/__init__.py", line 817, in init_test_database
init_config=self.init_config)
File "/var/lib/jenkins/jobs/cubicweb-3.23/workspace/TOXENV/py34-hooks/cubicweb/server/__init__.py", line 252, in init_repository
handler = config.migration_handler(schema, interactive=False, repo=repo, cnx=cnx)
TypeError: migration_handler() got an unexpected keyword argument 'repo'

no stdout
no stderr
======================= unittest_security.py =======================
E
======================================================================
ERROR: test_inlined_cw_edited_relation (unittest_security.SecurityHooksTC)
modification of cw_edited to add an inlined relation shouldn't trigger a security error.
----------------------------------------------------------------------
Traceback (most recent call last)
File "/usr/lib/python3.4/unittest/case.py", line 58, in testPartExecutor
yield
File "/usr/lib/python3.4/unittest/case.py", line 573, in run
self.setUp()
File "/var/lib/jenkins/jobs/cubicweb-3.23/workspace/TOXENV/py34-hooks/cubicweb/devtools/testlib.py", line 445, in setUp
self._init_repo()
File "/var/lib/jenkins/jobs/cubicweb-3.23/workspace/TOXENV/py34-hooks/cubicweb/devtools/testlib.py", line 353, in _init_repo
db_handler.build_db_cache(self.test_db_id, self.pre_setup_database)
File "/var/lib/jenkins/jobs/cubicweb-3.23/workspace/TOXENV/py34-hooks/cubicweb/devtools/__init__.py", line 492, in build_db_cache
self.init_test_database()
File "/var/lib/jenkins/jobs/cubicweb-3.23/workspace/TOXENV/py34-hooks/cubicweb/devtools/__init__.py", line 817, in init_test_database
init_config=self.init_config)
File "/var/lib/jenkins/jobs/cubicweb-3.23/workspace/TOXENV/py34-hooks/cubicweb/server/__init__.py", line 252, in init_repository
handler = config.migration_handler(schema, interactive=False, repo=repo, cnx=cnx)
TypeError: migration_handler() got an unexpected keyword argument 'repo'

no stdout
no stderr
======================== unittest_hooks.py =========================
ESSSSSSSSESESSS
======================================================================
ERROR: test_html_tidy_hook (unittest_hooks.CoreHooksTC)
----------------------------------------------------------------------
Traceback (most recent call last)
File "/usr/lib/python3.4/unittest/case.py", line 58, in testPartExecutor
yield
File "/usr/lib/python3.4/unittest/case.py", line 573, in run
self.setUp()
File "/var/lib/jenkins/jobs/cubicweb-3.23/workspace/TOXENV/py34-hooks/cubicweb/devtools/testlib.py", line 445, in setUp
self._init_repo()
File "/var/lib/jenkins/jobs/cubicweb-3.23/workspace/TOXENV/py34-hooks/cubicweb/devtools/testlib.py", line 353, in _init_repo
db_handler.build_db_cache(self.test_db_id, self.pre_setup_database)
File "/var/lib/jenkins/jobs/cubicweb-3.23/workspace/TOXENV/py34-hooks/cubicweb/devtools/__init__.py", line 492, in build_db_cache
self.init_test_database()
File "/var/lib/jenkins/jobs/cubicweb-3.23/workspace/TOXENV/py34-hooks/cubicweb/devtools/__init__.py", line 817, in init_test_database
init_config=self.init_config)
File "/var/lib/jenkins/jobs/cubicweb-3.23/workspace/TOXENV/py34-hooks/cubicweb/server/__init__.py", line 252, in init_repository
handler = config.migration_handler(schema, interactive=False, repo=repo, cnx=cnx)
TypeError: migration_handler() got an unexpected keyword argument 'repo'

no stdout
no stderr
======================================================================
ERROR: test_duplicate_etype_error (unittest_hooks.SchemaHooksTC)
----------------------------------------------------------------------
Traceback (most recent call last)
File "/usr/lib/python3.4/unittest/case.py", line 58, in testPartExecutor
yield
File "/usr/lib/python3.4/unittest/case.py", line 573, in run
self.setUp()
File "/var/lib/jenkins/jobs/cubicweb-3.23/workspace/TOXENV/py34-hooks/cubicweb/devtools/testlib.py", line 445, in setUp
self._init_repo()
File "/var/lib/jenkins/jobs/cubicweb-3.23/workspace/TOXENV/py34-hooks/cubicweb/devtools/testlib.py", line 353, in _init_repo
db_handler.build_db_cache(self.test_db_id, self.pre_setup_database)
File "/var/lib/jenkins/jobs/cubicweb-3.23/workspace/TOXENV/py34-hooks/cubicweb/devtools/__init__.py", line 492, in build_db_cache
self.init_test_database()
File "/var/lib/jenkins/jobs/cubicweb-3.23/workspace/TOXENV/py34-hooks/cubicweb/devtools/__init__.py", line 817, in init_test_database
init_config=self.init_config)
File "/var/lib/jenkins/jobs/cubicweb-3.23/workspace/TOXENV/py34-hooks/cubicweb/server/__init__.py", line 252, in init_repository
handler = config.migration_handler(schema, interactive=False, repo=repo, cnx=cnx)
TypeError: migration_handler() got an unexpected keyword argument 'repo'

no stdout
no stderr
======================================================================
ERROR: test_no_created_by_on_deleted_entity (unittest_hooks.UserGroupHooksTC)
----------------------------------------------------------------------
Traceback (most recent call last)
File "/usr/lib/python3.4/unittest/case.py", line 58, in testPartExecutor
yield
File "/usr/lib/python3.4/unittest/case.py", line 573, in run
self.setUp()
File "/var/lib/jenkins/jobs/cubicweb-3.23/workspace/TOXENV/py34-hooks/cubicweb/devtools/testlib.py", line 445, in setUp
self._init_repo()
File "/var/lib/jenkins/jobs/cubicweb-3.23/workspace/TOXENV/py34-hooks/cubicweb/devtools/testlib.py", line 353, in _init_repo
db_handler.build_db_cache(self.test_db_id, self.pre_setup_database)
File "/var/lib/jenkins/jobs/cubicweb-3.23/workspace/TOXENV/py34-hooks/cubicweb/devtools/__init__.py", line 492, in build_db_cache
self.init_test_database()
File "/var/lib/jenkins/jobs/cubicweb-3.23/workspace/TOXENV/py34-hooks/cubicweb/devtools/__init__.py", line 817, in init_test_database
init_config=self.init_config)
File "/var/lib/jenkins/jobs/cubicweb-3.23/workspace/TOXENV/py34-hooks/cubicweb/server/__init__.py", line 252, in init_repository
handler = config.migration_handler(schema, interactive=False, repo=repo, cnx=cnx)
TypeError: migration_handler() got an unexpected keyword argument 'repo'

no stdout
no stderr
======================================================================
SKIPPED: test_inlined (unittest_hooks.CoreHooksTC)
repository is not initialised: TypeError("migration_handler() got an unexpected keyword argument 'repo'",)
======================================================================
SKIPPED: test_metadata_created_by (unittest_hooks.CoreHooksTC)
repository is not initialised: TypeError("migration_handler() got an unexpected keyword argument 'repo'",)
======================================================================
SKIPPED: test_metadata_creation_modification_date (unittest_hooks.CoreHooksTC)
repository is not initialised: TypeError("migration_handler() got an unexpected keyword argument 'repo'",)
======================================================================
SKIPPED: test_metadata_cwuri (unittest_hooks.CoreHooksTC)
repository is not initialised: TypeError("migration_handler() got an unexpected keyword argument 'repo'",)
======================================================================
SKIPPED: test_metadata_owned_by (unittest_hooks.CoreHooksTC)
repository is not initialised: TypeError("migration_handler() got an unexpected keyword argument 'repo'",)
======================================================================
SKIPPED: test_nonregr_html_tidy_hook_no_update (unittest_hooks.CoreHooksTC)
repository is not initialised: TypeError("migration_handler() got an unexpected keyword argument 'repo'",)
======================================================================
SKIPPED: test_symmetric (unittest_hooks.CoreHooksTC)
repository is not initialised: TypeError("migration_handler() got an unexpected keyword argument 'repo'",)
======================================================================
SKIPPED: test_user_login_stripped (unittest_hooks.CoreHooksTC)
repository is not initialised: TypeError("migration_handler() got an unexpected keyword argument 'repo'",)
======================================================================
SKIPPED: test_validation_unique_constraint (unittest_hooks.SchemaHooksTC)
repository is not initialised: TypeError("migration_handler() got an unexpected keyword argument 'repo'",)
======================================================================
SKIPPED: test_user_composite_no_owner_on_deleted_entity (unittest_hooks.UserGroupHooksTC)
repository is not initialised: TypeError("migration_handler() got an unexpected keyword argument 'repo'",)
======================================================================
SKIPPED: test_user_composite_owner (unittest_hooks.UserGroupHooksTC)
repository is not initialised: TypeError("migration_handler() got an unexpected keyword argument 'repo'",)
======================================================================
SKIPPED: test_user_group_synchronization (unittest_hooks.UserGroupHooksTC)
repository is not initialised: TypeError("migration_handler() got an unexpected keyword argument 'repo'",)
====================== unittest_bookmarks.py =======================
E
======================================================================
ERROR: test_auto_delete_bookmarks (unittest_bookmarks.BookmarkHooksTC)
----------------------------------------------------------------------
Traceback (most recent call last)
File "/usr/lib/python3.4/unittest/case.py", line 58, in testPartExecutor
yield
File "/usr/lib/python3.4/unittest/case.py", line 573, in run
self.setUp()
File "/var/lib/jenkins/jobs/cubicweb-3.23/workspace/TOXENV/py34-hooks/cubicweb/devtools/testlib.py", line 445, in setUp
self._init_repo()
File "/var/lib/jenkins/jobs/cubicweb-3.23/workspace/TOXENV/py34-hooks/cubicweb/devtools/testlib.py", line 353, in _init_repo
db_handler.build_db_cache(self.test_db_id, self.pre_setup_database)
File "/var/lib/jenkins/jobs/cubicweb-3.23/workspace/TOXENV/py34-hooks/cubicweb/devtools/__init__.py", line 492, in build_db_cache
self.init_test_database()
File "/var/lib/jenkins/jobs/cubicweb-3.23/workspace/TOXENV/py34-hooks/cubicweb/devtools/__init__.py", line 817, in init_test_database
init_config=self.init_config)
File "/var/lib/jenkins/jobs/cubicweb-3.23/workspace/TOXENV/py34-hooks/cubicweb/server/__init__.py", line 252, in init_repository
handler = config.migration_handler(schema, interactive=False, repo=repo, cnx=cnx)
TypeError: migration_handler() got an unexpected keyword argument 'repo'

no stdout
no stderr
====================== unittest_integrity.py =======================
ESSSSSSSSSS
======================================================================
ERROR: test_composite_1 (unittest_integrity.CoreHooksTC)
----------------------------------------------------------------------
Traceback (most recent call last)
File "/usr/lib/python3.4/unittest/case.py", line 58, in testPartExecutor
yield
File "/usr/lib/python3.4/unittest/case.py", line 573, in run
self.setUp()
File "/var/lib/jenkins/jobs/cubicweb-3.23/workspace/TOXENV/py34-hooks/cubicweb/devtools/testlib.py", line 445, in setUp
self._init_repo()
File "/var/lib/jenkins/jobs/cubicweb-3.23/workspace/TOXENV/py34-hooks/cubicweb/devtools/testlib.py", line 353, in _init_repo
db_handler.build_db_cache(self.test_db_id, self.pre_setup_database)
File "/var/lib/jenkins/jobs/cubicweb-3.23/workspace/TOXENV/py34-hooks/cubicweb/devtools/__init__.py", line 492, in build_db_cache
self.init_test_database()
File "/var/lib/jenkins/jobs/cubicweb-3.23/workspace/TOXENV/py34-hooks/cubicweb/devtools/__init__.py", line 817, in init_test_database
init_config=self.init_config)
File "/var/lib/jenkins/jobs/cubicweb-3.23/workspace/TOXENV/py34-hooks/cubicweb/server/__init__.py", line 252, in init_repository
handler = config.migration_handler(schema, interactive=False, repo=repo, cnx=cnx)
TypeError: migration_handler() got an unexpected keyword argument 'repo'

no stdout
no stderr
======================================================================
SKIPPED: test_composite_2 (unittest_integrity.CoreHooksTC)
repository is not initialised: TypeError("migration_handler() got an unexpected keyword argument 'repo'",)
======================================================================
SKIPPED: test_composite_object_relation_deletion (unittest_integrity.CoreHooksTC)
repository is not initialised: TypeError("migration_handler() got an unexpected keyword argument 'repo'",)
======================================================================
SKIPPED: test_composite_redirection (unittest_integrity.CoreHooksTC)
repository is not initialised: TypeError("migration_handler() got an unexpected keyword argument 'repo'",)
======================================================================
SKIPPED: test_composite_subject_relation_deletion (unittest_integrity.CoreHooksTC)
repository is not initialised: TypeError("migration_handler() got an unexpected keyword argument 'repo'",)
======================================================================
SKIPPED: test_delete_internal_entities (unittest_integrity.CoreHooksTC)
repository is not initialised: TypeError("migration_handler() got an unexpected keyword argument 'repo'",)
======================================================================
SKIPPED: test_delete_required_relations_subject (unittest_integrity.CoreHooksTC)
repository is not initialised: TypeError("migration_handler() got an unexpected keyword argument 'repo'",)
======================================================================
SKIPPED: test_missing_required_relations_subject_inline (unittest_integrity.CoreHooksTC)
repository is not initialised: TypeError("migration_handler() got an unexpected keyword argument 'repo'",)
======================================================================
SKIPPED: test_static_vocabulary_check (unittest_integrity.CoreHooksTC)
repository is not initialised: TypeError("migration_handler() got an unexpected keyword argument 'repo'",)
======================================================================
SKIPPED: test_unique_constraint (unittest_integrity.CoreHooksTC)
repository is not initialised: TypeError("migration_handler() got an unexpected keyword argument 'repo'",)
======================================================================
SKIPPED: test_unsatisfied_constraints (unittest_integrity.CoreHooksTC)
repository is not initialised: TypeError("migration_handler() got an unexpected keyword argument 'repo'",)
*******************************************************************************
Ran 58 test cases in 7.76s (3.15s CPU), 11 errors, 45 skipped
0 modules OK (8 failed)
failures: /var/lib/jenkins/jobs/cubicweb-3.23/workspace/TOXENV/py34-hooks/cubicweb/hooks/test/unittest_synccomputed [1/7], /var/lib/jenkins/jobs/cubicweb-3.23/workspace/TOXENV/py34-hooks/cubicweb/hooks/test/unittest_syncsession [1/5], /var/lib/jenkins/jobs/cubicweb-3.23/workspace/TOXENV/py34-hooks/cubicweb/hooks/test/unittest_syncschema [2/17], /var/lib/jenkins/jobs/cubicweb-3.23/workspace/TOXENV/py34-hooks/cubicweb/hooks/test/unittest_notification [1/1], /var/lib/jenkins/jobs/cubicweb-3.23/workspace/TOXENV/py34-hooks/cubicweb/hooks/test/unittest_security [1/1], /var/lib/jenkins/jobs/cubicweb-3.23/workspace/TOXENV/py34-hooks/cubicweb/hooks/test/unittest_hooks [3/15], /var/lib/jenkins/jobs/cubicweb-3.23/workspace/TOXENV/py34-hooks/cubicweb/hooks/test/unittest_bookmarks [1/1], /var/lib/jenkins/jobs/cubicweb-3.23/workspace/TOXENV/py34-hooks/cubicweb/hooks/test/unittest_integrity [1/11]
ERROR: InvocationError: '/var/lib/jenkins/jobs/cubicweb-3.23/workspace/TOXENV/py34-hooks/.tox/py34-hooks/bin/python -c from logilab.common import pytest; pytest.run() -t /var/lib/jenkins/jobs/cubicweb-3.23/workspace/TOXENV/py34-hooks/cubicweb/hooks/test'
___________________________________ summary ____________________________________
ERROR: py34-hooks: commands failed
Build step 'Execute shell' marked build as failure
Sending e-mails to: dlaxalde@logilab.fr jcr@logilab.fr syt@logilab.fr david@logilab.fr
[PostBuildScript] - Execution post build scripts.
[py34-hooks] $ /bin/bash -xe /tmp/hudson7435315164577908632.sh
+ /var/lib/jenkins/scripts/notify_forge_apycot.py cwo cubicweb 41a817cd961c http://jenkins.logilab.fr/job/cubicweb-3.23/TOXENV=py34-hooks/92/ --status failure
<br/>

log from execution
download