consoleText

download

20 Started by upstream project "cubicweb-3.22" build number 15
originally caused by:
Started by an SCM change
Building in workspace /var/lib/jenkins/jobs/cubicweb-3.22/workspace/TOXENV/web
[web] $ hg showconfig paths.default
[web] $ hg pull
pulling from http://hg.logilab.org/review/cubicweb
searching for changes
adding changesets
adding manifests
adding file changes
added 44 changesets with 89 changes to 73 files (+9 heads)
334 new obsolescence markers
updating bookmark cubicweb-3.20
updating bookmark cubicweb-3.23
(run 'hg heads .' to see heads, 'hg merge' to merge)
working directory parent is obsolete!
(use "hg evolve" to update to its successor)
[web] $ hg update --clean --rev de208c217d31918c6f645f48ff454b08e136a24d
1 files updated, 0 files merged, 0 files removed, 0 files unresolved
[web] $ hg --config extensions.purge= clean --all
[web] $ hg log --rev . --template {node}
[web] $ hg log --rev . --template {rev}
[web] $ hg id --branch
[web] $ /bin/bash -xe /tmp/hudson9082550202111852544.sh
+ find . '(' -name 'pgdb*' -o -name 'tmpdb*' ')' -print0
+ xargs -0 rm -rf
[web] $ /bin/bash -xe /tmp/hudson4936070939578903482.sh
+ PATH=/usr/lib/postgresql/9.4/bin:/usr/local/bin:/usr/bin:/bin:/usr/local/games:/usr/games
+ tox --recreate
GLOB sdist-make: /var/lib/jenkins/jobs/cubicweb-3.22/workspace/TOXENV/web/setup.py
web create: /var/lib/jenkins/jobs/cubicweb-3.22/workspace/TOXENV/web/.tox/web
web installdeps: -r/var/lib/jenkins/jobs/cubicweb-3.22/workspace/TOXENV/web/web/test/requirements.txt
web inst: /var/lib/jenkins/jobs/cubicweb-3.22/workspace/TOXENV/web/.tox/dist/cubicweb-3.22.2.zip
web installed: You are using pip version 7.1.2, however version 8.1.0 is available.,You should consider upgrading via the 'pip install --upgrade pip' command.,beautifulsoup4==4.3.2,boto==2.34.0,bzr-etckeeper==0.0.0,cffi==0.8.6,characteristic==0.1.0,chardet==2.3.0,Cheetah==2.4.4,cloud-init==0.7.6,colorama==0.3.2,configobj==5.0.6,coverage==3.7.1,croniter==0.3.4,cryptography==0.6.1,cubicweb==3.22.2,cubicweb-blog==1.12.0,cubicweb-file==1.18.0,cubicweb-tag==1.8.3,cwclientlib==0.4.1,Cython==0.21.1,decorator==3.4.0,docutils==0.12,ecdsa==0.11,euca2ools==3.1.0,flake8==2.2.2,GDAL==1.10.1,hg-evolve==5.2.1,html2text==2016.1.8,html5lib==0.999,isodate==0.5.0,Jinja2==2.7.3,joblib==0.8.3,jsonpatch==1.3,jsonpointer==1.0,logilab-common==1.2.0,logilab-constraint==0.6.0,logilab-database==1.15.0,logilab-mtconverter==0.9.0,lxml==3.4.0,M2Crypto==0.21.1,Mako==1.0.0,Markdown==2.5.1,MarkupSafe==0.23,matplotlib==1.4.2,mccabe==0.2.1,mercurial==3.5.2,mock==1.0.1,msgpack-python==0.4.2,nose==1.3.4,numexpr==2.4,numpy==1.8.2,oauth==1.0.1,openpyxl==1.7.0,pandas==0.14.1,paramiko==1.15.1,passlib==1.6.5,pep8==1.5.7,Pillow==2.6.1,pluggy==0.3.1,ply==3.4,prettytable==0.7.2,psycopg2==2.5.4,py==1.4.31,pyasn1==0.1.7,pyasn1-modules==0.0.5,pycparser==2.10,pycrypto==2.6.1,pyflakes==0.8.1,Pygments==2.0.1,pyinotify==0.9.4,pyOpenSSL==0.14,pyparsing==2.0.3,pyserial==2.6,pysqlite==2.6.3,python-apt==0.9.3.12,python-augeas==0.4.1,python-dateutil==2.2,python-jenkins==0.2.1,python-ldap==2.4.10,python-yapps==2.1.1,python3-ldap==0.9.4.2,pytz==2012rc0,PyYAML==3.11,pyzmq==14.4.0,rdflib==4.1.2,requestbuilder==0.2.3,requests==2.4.3,roman==2.0.0,rql==0.34.0,rubber==1.1,salt==2015.5.3,scikit-learn==0.14.1,scipy==0.14.0,service-identity==1.0.0,Shapely==1.4.3,simplejson==3.6.5,SimpleTAL==4.1,six==1.8.0,SPARQLWrapper==1.6.0,statsmodels==0.4.2,tables==3.1.1,tox==2.3.1,Twisted==16.0.0,urllib3==1.9.1,virtualenv==13.1.2,waitress==0.8.10,WebOb==1.6.0,WebTest==2.0.20,wheel==0.24.0,xlrd==0.9.2,xlwt==0.7.5,yams==0.42.0,Yapps==2.2.0,Yapps2==2.2.0,zope.interface==4.1.3
web runtests: PYTHONHASHSEED='3607649832'
web runtests: commands[0] | /var/lib/jenkins/jobs/cubicweb-3.22/workspace/TOXENV/web/.tox/web/bin/python -c from logilab.common import pytest; pytest.run() -t /var/lib/jenkins/jobs/cubicweb-3.22/workspace/TOXENV/web/web/test
================= unittest_views_apacherewrite.py ==================
.
====================== unittest_formfields.py ======================
2016-03-16 17:22:19 - (cubicweb.appobject) WARNING: can't find any workflow for CWUser
2016-03-16 17:22:31 - (cubicweb.web) WARNING: [3.17] massmailing extracted to cube massmailing that was not found. try installing it.
2016-03-16 17:22:31 - (cubicweb.web) WARNING: [3.17] igeocoding extracted to cube geocoding that was not found. try installing it.
2016-03-16 17:22:31 - (cubicweb.web) WARNING: [3.17] embedding extracted to cube embed that was not found. try installing it.
2016-03-16 17:22:31 - (cubicweb.web) WARNING: [3.17] isioc extracted to cube sioc that was not found. try installing it.
....2016-03-16 17:22:32 - (py.warnings) WARNING: /var/lib/jenkins/jobs/cubicweb-3.22/workspace/TOXENV/web/.tox/web/local/lib/python2.7/site-packages/cubicweb/web/formfields.py:1199: Warning: [yams 0.38] no targettype specified and there are several relation definitions for rtype owned_by: ['BlogEntry', 'CWConstraintType', 'DirectoryPermission', 'Workflow', 'CWUser', 'State', 'Tag', 'CWEType', 'CWConstraint', 'Societe', 'CWGroup', 'CWUniqueTogetherConstraint', 'TreeNode', 'CWComputedRType', 'ExternalUri', 'Folder', 'BaseTransition', 'UserAccount', 'Filesystem', 'TrInfo', 'Version', 'Personne', 'Transition', 'Directory', 'EmailAddress', 'CWDataImport', 'CWCache', 'CWSource', 'File', 'Salesterm', 'CWRelation', 'MicroBlogEntry', 'CWSourceHostConfig', 'Blog', 'WorkflowTransition', 'Ticket', 'CWAttribute', 'CWSourceSchemaConfig', 'MicroBlog', 'RQLExpression', 'Project', 'CWProperty', 'SubWorkflowExitPoint', 'Bookmark', 'CWRType']. Yet you get the first rdef.
rdef = eschema.rdef(rschema, role)

......
========================= unittest_web.py ==========================
..FFFFE.F
======================================================================
ERROR: test_session_cookie_httponly (unittest_web.LanguageTC)
----------------------------------------------------------------------
Traceback (most recent call last)
File "/var/lib/jenkins/jobs/cubicweb-3.22/workspace/TOXENV/web/.tox/web/local/lib/python2.7/site-packages/logilab/common/testlib.py", line 497, in _proceed
testfunc(*args, **kwargs)
File "/var/lib/jenkins/jobs/cubicweb-3.22/workspace/TOXENV/web/web/test/unittest_web.py", line 126, in test_session_cookie_httponly
self.assertIn('HttpOnly', webreq.getheader('set-cookie'))
File "/usr/lib/python2.7/unittest/case.py", line 800, in assertIn
if member not in container:
TypeError: argument of type 'NoneType' is not iterable

no stdout
no stderr
======================================================================
FAIL: test_multiple_file_upload (unittest_web.FileUploadTC)
----------------------------------------------------------------------
Traceback (most recent call last)
File "/var/lib/jenkins/jobs/cubicweb-3.22/workspace/TOXENV/web/.tox/web/local/lib/python2.7/site-packages/logilab/common/testlib.py", line 497, in _proceed
testfunc(*args, **kwargs)
File "/var/lib/jenkins/jobs/cubicweb-3.22/workspace/TOXENV/web/web/test/unittest_web.py", line 94, in test_multiple_file_upload
self.assertEqual(webreq.status_code, 200)
File "/usr/lib/python2.7/unittest/case.py", line 513, in assertEqual
assertion_func(first, second, msg=msg)
File "/usr/lib/python2.7/unittest/case.py", line 506, in _baseAssertEqual
raise self.failureException(msg)
AssertionError: 500 != 200

no stdout
no stderr
======================================================================
FAIL: test_single_file_upload (unittest_web.FileUploadTC)
----------------------------------------------------------------------
Traceback (most recent call last)
File "/var/lib/jenkins/jobs/cubicweb-3.22/workspace/TOXENV/web/.tox/web/local/lib/python2.7/site-packages/logilab/common/testlib.py", line 497, in _proceed
testfunc(*args, **kwargs)
File "/var/lib/jenkins/jobs/cubicweb-3.22/workspace/TOXENV/web/web/test/unittest_web.py", line 84, in test_single_file_upload
self.assertEqual(webreq.status_code, 200)
File "/usr/lib/python2.7/unittest/case.py", line 513, in assertEqual
assertion_func(first, second, msg=msg)
File "/usr/lib/python2.7/unittest/case.py", line 506, in _baseAssertEqual
raise self.failureException(msg)
AssertionError: 500 != 200

no stdout
no stderr
======================================================================
FAIL: test_language_neg (unittest_web.LanguageTC)
----------------------------------------------------------------------
Traceback (most recent call last)
File "/var/lib/jenkins/jobs/cubicweb-3.22/workspace/TOXENV/web/.tox/web/local/lib/python2.7/site-packages/logilab/common/testlib.py", line 497, in _proceed
testfunc(*args, **kwargs)
File "/var/lib/jenkins/jobs/cubicweb-3.22/workspace/TOXENV/web/web/test/unittest_web.py", line 103, in test_language_neg
self.assertIn('lang="fr"', webreq.read())
File "/usr/lib/python2.7/unittest/case.py", line 803, in assertIn
self.fail(self._formatMessage(msg, standardMsg))
File "/usr/lib/python2.7/unittest/case.py", line 410, in fail
raise self.failureException(msg)
AssertionError: 'lang="fr"' not found in '<pre>Traceback (most recent call last):\n File "/var/lib/jenkins/jobs/cubicweb-3.22/workspace/TOXENV/web/.tox/web/local/lib/python2.7/site-packages/cubicweb/etwist/server.py", line 117, in render_request\n return self._render_request(request)\n File "/var/lib/jenkins/jobs/cubicweb-3.22/workspace/TOXENV/web/.tox/web/local/lib/python2.7/site-packages/cubicweb/etwist/server.py", line 139, in _render_request\n req = CubicWebTwistedRequestAdapter(request, self.appli.vreg, https)\n File "/var/lib/jenkins/jobs/cubicweb-3.22/workspace/TOXENV/web/.tox/web/local/lib/python2.7/site-packages/cubicweb/etwist/request.py", line 33, in __init__\n vreg, https, req.args, headers=req.received_headers)\nAttributeError: Request instance has no attribute 'received_headers'\n</pre>'

no stdout
no stderr
======================================================================
FAIL: test_response_codes (unittest_web.LanguageTC)
----------------------------------------------------------------------
Traceback (most recent call last)
File "/var/lib/jenkins/jobs/cubicweb-3.22/workspace/TOXENV/web/.tox/web/local/lib/python2.7/site-packages/logilab/common/testlib.py", line 497, in _proceed
testfunc(*args, **kwargs)
File "/var/lib/jenkins/jobs/cubicweb-3.22/workspace/TOXENV/web/web/test/unittest_web.py", line 117, in test_response_codes
self.assertEqual(webreq.status, 403)
File "/usr/lib/python2.7/unittest/case.py", line 513, in assertEqual
assertion_func(first, second, msg=msg)
File "/usr/lib/python2.7/unittest/case.py", line 506, in _baseAssertEqual
raise self.failureException(msg)
AssertionError: 500 != 403

no stdout
no stderr
======================================================================
FAIL: test_log_queries (unittest_web.MiscOptionsTC)
----------------------------------------------------------------------
Traceback (most recent call last)
File "/var/lib/jenkins/jobs/cubicweb-3.22/workspace/TOXENV/web/.tox/web/local/lib/python2.7/site-packages/logilab/common/testlib.py", line 497, in _proceed
testfunc(*args, **kwargs)
File "/var/lib/jenkins/jobs/cubicweb-3.22/workspace/TOXENV/web/web/test/unittest_web.py", line 144, in test_log_queries
self.assertTrue(self.logfile.read())
File "/usr/lib/python2.7/unittest/case.py", line 422, in assertTrue
raise self.failureException(msg)
AssertionError: '' is not true

no stdout
no stderr
========================= unittest_http.py =========================
......FF.F.................
======================================================================
FAIL: test_both_ok (unittest_http.HTTPCache)
----------------------------------------------------------------------
Traceback (most recent call last)
File "/var/lib/jenkins/jobs/cubicweb-3.22/workspace/TOXENV/web/.tox/web/local/lib/python2.7/site-packages/logilab/common/testlib.py", line 497, in _proceed
testfunc(*args, **kwargs)
File "/var/lib/jenkins/jobs/cubicweb-3.22/workspace/TOXENV/web/web/test/unittest_http.py", line 222, in test_both_ok
self.assertEqual(req.headers_out.getRawHeaders('etag'), ['babar'])
File "/usr/lib/python2.7/unittest/case.py", line 513, in assertEqual
assertion_func(first, second, msg=msg)
File "/usr/lib/python2.7/unittest/case.py", line 506, in _baseAssertEqual
raise self.failureException(msg)
AssertionError: None != ['babar']

no stdout
no stderr
======================================================================
FAIL: test_etag_match (unittest_http.HTTPCache)
----------------------------------------------------------------------
Traceback (most recent call last)
File "/var/lib/jenkins/jobs/cubicweb-3.22/workspace/TOXENV/web/.tox/web/local/lib/python2.7/site-packages/logilab/common/testlib.py", line 497, in _proceed
testfunc(*args, **kwargs)
File "/var/lib/jenkins/jobs/cubicweb-3.22/workspace/TOXENV/web/web/test/unittest_http.py", line 155, in test_etag_match
self.assertEqual(req.headers_out.getRawHeaders('etag'), ['babar'])
File "/usr/lib/python2.7/unittest/case.py", line 513, in assertEqual
assertion_func(first, second, msg=msg)
File "/usr/lib/python2.7/unittest/case.py", line 506, in _baseAssertEqual
raise self.failureException(msg)
AssertionError: None != ['babar']

no stdout
no stderr
======================================================================
FAIL: test_head_verb (unittest_http.HTTPCache)
----------------------------------------------------------------------
Traceback (most recent call last)
File "/var/lib/jenkins/jobs/cubicweb-3.22/workspace/TOXENV/web/.tox/web/local/lib/python2.7/site-packages/logilab/common/testlib.py", line 497, in _proceed
testfunc(*args, **kwargs)
File "/var/lib/jenkins/jobs/cubicweb-3.22/workspace/TOXENV/web/web/test/unittest_http.py", line 242, in test_head_verb
self.assertEqual(req.headers_out.getRawHeaders('etag'), ['babar'])
File "/usr/lib/python2.7/unittest/case.py", line 513, in assertEqual
assertion_func(first, second, msg=msg)
File "/usr/lib/python2.7/unittest/case.py", line 506, in _baseAssertEqual
raise self.failureException(msg)
AssertionError: None != ['babar']

no stdout
no stderr
========================== test_views.py ===========================
2016-03-16 17:22:45 - (py.warnings) WARNING: /var/lib/jenkins/jobs/cubicweb-3.22/workspace/TOXENV/web/.tox/web/local/lib/python2.7/site-packages/cubicweb/devtools/__init__.py:111: RuntimeWarning: admin570e718d674440688a6d751e66d2c041 Open session found while turning repository off
%sessionid, RuntimeWarning)

.............................................................................................................................................................................................................................2016-03-16 17:22:54 - (py.warnings) WARNING: /var/lib/jenkins/jobs/cubicweb-3.22/workspace/TOXENV/web/.tox/web/local/lib/python2.7/site-packages/cubicweb/web/formfields.py:1199: Warning: [yams 0.38] no targettype specified and there are several relation definitions for rtype allowed_transition: ['BaseTransition', 'Transition', 'WorkflowTransition']. Yet you get the first rdef.
rdef = eschema.rdef(rschema, role)

........................................................................................................................................................2016-03-16 17:22:56 - (py.warnings) WARNING: /var/lib/jenkins/jobs/cubicweb-3.22/workspace/TOXENV/web/.tox/web/local/lib/python2.7/site-packages/cubicweb/web/formfields.py:1199: Warning: [yams 0.38] no targettype specified and there are several relation definitions for rtype constrained_by: ['CWRelation', 'CWAttribute']. Yet you get the first rdef.
rdef = eschema.rdef(rschema, role)

..................................................................................................................................................................................................................................................................................................................................................................................................................................................................................................................................................................................................................................................................................................................................................................................................................................................................................................................................................................................................................................................................................................................................................................................................................................................................................................................................................................................................................................................................................................................................................................................................................................................................................................................................................................................................................................................................................................................................................................................................................................................................................................................................................................................................................................................................2016-03-16 17:23:52 - (cubicweb.appobject) ERROR: cycle in breadcrumbs for entity <Entity TreeNode 1451 ['modification_date', 'creation_date', 'name', 'cwuri'] at 139648201872336>
...2016-03-16 17:23:52 - (cubicweb.appobject) ERROR: cycle in breadcrumbs for entity <Entity TreeNode 1451 ['modification_date', 'creation_date', 'name', 'cwuri'] at 139648201872336>
.2016-03-16 17:23:52 - (cubicweb.appobject) ERROR: cycle in breadcrumbs for entity <Entity TreeNode 1451 ['modification_date', 'creation_date', 'name', 'cwuri'] at 139648201872336>
.2016-03-16 17:23:52 - (cubicweb.appobject) ERROR: cycle in breadcrumbs for entity <Entity TreeNode 1451 ['modification_date', 'creation_date', 'name', 'cwuri'] at 139648201872336>
.....2016-03-16 17:23:52 - (cubicweb.appobject) ERROR: cycle in breadcrumbs for entity <Entity TreeNode 1451 ['modification_date', 'creation_date', 'name', 'cwuri'] at 139648201872336>
...2016-03-16 17:23:52 - (cubicweb.appobject) ERROR: cycle in breadcrumbs for entity <Entity TreeNode 1451 ['modification_date', 'creation_date', 'name', 'cwuri'] at 139648201872336>
.2016-03-16 17:23:52 - (cubicweb.appobject) ERROR: cycle in breadcrumbs for entity <Entity TreeNode 1451 ['modification_date', 'creation_date', 'name', 'cwuri'] at 139648201872336>
.2016-03-16 17:23:52 - (cubicweb.appobject) ERROR: cycle in breadcrumbs for entity <Entity TreeNode 1451 ['modification_date', 'creation_date', 'name', 'cwuri'] at 139648201872336>
........................2016-03-16 17:23:52 - (cubicweb.appobject) ERROR: cycle in breadcrumbs for entity <Entity TreeNode 1451 ['modification_date', 'creation_date', 'name', 'cwuri'] at 139648201872336>
.........................................................................................................................................................................................................................................................................................................................................................................................................................................................................................................................................................................................................................................................................................................................................................................................................................................................................................................................................................................................................................................................................................................................................................................................................................................................
==================== unittest_idownloadable.py =====================
2016-03-16 17:24:06 - (cubicweb.web) ERROR: IOError()
Traceback (most recent call last):
File "/var/lib/jenkins/jobs/cubicweb-3.22/workspace/TOXENV/web/.tox/web/local/lib/python2.7/site-packages/cubicweb/web/application.py", line 369, in core_handle
result = controller.publish(rset=rset)
File "/var/lib/jenkins/jobs/cubicweb-3.22/workspace/TOXENV/web/.tox/web/local/lib/python2.7/site-packages/cubicweb/web/views/basecontrollers.py", line 134, in publish
rset=rset, view=view)
File "/var/lib/jenkins/jobs/cubicweb-3.22/workspace/TOXENV/web/.tox/web/local/lib/python2.7/site-packages/cubicweb/cwvreg.py", line 225, in main_template
res = obj.render(**kwargs)
File "/var/lib/jenkins/jobs/cubicweb-3.22/workspace/TOXENV/web/.tox/web/local/lib/python2.7/site-packages/cubicweb/view.py", line 138, in render
view_func(**context)
File "/var/lib/jenkins/jobs/cubicweb-3.22/workspace/TOXENV/web/.tox/web/local/lib/python2.7/site-packages/cubicweb/web/views/basetemplates.py", line 120, in call
view.render()
File "/var/lib/jenkins/jobs/cubicweb-3.22/workspace/TOXENV/web/.tox/web/local/lib/python2.7/site-packages/cubicweb/view.py", line 138, in render
view_func(**context)
File "/var/lib/jenkins/jobs/cubicweb-3.22/workspace/TOXENV/web/.tox/web/local/lib/python2.7/site-packages/cubicweb/web/views/idownloadable.py", line 94, in call
self.w(adapter.download_data())
File "unittest_idownloadable.py", line 56, in download_data
raise IOError()
IOError
......
==================== unittest_views_pyviews.py =====================
..
====================== unittest_views_csv.py =======================
..
===================== unittest_breadcrumbs.py ======================
.
===================== unittest_http_headers.py =====================
.
==================== unittest_propertysheet.py =====================
.
===================== unittest_application.py ======================
2016-03-16 17:24:14 - (cubicweb.web) ERROR: Exception('whatever',)
Traceback (most recent call last):
File "/var/lib/jenkins/jobs/cubicweb-3.22/workspace/TOXENV/web/.tox/web/local/lib/python2.7/site-packages/cubicweb/web/application.py", line 369, in core_handle
result = controller.publish(rset=rset)
File "/var/lib/jenkins/jobs/cubicweb-3.22/workspace/TOXENV/web/.tox/web/local/lib/python2.7/site-packages/cubicweb/web/views/basecontrollers.py", line 134, in publish
rset=rset, view=view)
File "/var/lib/jenkins/jobs/cubicweb-3.22/workspace/TOXENV/web/.tox/web/local/lib/python2.7/site-packages/cubicweb/cwvreg.py", line 225, in main_template
res = obj.render(**kwargs)
File "/var/lib/jenkins/jobs/cubicweb-3.22/workspace/TOXENV/web/.tox/web/local/lib/python2.7/site-packages/cubicweb/view.py", line 138, in render
view_func(**context)
File "/var/lib/jenkins/jobs/cubicweb-3.22/workspace/TOXENV/web/.tox/web/local/lib/python2.7/site-packages/cubicweb/web/views/basetemplates.py", line 163, in call
view.render(w=w)
File "/var/lib/jenkins/jobs/cubicweb-3.22/workspace/TOXENV/web/.tox/web/local/lib/python2.7/site-packages/cubicweb/view.py", line 138, in render
view_func(**context)
File "unittest_application.py", line 519, in call
raise Exception('whatever')
Exception: whatever
2016-03-16 17:24:14 - (py.warnings) WARNING: /var/lib/jenkins/jobs/cubicweb-3.22/workspace/TOXENV/web/.tox/web/local/lib/python2.7/site-packages/cubicweb/devtools/__init__.py:111: RuntimeWarning: anonf85c78561eb44b3e96ebd47ec55b55eb Open session found while turning repository off
%sessionid, RuntimeWarning)

.2016-03-16 17:24:15 - (py.warnings) WARNING: /var/lib/jenkins/jobs/cubicweb-3.22/workspace/TOXENV/web/.tox/web/local/lib/python2.7/site-packages/cubicweb/devtools/__init__.py:111: RuntimeWarning: anon6f4a3cd69c45400ab176b478ba1c9206 Open session found while turning repository off
%sessionid, RuntimeWarning)

....2016-03-16 17:24:20 - (py.warnings) WARNING: /var/lib/jenkins/jobs/cubicweb-3.22/workspace/TOXENV/web/.tox/web/local/lib/python2.7/site-packages/cubicweb/web/formfields.py:1199: Warning: [yams 0.38] no targettype specified and there are several relation definitions for rtype parent: ['Directory', 'Filesystem']. Yet you get the first rdef.
rdef = eschema.rdef(rschema, role)

.......2016-03-16 17:24:26 - (cubicweb.web) WARNING: the view toto could not be found
.................
==================== unittest_views_treeview.py ====================
.
====================== unittest_webconfig.py =======================
...
====================== unittest_views_json.py ======================
...2016-03-16 17:24:29 - (py.warnings) WARNING: /var/lib/jenkins/jobs/cubicweb-3.22/workspace/TOXENV/web/.tox/web/local/lib/python2.7/site-packages/cubicweb/devtools/__init__.py:111: RuntimeWarning: anon389a0ca55943477486aca9e9f0dce9f6 Open session found while turning repository off
%sessionid, RuntimeWarning)

.2016-03-16 17:24:29 - (cubicweb.web) WARNING: vid table can't be used with jsonp controller, falling back to jsonexport
2016-03-16 17:24:30 - (py.warnings) WARNING: /var/lib/jenkins/jobs/cubicweb-3.22/workspace/TOXENV/web/.tox/web/local/lib/python2.7/site-packages/cubicweb/devtools/__init__.py:111: RuntimeWarning: anon90e187d8ae654bd39abf45a337c78864 Open session found while turning repository off
%sessionid, RuntimeWarning)

.....2016-03-16 17:24:31 - (cubicweb.web) WARNING: vid table can't be used with jsonp controller, falling back to jsonexport
.
===================== unittest_views_forms.py ======================
...
======================== unittest_uicfg.py =========================
.........
================= unittest_views_basetemplates.py ==================
..
===================== unittest_formwidgets.py ======================
...
======================== unittest_facet.py =========================
....................
=================== unittest_views_errorform.py ====================
....
=============== unittest_views_staticcontrollers.py ================
.2016-03-16 17:24:39 - (cubicweb.web) ERROR: concatenated data url error: u'dummy.js' file does not exist
.2016-03-16 17:24:39 - (cubicweb.web) ERROR: concatenated data url error: u'dummy.js' file does not exist
....
===================== unittest_urlpublisher.py =====================
.............
===================== unittest_magicsearch.py ======================
..................
=============== unittest_views_searchrestriction.py ================
........
========================= test_jscript.py ==========================
......................2016-03-16 17:25:09 - (py.warnings) WARNING: /var/lib/jenkins/jobs/cubicweb-3.22/workspace/TOXENV/web/.tox/web/local/lib/python2.7/site-packages/cubicweb/devtools/__init__.py:111: RuntimeWarning: anon493a1cf2ad804870b58cfc63548e33a5 Open session found while turning repository off
%sessionid, RuntimeWarning)

2016-03-16 17:25:09 - (py.warnings) WARNING: /var/lib/jenkins/jobs/cubicweb-3.22/workspace/TOXENV/web/.tox/web/local/lib/python2.7/site-packages/cubicweb/devtools/__init__.py:111: RuntimeWarning: anon4d35a259ce0e4c68b406b6a8ca404e3f Open session found while turning repository off
%sessionid, RuntimeWarning)

2016-03-16 17:25:09 - (py.warnings) WARNING: /var/lib/jenkins/jobs/cubicweb-3.22/workspace/TOXENV/web/.tox/web/local/lib/python2.7/site-packages/cubicweb/devtools/__init__.py:111: RuntimeWarning: anon6c4481b614894dfe97bbd5b19d68e581 Open session found while turning repository off
%sessionid, RuntimeWarning)

====================== unittest_urlrewrite.py ======================
........
===================== unittest_viewselector.py =====================
.......................
===================== unittest_views_xmlrss.py =====================
.
====================== unittest_controller.py ======================
..
=================== unittest_views_editforms.py ====================
..................
=================== unittest_views_navigation.py ===================
...........
======================= unittest_request.py ========================
....
==================== unittest_views_actions.py =====================
..
======================= unittest_reledit.py ========================
.S.2016-03-16 17:25:28 - (cubicweb.rtags) WARNING: using explict subject type in <property object at 0x7f02680e3d60>.tag_object_of() has no effect, use ("*", concerns, Project) instead of (Ticket, concerns, Project)
.
======================================================================
SKIPPED: test_default_forms (unittest_reledit.ClickAndEditFormTC)
Need to check if this test should still run post reledit/doreledit merge
=================== unittest_views_baseviews.py ====================
.............
================ unittest_views_basecontrollers.py =================
.................2016-03-16 17:25:42 - (py.warnings) WARNING: /var/lib/jenkins/jobs/cubicweb-3.22/workspace/TOXENV/web/.tox/web/local/lib/python2.7/site-packages/cubicweb/web/formfields.py:1199: Warning: [yams 0.38] no targettype specified and there are several relation definitions for rtype to_entity: ['CWRelation', 'CWAttribute']. Yet you get the first rdef.
rdef = eschema.rdef(rschema, role)

.....2016-03-16 17:25:46 - (py.warnings) WARNING: /var/lib/jenkins/jobs/cubicweb-3.22/workspace/TOXENV/web/.tox/web/local/lib/python2.7/site-packages/cubicweb/web/formfields.py:1199: Warning: [yams 0.38] no targettype specified and there are several relation definitions for rtype read_permission: ['RQLExpression', 'CWGroup']. Yet you get the first rdef.
rdef = eschema.rdef(rschema, role)

2016-03-16 17:25:46 - (cubicweb.session) WARNING: no schema for 7
2016-03-16 17:25:46 - (cubicweb.session) WARNING: no schema for 7
..2016-03-16 17:25:47 - (cubicweb.web) WARNING: param login-subject mis-formatted
.........................................2016-03-16 17:26:12 - (py.warnings) WARNING: /var/lib/jenkins/jobs/cubicweb-3.22/workspace/TOXENV/web/.tox/web/local/lib/python2.7/site-packages/cubicweb/devtools/__init__.py:111: RuntimeWarning: anon4721663c48c34938b7af09e602ef27eb Open session found while turning repository off
%sessionid, RuntimeWarning)

.
========================= unittest_form.py =========================
....2016-03-16 17:26:12 - (py.warnings) WARNING: /var/lib/jenkins/jobs/cubicweb-3.22/workspace/TOXENV/web/.tox/web/local/lib/python2.7/site-packages/cubicweb/web/formfields.py:1199: Warning: [yams 0.38] no targettype specified and there are several relation definitions for rtype tags: ['Tag', 'BlogEntry', 'CWUser']. Yet you get the first rdef.
rdef = eschema.rdef(rschema, role)

...........
-> creating tables
-> inserting default user and default groups.
-> storing the schema in the database
-> database for instance data initialized.
Building autopopulate for database tmpdb
*******************************************************************************
Ran 4176 test cases in 236.53s (223.52s CPU), 1 errors, 8 failures, 1 skipped
36 modules OK (2 failed)
failures: /var/lib/jenkins/jobs/cubicweb-3.22/workspace/TOXENV/web/web/test/unittest_web [6/9], /var/lib/jenkins/jobs/cubicweb-3.22/workspace/TOXENV/web/web/test/unittest_http [3/27]
ERROR: InvocationError: '/var/lib/jenkins/jobs/cubicweb-3.22/workspace/TOXENV/web/.tox/web/bin/python -c from logilab.common import pytest; pytest.run() -t /var/lib/jenkins/jobs/cubicweb-3.22/workspace/TOXENV/web/web/test'
___________________________________ summary ____________________________________
ERROR: web: commands failed
Build step 'Execute shell' marked build as failure
Sending e-mails to: dlaxalde@logilab.fr jcr@logilab.fr syt@logilab.fr david@logilab.fr
[PostBuildScript] - Execution post build scripts.
[web] $ /bin/bash -xe /tmp/hudson6182838003108502804.sh
+ /var/lib/jenkins/scripts/notify_forge_apycot.py cwo cubicweb de208c217d31 http://jenkins.logilab.fr/job/cubicweb-3.22/TOXENV=web/15/ --status failure
<br/>

log from execution
download