consoleText

download

20 Started by upstream project "cubicweb-3.23" build number 110
originally caused by:
Started by an SCM change
Building in workspace /var/lib/jenkins/jobs/cubicweb-3.23/workspace/TOXENV/py27-cubicweb
[py27-cubicweb] $ hg showconfig paths.default
[py27-cubicweb] $ hg pull
pulling from http://hg.logilab.org/review/cubicweb
searching for changes
adding changesets
adding manifests
adding file changes
added 1 changesets with 0 changes to 1 files
1 new obsolescence markers
updating bookmark cubicweb-3.23
(run 'hg update' to get a working copy)
[py27-cubicweb] $ hg update --clean --rev 0276f1246a4dd17c247239a0679732a2636aea6f
1 files updated, 0 files merged, 0 files removed, 0 files unresolved
[py27-cubicweb] $ hg --config extensions.purge= clean --all
[py27-cubicweb] $ hg log --rev . --template {node}
[py27-cubicweb] $ hg log --rev . --template {rev}
[py27-cubicweb] $ hg id --branch
[py27-cubicweb] $ /bin/bash -xe /tmp/hudson4410179486430480745.sh
+ find . '(' -name 'pgdb*' -o -name 'tmpdb*' ')' -print0
+ xargs -0 rm -rf
[py27-cubicweb] $ /bin/bash -xe /tmp/hudson5871889304964551437.sh
+ PATH=/usr/lib/postgresql/9.4/bin:/usr/local/bin:/usr/bin:/bin:/usr/local/games:/usr/games
+ tox --recreate
py27-cubicweb create: /var/lib/jenkins/jobs/cubicweb-3.23/workspace/TOXENV/py27-cubicweb/.tox/py27-cubicweb
py27-cubicweb installdeps: hg+https://hg.logilab.org/master/yams@default#egg=yams, -r/var/lib/jenkins/jobs/cubicweb-3.23/workspace/TOXENV/py27-cubicweb/cubicweb/test/requirements.txt
py27-cubicweb develop-inst: /var/lib/jenkins/jobs/cubicweb-3.23/workspace/TOXENV/py27-cubicweb
py27-cubicweb installed: You are using pip version 7.1.2, however version 8.1.1 is available.,You should consider upgrading via the 'pip install --upgrade pip' command.,beautifulsoup4==4.3.2,boto==2.34.0,bzr-etckeeper==0.0.0,cffi==0.8.6,characteristic==0.1.0,chardet==2.3.0,Cheetah==2.4.4,cloud-init==0.7.6,colorama==0.3.2,configobj==5.0.6,coverage==3.7.1,croniter==0.3.4,cryptography==0.6.1,-e hg+http://hg.logilab.org/review/cubicweb@0276f1246a4dd17c247239a0679732a2636aea6f#egg=cubicweb-dev,cubicweb-card==0.5.8,cubicweb-file==1.18.0,cubicweb-localperms==0.3.2,cubicweb-tag==1.8.3,cwclientlib==0.4.1,Cython==0.21.1,decorator==3.4.0,docutils==0.12,ecdsa==0.11,euca2ools==3.1.0,GDAL==1.10.1,hg-evolve==5.2.1,html2text==2016.4.2,html5lib==0.999,isodate==0.5.0,Jinja2==2.7.3,joblib==0.8.3,jsonpatch==1.3,jsonpointer==1.0,linecache2==1.0.0,logilab-common==1.2.0,logilab-constraint==0.6.0,logilab-database==1.15.0,logilab-mtconverter==0.9.0,lxml==3.4.0,M2Crypto==0.21.1,Mako==1.0.0,Markdown==2.5.1,MarkupSafe==0.23,matplotlib==1.4.2,mccabe==0.2.1,mercurial==3.5.2,mock==1.0.1,msgpack-python==0.4.2,nose==1.3.4,numexpr==2.4,numpy==1.8.2,oauth==1.0.1,openpyxl==1.7.0,pandas==0.14.1,paramiko==1.15.1,passlib==1.6.5,pep8==1.5.7,Pillow==2.6.1,pluggy==0.3.1,ply==3.4,prettytable==0.7.2,psycopg2==2.5.4,py==1.4.31,pyasn1==0.1.7,pyasn1-modules==0.0.5,pycparser==2.10,pycrypto==2.6.1,pyflakes==0.8.1,Pygments==2.0.1,pyinotify==0.9.4,pyOpenSSL==0.14,pyparsing==2.0.3,pyserial==2.6,pysqlite==2.6.3,python-apt==0.9.3.12,python-augeas==0.4.1,python-dateutil==2.2,python-jenkins==0.2.1,python-ldap==2.4.10,python-yapps==2.1.1,python3-ldap==0.9.4.2,pytz==2012rc0,PyYAML==3.11,pyzmq==14.4.0,rdflib==4.1.2,requestbuilder==0.2.3,requests==2.4.3,roman==2.0.0,rql==0.34.0,rubber==1.1,salt==2015.5.3,scikit-learn==0.14.1,scipy==0.14.0,service-identity==1.0.0,Shapely==1.4.3,simplejson==3.6.5,SimpleTAL==4.1,six==1.8.0,SPARQLWrapper==1.6.0,statsmodels==0.4.2,tables==3.1.1,tox==2.3.1,traceback2==1.4.0,unittest2==1.1.0,urllib3==1.9.1,virtualenv==13.1.2,wheel==0.24.0,xlrd==0.9.2,xlwt==0.7.5,yams==0.42.0,Yapps==2.2.0,Yapps2==2.2.0
py27-cubicweb runtests: PYTHONHASHSEED='1432889924'
py27-cubicweb runtests: commands[0] | /var/lib/jenkins/jobs/cubicweb-3.23/workspace/TOXENV/py27-cubicweb/.tox/py27-cubicweb/bin/python -m pip install --upgrade --no-deps --quiet git+git://github.com/logilab/yapps@master
py27-cubicweb runtests: commands[1] | /var/lib/jenkins/jobs/cubicweb-3.23/workspace/TOXENV/py27-cubicweb/.tox/py27-cubicweb/bin/python -c from logilab.common import pytest; pytest.run() -t /var/lib/jenkins/jobs/cubicweb-3.23/workspace/TOXENV/py27-cubicweb/cubicweb/test
======================= unittest_spa2rql.py ========================
unhandled exception occurred while testing unittest_spa2rql
Traceback (most recent call last):
File "/var/lib/jenkins/jobs/cubicweb-3.23/workspace/TOXENV/py27-cubicweb/.tox/py27-cubicweb/local/lib/python2.7/site-packages/logilab/common/pytest.py", line 390, in testfile
options=self.options, outstream=sys.stderr)
File "/var/lib/jenkins/jobs/cubicweb-3.23/workspace/TOXENV/py27-cubicweb/.tox/py27-cubicweb/local/lib/python2.7/site-packages/logilab/common/pytest.py", line 706, in __init__
testLoader=NonStrictTestLoader())
File "/usr/lib/python2.7/unittest/main.py", line 77, in __init__
self.module = __import__(module)
File "unittest_spa2rql.py", line 21, in <module>
from cubicweb.devtools import TestServerConfiguration
File "/var/lib/jenkins/jobs/cubicweb-3.23/workspace/TOXENV/py27-cubicweb/cubicweb/devtools/__init__.py", line 45, in <module>
from cubicweb import schema, cwconfig
File "/var/lib/jenkins/jobs/cubicweb-3.23/workspace/TOXENV/py27-cubicweb/cubicweb/schema.py", line 42, in <module>
from yams.constraints import (BaseConstraint, FormatConstraint, BoundaryConstraint,
ImportError: cannot import name cstr_json_dumps
======================== unittest_uilib.py =========================
..................
======================== unittest_schema.py ========================
unhandled exception occurred while testing unittest_schema
Traceback (most recent call last):
File "/var/lib/jenkins/jobs/cubicweb-3.23/workspace/TOXENV/py27-cubicweb/.tox/py27-cubicweb/local/lib/python2.7/site-packages/logilab/common/pytest.py", line 390, in testfile
options=self.options, outstream=sys.stderr)
File "/var/lib/jenkins/jobs/cubicweb-3.23/workspace/TOXENV/py27-cubicweb/.tox/py27-cubicweb/local/lib/python2.7/site-packages/logilab/common/pytest.py", line 706, in __init__
testLoader=NonStrictTestLoader())
File "/usr/lib/python2.7/unittest/main.py", line 77, in __init__
self.module = __import__(module)
File "unittest_schema.py", line 33, in <module>
from cubicweb.schema import (
File "/var/lib/jenkins/jobs/cubicweb-3.23/workspace/TOXENV/py27-cubicweb/cubicweb/schema.py", line 42, in <module>
from yams.constraints import (BaseConstraint, FormatConstraint, BoundaryConstraint,
ImportError: cannot import name cstr_json_dumps
======================== unittest_entity.py ========================
unhandled exception occurred while testing unittest_entity
Traceback (most recent call last):
File "/var/lib/jenkins/jobs/cubicweb-3.23/workspace/TOXENV/py27-cubicweb/.tox/py27-cubicweb/local/lib/python2.7/site-packages/logilab/common/pytest.py", line 390, in testfile
options=self.options, outstream=sys.stderr)
File "/var/lib/jenkins/jobs/cubicweb-3.23/workspace/TOXENV/py27-cubicweb/.tox/py27-cubicweb/local/lib/python2.7/site-packages/logilab/common/pytest.py", line 706, in __init__
testLoader=NonStrictTestLoader())
File "/usr/lib/python2.7/unittest/main.py", line 77, in __init__
self.module = __import__(module)
File "unittest_entity.py", line 29, in <module>
from cubicweb.devtools.testlib import CubicWebTC
File "/var/lib/jenkins/jobs/cubicweb-3.23/workspace/TOXENV/py27-cubicweb/cubicweb/devtools/__init__.py", line 45, in <module>
from cubicweb import schema, cwconfig
File "/var/lib/jenkins/jobs/cubicweb-3.23/workspace/TOXENV/py27-cubicweb/cubicweb/schema.py", line 42, in <module>
from yams.constraints import (BaseConstraint, FormatConstraint, BoundaryConstraint,
ImportError: cannot import name cstr_json_dumps
====================== unittest_vregistry.py =======================
unhandled exception occurred while testing unittest_vregistry
Traceback (most recent call last):
File "/var/lib/jenkins/jobs/cubicweb-3.23/workspace/TOXENV/py27-cubicweb/.tox/py27-cubicweb/local/lib/python2.7/site-packages/logilab/common/pytest.py", line 390, in testfile
options=self.options, outstream=sys.stderr)
File "/var/lib/jenkins/jobs/cubicweb-3.23/workspace/TOXENV/py27-cubicweb/.tox/py27-cubicweb/local/lib/python2.7/site-packages/logilab/common/pytest.py", line 706, in __init__
testLoader=NonStrictTestLoader())
File "/usr/lib/python2.7/unittest/main.py", line 77, in __init__
self.module = __import__(module)
File "unittest_vregistry.py", line 25, in <module>
from cubicweb.cwvreg import CWRegistryStore, UnknownProperty
File "/var/lib/jenkins/jobs/cubicweb-3.23/workspace/TOXENV/py27-cubicweb/cubicweb/cwvreg.py", line 45, in <module>
from cubicweb.predicates import appobject_selectable, _reset_is_instance_cache
File "/var/lib/jenkins/jobs/cubicweb-3.23/workspace/TOXENV/py27-cubicweb/cubicweb/predicates.py", line 39, in <module>
from cubicweb.schema import split_expression
File "/var/lib/jenkins/jobs/cubicweb-3.23/workspace/TOXENV/py27-cubicweb/cubicweb/schema.py", line 42, in <module>
from yams.constraints import (BaseConstraint, FormatConstraint, BoundaryConstraint,
ImportError: cannot import name cstr_json_dumps
====================== unittest_rqlrewrite.py ======================
unhandled exception occurred while testing unittest_rqlrewrite
Traceback (most recent call last):
File "/var/lib/jenkins/jobs/cubicweb-3.23/workspace/TOXENV/py27-cubicweb/.tox/py27-cubicweb/local/lib/python2.7/site-packages/logilab/common/pytest.py", line 390, in testfile
options=self.options, outstream=sys.stderr)
File "/var/lib/jenkins/jobs/cubicweb-3.23/workspace/TOXENV/py27-cubicweb/.tox/py27-cubicweb/local/lib/python2.7/site-packages/logilab/common/pytest.py", line 706, in __init__
testLoader=NonStrictTestLoader())
File "/usr/lib/python2.7/unittest/main.py", line 77, in __init__
self.module = __import__(module)
File "unittest_rqlrewrite.py", line 27, in <module>
from cubicweb import Unauthorized, rqlrewrite
File "/var/lib/jenkins/jobs/cubicweb-3.23/workspace/TOXENV/py27-cubicweb/cubicweb/rqlrewrite.py", line 36, in <module>
from cubicweb.schema import RRQLExpression
File "/var/lib/jenkins/jobs/cubicweb-3.23/workspace/TOXENV/py27-cubicweb/cubicweb/schema.py", line 42, in <module>
from yams.constraints import (BaseConstraint, FormatConstraint, BoundaryConstraint,
ImportError: cannot import name cstr_json_dumps
====================== unittest_migration.py =======================
unhandled exception occurred while testing unittest_migration
Traceback (most recent call last):
File "/var/lib/jenkins/jobs/cubicweb-3.23/workspace/TOXENV/py27-cubicweb/.tox/py27-cubicweb/local/lib/python2.7/site-packages/logilab/common/pytest.py", line 390, in testfile
options=self.options, outstream=sys.stderr)
File "/var/lib/jenkins/jobs/cubicweb-3.23/workspace/TOXENV/py27-cubicweb/.tox/py27-cubicweb/local/lib/python2.7/site-packages/logilab/common/pytest.py", line 706, in __init__
testLoader=NonStrictTestLoader())
File "/usr/lib/python2.7/unittest/main.py", line 77, in __init__
self.module = __import__(module)
File "unittest_migration.py", line 23, in <module>
from cubicweb.devtools import TestServerConfiguration
File "/var/lib/jenkins/jobs/cubicweb-3.23/workspace/TOXENV/py27-cubicweb/cubicweb/devtools/__init__.py", line 45, in <module>
from cubicweb import schema, cwconfig
File "/var/lib/jenkins/jobs/cubicweb-3.23/workspace/TOXENV/py27-cubicweb/cubicweb/schema.py", line 42, in <module>
from yams.constraints import (BaseConstraint, FormatConstraint, BoundaryConstraint,
ImportError: cannot import name cstr_json_dumps
======================= unittest_repoapi.py ========================
unhandled exception occurred while testing unittest_repoapi
Traceback (most recent call last):
File "/var/lib/jenkins/jobs/cubicweb-3.23/workspace/TOXENV/py27-cubicweb/.tox/py27-cubicweb/local/lib/python2.7/site-packages/logilab/common/pytest.py", line 390, in testfile
options=self.options, outstream=sys.stderr)
File "/var/lib/jenkins/jobs/cubicweb-3.23/workspace/TOXENV/py27-cubicweb/.tox/py27-cubicweb/local/lib/python2.7/site-packages/logilab/common/pytest.py", line 706, in __init__
testLoader=NonStrictTestLoader())
File "/usr/lib/python2.7/unittest/main.py", line 77, in __init__
self.module = __import__(module)
File "unittest_repoapi.py", line 21, in <module>
from cubicweb.devtools.testlib import CubicWebTC
File "/var/lib/jenkins/jobs/cubicweb-3.23/workspace/TOXENV/py27-cubicweb/cubicweb/devtools/__init__.py", line 45, in <module>
from cubicweb import schema, cwconfig
File "/var/lib/jenkins/jobs/cubicweb-3.23/workspace/TOXENV/py27-cubicweb/cubicweb/schema.py", line 42, in <module>
from yams.constraints import (BaseConstraint, FormatConstraint, BoundaryConstraint,
ImportError: cannot import name cstr_json_dumps
========================= unittest_req.py ==========================
unhandled exception occurred while testing unittest_req
Traceback (most recent call last):
File "/var/lib/jenkins/jobs/cubicweb-3.23/workspace/TOXENV/py27-cubicweb/.tox/py27-cubicweb/local/lib/python2.7/site-packages/logilab/common/pytest.py", line 390, in testfile
options=self.options, outstream=sys.stderr)
File "/var/lib/jenkins/jobs/cubicweb-3.23/workspace/TOXENV/py27-cubicweb/.tox/py27-cubicweb/local/lib/python2.7/site-packages/logilab/common/pytest.py", line 706, in __init__
testLoader=NonStrictTestLoader())
File "/usr/lib/python2.7/unittest/main.py", line 77, in __init__
self.module = __import__(module)
File "unittest_req.py", line 22, in <module>
from cubicweb.devtools.testlib import CubicWebTC
File "/var/lib/jenkins/jobs/cubicweb-3.23/workspace/TOXENV/py27-cubicweb/cubicweb/devtools/__init__.py", line 45, in <module>
from cubicweb import schema, cwconfig
File "/var/lib/jenkins/jobs/cubicweb-3.23/workspace/TOXENV/py27-cubicweb/cubicweb/schema.py", line 42, in <module>
from yams.constraints import (BaseConstraint, FormatConstraint, BoundaryConstraint,
ImportError: cannot import name cstr_json_dumps
========================= unittest_rset.py =========================
unhandled exception occurred while testing unittest_rset
Traceback (most recent call last):
File "/var/lib/jenkins/jobs/cubicweb-3.23/workspace/TOXENV/py27-cubicweb/.tox/py27-cubicweb/local/lib/python2.7/site-packages/logilab/common/pytest.py", line 390, in testfile
options=self.options, outstream=sys.stderr)
File "/var/lib/jenkins/jobs/cubicweb-3.23/workspace/TOXENV/py27-cubicweb/.tox/py27-cubicweb/local/lib/python2.7/site-packages/logilab/common/pytest.py", line 706, in __init__
testLoader=NonStrictTestLoader())
File "/usr/lib/python2.7/unittest/main.py", line 77, in __init__
self.module = __import__(module)
File "unittest_rset.py", line 29, in <module>
from cubicweb.devtools.testlib import CubicWebTC
File "/var/lib/jenkins/jobs/cubicweb-3.23/workspace/TOXENV/py27-cubicweb/cubicweb/devtools/__init__.py", line 45, in <module>
from cubicweb import schema, cwconfig
File "/var/lib/jenkins/jobs/cubicweb-3.23/workspace/TOXENV/py27-cubicweb/cubicweb/schema.py", line 42, in <module>
from yams.constraints import (BaseConstraint, FormatConstraint, BoundaryConstraint,
ImportError: cannot import name cstr_json_dumps
======================== unittest_rtags.py =========================
...
========================= unittest_mail.py =========================
unhandled exception occurred while testing unittest_mail
Traceback (most recent call last):
File "/var/lib/jenkins/jobs/cubicweb-3.23/workspace/TOXENV/py27-cubicweb/.tox/py27-cubicweb/local/lib/python2.7/site-packages/logilab/common/pytest.py", line 390, in testfile
options=self.options, outstream=sys.stderr)
File "/var/lib/jenkins/jobs/cubicweb-3.23/workspace/TOXENV/py27-cubicweb/.tox/py27-cubicweb/local/lib/python2.7/site-packages/logilab/common/pytest.py", line 706, in __init__
testLoader=NonStrictTestLoader())
File "/usr/lib/python2.7/unittest/main.py", line 77, in __init__
self.module = __import__(module)
File "unittest_mail.py", line 29, in <module>
from cubicweb.devtools.testlib import CubicWebTC
File "/var/lib/jenkins/jobs/cubicweb-3.23/workspace/TOXENV/py27-cubicweb/cubicweb/devtools/__init__.py", line 45, in <module>
from cubicweb import schema, cwconfig
File "/var/lib/jenkins/jobs/cubicweb-3.23/workspace/TOXENV/py27-cubicweb/cubicweb/schema.py", line 42, in <module>
from yams.constraints import (BaseConstraint, FormatConstraint, BoundaryConstraint,
ImportError: cannot import name cstr_json_dumps
====================== unittest_predicates.py ======================
unhandled exception occurred while testing unittest_predicates
Traceback (most recent call last):
File "/var/lib/jenkins/jobs/cubicweb-3.23/workspace/TOXENV/py27-cubicweb/.tox/py27-cubicweb/local/lib/python2.7/site-packages/logilab/common/pytest.py", line 390, in testfile
options=self.options, outstream=sys.stderr)
File "/var/lib/jenkins/jobs/cubicweb-3.23/workspace/TOXENV/py27-cubicweb/.tox/py27-cubicweb/local/lib/python2.7/site-packages/logilab/common/pytest.py", line 706, in __init__
testLoader=NonStrictTestLoader())
File "/usr/lib/python2.7/unittest/main.py", line 77, in __init__
self.module = __import__(module)
File "unittest_predicates.py", line 29, in <module>
from cubicweb.devtools.testlib import CubicWebTC
File "/var/lib/jenkins/jobs/cubicweb-3.23/workspace/TOXENV/py27-cubicweb/cubicweb/devtools/__init__.py", line 45, in <module>
from cubicweb import schema, cwconfig
File "/var/lib/jenkins/jobs/cubicweb-3.23/workspace/TOXENV/py27-cubicweb/cubicweb/schema.py", line 42, in <module>
from yams.constraints import (BaseConstraint, FormatConstraint, BoundaryConstraint,
ImportError: cannot import name cstr_json_dumps
======================== unittest_cwctl.py =========================
unhandled exception occurred while testing unittest_cwctl
Traceback (most recent call last):
File "/var/lib/jenkins/jobs/cubicweb-3.23/workspace/TOXENV/py27-cubicweb/.tox/py27-cubicweb/local/lib/python2.7/site-packages/logilab/common/pytest.py", line 390, in testfile
options=self.options, outstream=sys.stderr)
File "/var/lib/jenkins/jobs/cubicweb-3.23/workspace/TOXENV/py27-cubicweb/.tox/py27-cubicweb/local/lib/python2.7/site-packages/logilab/common/pytest.py", line 706, in __init__
testLoader=NonStrictTestLoader())
File "/usr/lib/python2.7/unittest/main.py", line 77, in __init__
self.module = __import__(module)
File "unittest_cwctl.py", line 28, in <module>
from cubicweb.devtools.testlib import CubicWebTC
File "/var/lib/jenkins/jobs/cubicweb-3.23/workspace/TOXENV/py27-cubicweb/cubicweb/devtools/__init__.py", line 45, in <module>
from cubicweb import schema, cwconfig
File "/var/lib/jenkins/jobs/cubicweb-3.23/workspace/TOXENV/py27-cubicweb/cubicweb/schema.py", line 42, in <module>
from yams.constraints import (BaseConstraint, FormatConstraint, BoundaryConstraint,
ImportError: cannot import name cstr_json_dumps
====================== unittest_toolsutils.py ======================
....
======================== unittest_binary.py ========================
....
======================= unittest_cwconfig.py =======================
unhandled exception occurred while testing unittest_cwconfig
Traceback (most recent call last):
File "/var/lib/jenkins/jobs/cubicweb-3.23/workspace/TOXENV/py27-cubicweb/.tox/py27-cubicweb/local/lib/python2.7/site-packages/logilab/common/pytest.py", line 390, in testfile
options=self.options, outstream=sys.stderr)
File "/var/lib/jenkins/jobs/cubicweb-3.23/workspace/TOXENV/py27-cubicweb/.tox/py27-cubicweb/local/lib/python2.7/site-packages/logilab/common/pytest.py", line 706, in __init__
testLoader=NonStrictTestLoader())
File "/usr/lib/python2.7/unittest/main.py", line 77, in __init__
self.module = __import__(module)
File "unittest_cwconfig.py", line 30, in <module>
from cubicweb.devtools import ApptestConfiguration
File "/var/lib/jenkins/jobs/cubicweb-3.23/workspace/TOXENV/py27-cubicweb/cubicweb/devtools/__init__.py", line 45, in <module>
from cubicweb import schema, cwconfig
File "/var/lib/jenkins/jobs/cubicweb-3.23/workspace/TOXENV/py27-cubicweb/cubicweb/schema.py", line 42, in <module>
from yams.constraints import (BaseConstraint, FormatConstraint, BoundaryConstraint,
ImportError: cannot import name cstr_json_dumps
======================== unittest_utils.py =========================
unhandled exception occurred while testing unittest_utils
Traceback (most recent call last):
File "/var/lib/jenkins/jobs/cubicweb-3.23/workspace/TOXENV/py27-cubicweb/.tox/py27-cubicweb/local/lib/python2.7/site-packages/logilab/common/pytest.py", line 390, in testfile
options=self.options, outstream=sys.stderr)
File "/var/lib/jenkins/jobs/cubicweb-3.23/workspace/TOXENV/py27-cubicweb/.tox/py27-cubicweb/local/lib/python2.7/site-packages/logilab/common/pytest.py", line 706, in __init__
testLoader=NonStrictTestLoader())
File "/usr/lib/python2.7/unittest/main.py", line 77, in __init__
self.module = __import__(module)
File "unittest_utils.py", line 29, in <module>
from cubicweb.devtools.testlib import CubicWebTC
File "/var/lib/jenkins/jobs/cubicweb-3.23/workspace/TOXENV/py27-cubicweb/cubicweb/devtools/__init__.py", line 45, in <module>
from cubicweb import schema, cwconfig
File "/var/lib/jenkins/jobs/cubicweb-3.23/workspace/TOXENV/py27-cubicweb/cubicweb/schema.py", line 42, in <module>
from yams.constraints import (BaseConstraint, FormatConstraint, BoundaryConstraint,
ImportError: cannot import name cstr_json_dumps
*******************************************************************************
Ran 43 test cases in 0.17s (0.16s CPU), 14 errors
4 modules OK (14 failed)
failures: /var/lib/jenkins/jobs/cubicweb-3.23/workspace/TOXENV/py27-cubicweb/cubicweb/test/unittest_spa2rql [1/1], /var/lib/jenkins/jobs/cubicweb-3.23/workspace/TOXENV/py27-cubicweb/cubicweb/test/unittest_schema [1/1], /var/lib/jenkins/jobs/cubicweb-3.23/workspace/TOXENV/py27-cubicweb/cubicweb/test/unittest_entity [1/1], /var/lib/jenkins/jobs/cubicweb-3.23/workspace/TOXENV/py27-cubicweb/cubicweb/test/unittest_vregistry [1/1], /var/lib/jenkins/jobs/cubicweb-3.23/workspace/TOXENV/py27-cubicweb/cubicweb/test/unittest_rqlrewrite [1/1], /var/lib/jenkins/jobs/cubicweb-3.23/workspace/TOXENV/py27-cubicweb/cubicweb/test/unittest_migration [1/1], /var/lib/jenkins/jobs/cubicweb-3.23/workspace/TOXENV/py27-cubicweb/cubicweb/test/unittest_repoapi [1/1], /var/lib/jenkins/jobs/cubicweb-3.23/workspace/TOXENV/py27-cubicweb/cubicweb/test/unittest_req [1/1], /var/lib/jenkins/jobs/cubicweb-3.23/workspace/TOXENV/py27-cubicweb/cubicweb/test/unittest_rset [1/1], /var/lib/jenkins/jobs/cubicweb-3.23/workspace/TOXENV/py27-cubicweb/cubicweb/test/unittest_mail [1/1], /var/lib/jenkins/jobs/cubicweb-3.23/workspace/TOXENV/py27-cubicweb/cubicweb/test/unittest_predicates [1/1], /var/lib/jenkins/jobs/cubicweb-3.23/workspace/TOXENV/py27-cubicweb/cubicweb/test/unittest_cwctl [1/1], /var/lib/jenkins/jobs/cubicweb-3.23/workspace/TOXENV/py27-cubicweb/cubicweb/test/unittest_cwconfig [1/1], /var/lib/jenkins/jobs/cubicweb-3.23/workspace/TOXENV/py27-cubicweb/cubicweb/test/unittest_utils [1/1]
ERROR: InvocationError: '/var/lib/jenkins/jobs/cubicweb-3.23/workspace/TOXENV/py27-cubicweb/.tox/py27-cubicweb/bin/python -c from logilab.common import pytest; pytest.run() -t /var/lib/jenkins/jobs/cubicweb-3.23/workspace/TOXENV/py27-cubicweb/cubicweb/test'
___________________________________ summary ____________________________________
ERROR: py27-cubicweb: commands failed
Build step 'Execute shell' marked build as failure
Sending e-mails to: dlaxalde@logilab.fr jcr@logilab.fr syt@logilab.fr david@logilab.fr
[PostBuildScript] - Execution post build scripts.
[py27-cubicweb] $ /bin/bash -xe /tmp/hudson4879890365679792443.sh
+ /var/lib/jenkins/scripts/notify_forge_apycot.py cwo cubicweb 0276f1246a4d http://jenkins.logilab.fr/job/cubicweb-3.23/TOXENV=py27-cubicweb/110/ --status failure
<br/>

log from execution
download