consoleText

download

20 Started by upstream project "cubicweb-3.22" build number 17
originally caused by:
Started by an SCM change
Building in workspace /var/lib/jenkins/jobs/cubicweb-3.22/workspace/TOXENV/web
[web] $ hg showconfig paths.default
[web] $ hg pull
pulling from http://hg.logilab.org/review/cubicweb
searching for changes
adding changesets
adding manifests
adding file changes
added 22 changesets with 27 changes to 30 files (+2 heads)
35 new obsolescence markers
updating bookmark cubicweb-3.20
updating bookmark cubicweb-3.21
updating bookmark cubicweb-3.23
(run 'hg heads .' to see heads, 'hg merge' to merge)
[web] $ hg update --clean --rev 6706c46e24ae158cc1a99f5219c55cfc3da54c6f
1 files updated, 0 files merged, 0 files removed, 0 files unresolved
[web] $ hg --config extensions.purge= clean --all
[web] $ hg log --rev . --template {node}
[web] $ hg log --rev . --template {rev}
[web] $ hg id --branch
[web] $ /bin/bash -xe /tmp/hudson3436215408365889522.sh
+ find . '(' -name 'pgdb*' -o -name 'tmpdb*' ')' -print0
+ xargs -0 rm -rf
[web] $ /bin/bash -xe /tmp/hudson3281169615030622219.sh
+ PATH=/usr/lib/postgresql/9.4/bin:/usr/local/bin:/usr/bin:/bin:/usr/local/games:/usr/games
+ tox --recreate
GLOB sdist-make: /var/lib/jenkins/jobs/cubicweb-3.22/workspace/TOXENV/web/setup.py
web create: /var/lib/jenkins/jobs/cubicweb-3.22/workspace/TOXENV/web/.tox/web
web installdeps: -r/var/lib/jenkins/jobs/cubicweb-3.22/workspace/TOXENV/web/web/test/requirements.txt
web inst: /var/lib/jenkins/jobs/cubicweb-3.22/workspace/TOXENV/web/.tox/dist/cubicweb-3.22.2.zip
web installed: You are using pip version 7.1.2, however version 8.1.1 is available.,You should consider upgrading via the 'pip install --upgrade pip' command.,beautifulsoup4==4.3.2,boto==2.34.0,bzr-etckeeper==0.0.0,cffi==0.8.6,characteristic==0.1.0,chardet==2.3.0,Cheetah==2.4.4,cloud-init==0.7.6,colorama==0.3.2,configobj==5.0.6,coverage==3.7.1,croniter==0.3.4,cryptography==0.6.1,cubicweb==3.22.2,cubicweb-blog==1.12.0,cubicweb-file==1.18.0,cubicweb-tag==1.8.3,cwclientlib==0.4.1,Cython==0.21.1,decorator==3.4.0,docutils==0.12,ecdsa==0.11,euca2ools==3.1.0,GDAL==1.10.1,hg-evolve==5.2.1,html2text==2016.4.2,html5lib==0.999,isodate==0.5.0,Jinja2==2.7.3,joblib==0.8.3,jsonpatch==1.3,jsonpointer==1.0,logilab-common==1.2.0,logilab-constraint==0.6.0,logilab-database==1.15.0,logilab-mtconverter==0.9.0,lxml==3.4.0,M2Crypto==0.21.1,Mako==1.0.0,Markdown==2.5.1,MarkupSafe==0.23,matplotlib==1.4.2,mccabe==0.2.1,mercurial==3.5.2,mock==1.0.1,msgpack-python==0.4.2,nose==1.3.4,numexpr==2.4,numpy==1.8.2,oauth==1.0.1,openpyxl==1.7.0,pandas==0.14.1,paramiko==1.15.1,passlib==1.6.5,pep8==1.5.7,Pillow==2.6.1,pluggy==0.3.1,ply==3.4,prettytable==0.7.2,psycopg2==2.5.4,py==1.4.31,pyasn1==0.1.7,pyasn1-modules==0.0.5,pycparser==2.10,pycrypto==2.6.1,pyflakes==0.8.1,Pygments==2.0.1,pyinotify==0.9.4,pyOpenSSL==0.14,pyparsing==2.0.3,pyserial==2.6,pysqlite==2.6.3,python-apt==0.9.3.12,python-augeas==0.4.1,python-dateutil==2.2,python-jenkins==0.2.1,python-ldap==2.4.10,python-yapps==2.1.1,python3-ldap==0.9.4.2,pytz==2012rc0,PyYAML==3.11,pyzmq==14.4.0,rdflib==4.1.2,requestbuilder==0.2.3,requests==2.4.3,roman==2.0.0,rql==0.34.0,rubber==1.1,salt==2015.5.3,scikit-learn==0.14.1,scipy==0.14.0,service-identity==1.0.0,Shapely==1.4.3,simplejson==3.6.5,SimpleTAL==4.1,six==1.8.0,SPARQLWrapper==1.6.0,statsmodels==0.4.2,tables==3.1.1,tox==2.3.1,Twisted==15.5.0,urllib3==1.9.1,virtualenv==13.1.2,waitress==0.8.10,WebOb==1.6.0,WebTest==2.0.20,wheel==0.24.0,xlrd==0.9.2,xlwt==0.7.5,yams==0.42.0,Yapps==2.2.0,Yapps2==2.2.0,zope.interface==4.1.3
web runtests: PYTHONHASHSEED='586215507'
web runtests: commands[0] | /var/lib/jenkins/jobs/cubicweb-3.22/workspace/TOXENV/web/.tox/web/bin/python -c from logilab.common import pytest; pytest.run() -t /var/lib/jenkins/jobs/cubicweb-3.22/workspace/TOXENV/web/web/test
==================== unittest_views_actions.py =====================
2016-04-12 10:41:27 - (cubicweb.appobject) WARNING: can't find any workflow for CWUser
2016-04-12 10:41:42 - (cubicweb.web) WARNING: [3.17] massmailing extracted to cube massmailing that was not found. try installing it.
2016-04-12 10:41:42 - (cubicweb.web) WARNING: [3.17] igeocoding extracted to cube geocoding that was not found. try installing it.
2016-04-12 10:41:42 - (cubicweb.web) WARNING: [3.17] embedding extracted to cube embed that was not found. try installing it.
2016-04-12 10:41:42 - (cubicweb.web) WARNING: [3.17] isioc extracted to cube sioc that was not found. try installing it.
..
====================== unittest_controller.py ======================
..
====================== unittest_webconfig.py =======================
...
================ unittest_views_basecontrollers.py =================
.................2016-04-12 10:41:57 - (py.warnings) WARNING: /var/lib/jenkins/jobs/cubicweb-3.22/workspace/TOXENV/web/.tox/web/local/lib/python2.7/site-packages/cubicweb/web/formfields.py:1199: Warning: [yams 0.38] no targettype specified and there are several relation definitions for rtype to_entity: ['CWAttribute', 'CWRelation']. Yet you get the first rdef.
rdef = eschema.rdef(rschema, role)

.....2016-04-12 10:42:02 - (py.warnings) WARNING: /var/lib/jenkins/jobs/cubicweb-3.22/workspace/TOXENV/web/.tox/web/local/lib/python2.7/site-packages/cubicweb/web/formfields.py:1199: Warning: [yams 0.38] no targettype specified and there are several relation definitions for rtype read_permission: ['RQLExpression', 'CWGroup']. Yet you get the first rdef.
rdef = eschema.rdef(rschema, role)

2016-04-12 10:42:02 - (cubicweb.session) WARNING: no schema for 7
2016-04-12 10:42:02 - (cubicweb.session) WARNING: no schema for 7
..2016-04-12 10:42:04 - (cubicweb.web) WARNING: param login-subject mis-formatted
.........................................2016-04-12 10:42:26 - (py.warnings) WARNING: /var/lib/jenkins/jobs/cubicweb-3.22/workspace/TOXENV/web/.tox/web/local/lib/python2.7/site-packages/cubicweb/devtools/__init__.py:111: RuntimeWarning: anon2844445301054c099f1bb3ea84de02c3 Open session found while turning repository off
%sessionid, RuntimeWarning)

.
========================== test_views.py ===========================
2016-04-12 10:42:27 - (py.warnings) WARNING: /var/lib/jenkins/jobs/cubicweb-3.22/workspace/TOXENV/web/.tox/web/local/lib/python2.7/site-packages/cubicweb/devtools/__init__.py:111: RuntimeWarning: admin88e8c08e6147420f9a93bff4a8cd92bc Open session found while turning repository off
%sessionid, RuntimeWarning)

2016-04-12 10:42:28 - (py.warnings) WARNING: /var/lib/jenkins/jobs/cubicweb-3.22/workspace/TOXENV/web/.tox/web/local/lib/python2.7/site-packages/cubicweb/web/formfields.py:1199: Warning: [yams 0.38] no targettype specified and there are several relation definitions for rtype constrained_by: ['CWAttribute', 'CWRelation']. Yet you get the first rdef.
rdef = eschema.rdef(rschema, role)

...............................................................................................................................................................................................................................................................................................................................................................................................................................................................................................................................................................................................................................................................................................................................................................................................................................................................................................................................................................................................................................................................................................................................................................................................................................................................2016-04-12 10:42:51 - (py.warnings) WARNING: /var/lib/jenkins/jobs/cubicweb-3.22/workspace/TOXENV/web/.tox/web/local/lib/python2.7/site-packages/cubicweb/web/formfields.py:1199: Warning: [yams 0.38] no targettype specified and there are several relation definitions for rtype allowed_transition: ['BaseTransition', 'Transition', 'WorkflowTransition']. Yet you get the first rdef.
rdef = eschema.rdef(rschema, role)

.........................................................................................................................................................................................................................................................................................................................................................................................................................................................................................................................................................................................................................................................................................................................................................................................................................................................................................................................................................................................................................................................................................................................................................................................................................................................................................................................................................................................................................................................................................................................................................................................................................................................................................................................................................................................................................................................................................................................2016-04-12 10:43:40 - (cubicweb.appobject) ERROR: cycle in breadcrumbs for entity <Entity TreeNode 1395 ['cwuri', 'name'] at 140087571714512>
........2016-04-12 10:43:40 - (cubicweb.appobject) ERROR: cycle in breadcrumbs for entity <Entity TreeNode 1395 ['cwuri', 'name', 'creation_date', 'modification_date'] at 140087571714512>
.2016-04-12 10:43:40 - (cubicweb.appobject) ERROR: cycle in breadcrumbs for entity <Entity TreeNode 1395 ['cwuri', 'name', 'creation_date', 'modification_date'] at 140087571714512>
...2016-04-12 10:43:40 - (cubicweb.appobject) ERROR: cycle in breadcrumbs for entity <Entity TreeNode 1395 ['cwuri', 'name', 'creation_date', 'modification_date'] at 140087571714512>
.2016-04-12 10:43:40 - (cubicweb.appobject) ERROR: cycle in breadcrumbs for entity <Entity TreeNode 1395 ['cwuri', 'name', 'creation_date', 'modification_date'] at 140087571714512>
.2016-04-12 10:43:40 - (cubicweb.appobject) ERROR: cycle in breadcrumbs for entity <Entity TreeNode 1395 ['cwuri', 'name', 'creation_date', 'modification_date'] at 140087571714512>
.2016-04-12 10:43:40 - (cubicweb.appobject) ERROR: cycle in breadcrumbs for entity <Entity TreeNode 1395 ['cwuri', 'name', 'creation_date', 'modification_date'] at 140087571714512>
..2016-04-12 10:43:40 - (cubicweb.appobject) ERROR: cycle in breadcrumbs for entity <Entity TreeNode 1395 ['cwuri', 'name', 'creation_date', 'modification_date'] at 140087571714512>
.................2016-04-12 10:43:40 - (cubicweb.appobject) ERROR: cycle in breadcrumbs for entity <Entity TreeNode 1395 ['cwuri', 'name', 'creation_date', 'modification_date'] at 140087571714512>
....................................................................................................................................................................................................................................................................................................................................................................................................................................................................................................................................................................................................................................................................................................................................................................
====================== unittest_views_json.py ======================
...2016-04-12 10:43:52 - (py.warnings) WARNING: /var/lib/jenkins/jobs/cubicweb-3.22/workspace/TOXENV/web/.tox/web/local/lib/python2.7/site-packages/cubicweb/devtools/__init__.py:111: RuntimeWarning: anon23a99c8ba98845bc9fc4706d42ff7e01 Open session found while turning repository off
%sessionid, RuntimeWarning)

.2016-04-12 10:43:52 - (cubicweb.web) WARNING: vid table can't be used with jsonp controller, falling back to jsonexport
2016-04-12 10:43:53 - (py.warnings) WARNING: /var/lib/jenkins/jobs/cubicweb-3.22/workspace/TOXENV/web/.tox/web/local/lib/python2.7/site-packages/cubicweb/devtools/__init__.py:111: RuntimeWarning: anon0ec7f6dc0b0a4ce29212231454d49786 Open session found while turning repository off
%sessionid, RuntimeWarning)

.....2016-04-12 10:43:53 - (cubicweb.web) WARNING: vid table can't be used with jsonp controller, falling back to jsonexport
.
======================== unittest_facet.py =========================
....................
========================= unittest_web.py ==========================
..2016-04-12 10:43:58 - (py.warnings) WARNING: /var/lib/jenkins/jobs/cubicweb-3.22/workspace/TOXENV/web/.tox/web/local/lib/python2.7/site-packages/cubicweb/devtools/__init__.py:111: RuntimeWarning: anonb2ce921275cd4d1b8515144bbb529f75 Open session found while turning repository off
%sessionid, RuntimeWarning)

.2016-04-12 10:43:59 - (py.warnings) WARNING: /var/lib/jenkins/jobs/cubicweb-3.22/workspace/TOXENV/web/.tox/web/local/lib/python2.7/site-packages/cubicweb/devtools/__init__.py:111: RuntimeWarning: anon421e419211524c91b0f39cfacc2a9a6c Open session found while turning repository off
%sessionid, RuntimeWarning)

.2016-04-12 10:44:03 - (py.warnings) WARNING: /var/lib/jenkins/jobs/cubicweb-3.22/workspace/TOXENV/web/.tox/web/local/lib/python2.7/site-packages/cubicweb/devtools/__init__.py:111: RuntimeWarning: anon4bf15a42731b469eafec1ec4d061b345 Open session found while turning repository off
%sessionid, RuntimeWarning)

2016-04-12 10:44:03 - (py.warnings) WARNING: /var/lib/jenkins/jobs/cubicweb-3.22/workspace/TOXENV/web/.tox/web/local/lib/python2.7/site-packages/cubicweb/devtools/__init__.py:111: RuntimeWarning: anon63fb777a806f4e6b98688ba18cc69a4e Open session found while turning repository off
%sessionid, RuntimeWarning)

.2016-04-12 10:44:06 - (py.warnings) WARNING: /var/lib/jenkins/jobs/cubicweb-3.22/workspace/TOXENV/web/.tox/web/local/lib/python2.7/site-packages/cubicweb/devtools/__init__.py:111: RuntimeWarning: admin1b0a6f661c564ca1bf7ca4d6e8f1756d Open session found while turning repository off
%sessionid, RuntimeWarning)

2016-04-12 10:44:06 - (py.warnings) WARNING: /var/lib/jenkins/jobs/cubicweb-3.22/workspace/TOXENV/web/.tox/web/local/lib/python2.7/site-packages/cubicweb/devtools/__init__.py:111: RuntimeWarning: anonda4d86499e124f3084088b70a39e4b9b Open session found while turning repository off
%sessionid, RuntimeWarning)

.2016-04-12 10:44:08 - (py.warnings) WARNING: /var/lib/jenkins/jobs/cubicweb-3.22/workspace/TOXENV/web/.tox/web/local/lib/python2.7/site-packages/cubicweb/devtools/__init__.py:111: RuntimeWarning: anona966c7b1d35f4c5b99d544d64ddaa533 Open session found while turning repository off
%sessionid, RuntimeWarning)

.2016-04-12 10:44:11 - (py.warnings) WARNING: /var/lib/jenkins/jobs/cubicweb-3.22/workspace/TOXENV/web/.tox/web/local/lib/python2.7/site-packages/cubicweb/devtools/__init__.py:111: RuntimeWarning: anonf3309daeed4f4de39425372daf43517b Open session found while turning repository off
%sessionid, RuntimeWarning)

.2016-04-12 10:44:13 - (py.warnings) WARNING: /var/lib/jenkins/jobs/cubicweb-3.22/workspace/TOXENV/web/.tox/web/local/lib/python2.7/site-packages/cubicweb/devtools/__init__.py:111: RuntimeWarning: anonb036ae08da3f4f2a8515ea02588b29de Open session found while turning repository off
%sessionid, RuntimeWarning)

.
================= unittest_views_basetemplates.py ==================
..
========================= test_jscript.py ==========================
......................2016-04-12 10:44:23 - (py.warnings) WARNING: /var/lib/jenkins/jobs/cubicweb-3.22/workspace/TOXENV/web/.tox/web/local/lib/python2.7/site-packages/cubicweb/devtools/__init__.py:111: RuntimeWarning: anona353ad4b392d4de0833ea76a00073a06 Open session found while turning repository off
%sessionid, RuntimeWarning)

2016-04-12 10:44:23 - (py.warnings) WARNING: /var/lib/jenkins/jobs/cubicweb-3.22/workspace/TOXENV/web/.tox/web/local/lib/python2.7/site-packages/cubicweb/devtools/__init__.py:111: RuntimeWarning: anon8d6077c40dbe43e4880a3b1cb9e37f83 Open session found while turning repository off
%sessionid, RuntimeWarning)

2016-04-12 10:44:23 - (py.warnings) WARNING: /var/lib/jenkins/jobs/cubicweb-3.22/workspace/TOXENV/web/.tox/web/local/lib/python2.7/site-packages/cubicweb/devtools/__init__.py:111: RuntimeWarning: anon38d8bc530c7f4afb8ac01322d0e92abd Open session found while turning repository off
%sessionid, RuntimeWarning)

======================= unittest_request.py ========================
....
===================== unittest_http_headers.py =====================
.
================= unittest_views_apacherewrite.py ==================
.
====================== unittest_formfields.py ======================
....2016-04-12 10:44:25 - (py.warnings) WARNING: /var/lib/jenkins/jobs/cubicweb-3.22/workspace/TOXENV/web/.tox/web/local/lib/python2.7/site-packages/cubicweb/web/formfields.py:1199: Warning: [yams 0.38] no targettype specified and there are several relation definitions for rtype owned_by: ['CWConstraint', 'CWUser', 'BaseTransition', 'Salesterm', 'MicroBlogEntry', 'File', 'WorkflowTransition', 'MicroBlog', 'CWRelation', 'SubWorkflowExitPoint', 'CWAttribute', 'Ticket', 'CWConstraintType', 'Societe', 'Bookmark', 'Filesystem', 'Version', 'CWUniqueTogetherConstraint', 'CWEType', 'CWSource', 'Directory', 'Personne', 'TreeNode', 'DirectoryPermission', 'CWCache', 'TrInfo', 'Project', 'Transition', 'State', 'EmailAddress', 'UserAccount', 'RQLExpression', 'Workflow', 'BlogEntry', 'CWComputedRType', 'Folder', 'Blog', 'Tag', 'CWSourceSchemaConfig', 'CWDataImport', 'CWProperty', 'CWGroup', 'CWRType', 'CWSourceHostConfig', 'ExternalUri']. Yet you get the first rdef.
rdef = eschema.rdef(rschema, role)

......
=============== unittest_views_staticcontrollers.py ================
.2016-04-12 10:44:26 - (cubicweb.web) ERROR: concatenated data url error: u'dummy.js' file does not exist
.2016-04-12 10:44:26 - (cubicweb.web) ERROR: concatenated data url error: u'dummy.js' file does not exist
....
===================== unittest_application.py ======================
2016-04-12 10:44:29 - (cubicweb.web) ERROR: Exception('whatever',)
Traceback (most recent call last):
File "/var/lib/jenkins/jobs/cubicweb-3.22/workspace/TOXENV/web/.tox/web/local/lib/python2.7/site-packages/cubicweb/web/application.py", line 369, in core_handle
result = controller.publish(rset=rset)
File "/var/lib/jenkins/jobs/cubicweb-3.22/workspace/TOXENV/web/.tox/web/local/lib/python2.7/site-packages/cubicweb/web/views/basecontrollers.py", line 134, in publish
rset=rset, view=view)
File "/var/lib/jenkins/jobs/cubicweb-3.22/workspace/TOXENV/web/.tox/web/local/lib/python2.7/site-packages/cubicweb/cwvreg.py", line 225, in main_template
res = obj.render(**kwargs)
File "/var/lib/jenkins/jobs/cubicweb-3.22/workspace/TOXENV/web/.tox/web/local/lib/python2.7/site-packages/cubicweb/view.py", line 138, in render
view_func(**context)
File "/var/lib/jenkins/jobs/cubicweb-3.22/workspace/TOXENV/web/.tox/web/local/lib/python2.7/site-packages/cubicweb/web/views/basetemplates.py", line 163, in call
view.render(w=w)
File "/var/lib/jenkins/jobs/cubicweb-3.22/workspace/TOXENV/web/.tox/web/local/lib/python2.7/site-packages/cubicweb/view.py", line 138, in render
view_func(**context)
File "unittest_application.py", line 519, in call
raise Exception('whatever')
Exception: whatever
2016-04-12 10:44:29 - (py.warnings) WARNING: /var/lib/jenkins/jobs/cubicweb-3.22/workspace/TOXENV/web/.tox/web/local/lib/python2.7/site-packages/cubicweb/devtools/__init__.py:111: RuntimeWarning: anon174f6b4c339449ad8d7059aecf8777a1 Open session found while turning repository off
%sessionid, RuntimeWarning)

.2016-04-12 10:44:30 - (py.warnings) WARNING: /var/lib/jenkins/jobs/cubicweb-3.22/workspace/TOXENV/web/.tox/web/local/lib/python2.7/site-packages/cubicweb/devtools/__init__.py:111: RuntimeWarning: anon59f7cd9dfb664ccdad0ba04c892b5cf2 Open session found while turning repository off
%sessionid, RuntimeWarning)

....2016-04-12 10:44:35 - (py.warnings) WARNING: /var/lib/jenkins/jobs/cubicweb-3.22/workspace/TOXENV/web/.tox/web/local/lib/python2.7/site-packages/cubicweb/web/formfields.py:1199: Warning: [yams 0.38] no targettype specified and there are several relation definitions for rtype parent: ['Filesystem', 'Directory']. Yet you get the first rdef.
rdef = eschema.rdef(rschema, role)

.......2016-04-12 10:44:41 - (cubicweb.web) WARNING: the view toto could not be found
.................
===================== unittest_breadcrumbs.py ======================
.
======================== unittest_uicfg.py =========================
.........
========================= unittest_http.py =========================
......FF.F.................
======================================================================
FAIL: test_both_ok (unittest_http.HTTPCache)
----------------------------------------------------------------------
Traceback (most recent call last)
File "/var/lib/jenkins/jobs/cubicweb-3.22/workspace/TOXENV/web/.tox/web/local/lib/python2.7/site-packages/logilab/common/testlib.py", line 497, in _proceed
testfunc(*args, **kwargs)
File "/var/lib/jenkins/jobs/cubicweb-3.22/workspace/TOXENV/web/web/test/unittest_http.py", line 222, in test_both_ok
self.assertEqual(req.headers_out.getRawHeaders('etag'), ['babar'])
File "/usr/lib/python2.7/unittest/case.py", line 513, in assertEqual
assertion_func(first, second, msg=msg)
File "/usr/lib/python2.7/unittest/case.py", line 506, in _baseAssertEqual
raise self.failureException(msg)
AssertionError: None != ['babar']

no stdout
no stderr
======================================================================
FAIL: test_etag_match (unittest_http.HTTPCache)
----------------------------------------------------------------------
Traceback (most recent call last)
File "/var/lib/jenkins/jobs/cubicweb-3.22/workspace/TOXENV/web/.tox/web/local/lib/python2.7/site-packages/logilab/common/testlib.py", line 497, in _proceed
testfunc(*args, **kwargs)
File "/var/lib/jenkins/jobs/cubicweb-3.22/workspace/TOXENV/web/web/test/unittest_http.py", line 155, in test_etag_match
self.assertEqual(req.headers_out.getRawHeaders('etag'), ['babar'])
File "/usr/lib/python2.7/unittest/case.py", line 513, in assertEqual
assertion_func(first, second, msg=msg)
File "/usr/lib/python2.7/unittest/case.py", line 506, in _baseAssertEqual
raise self.failureException(msg)
AssertionError: None != ['babar']

no stdout
no stderr
======================================================================
FAIL: test_head_verb (unittest_http.HTTPCache)
----------------------------------------------------------------------
Traceback (most recent call last)
File "/var/lib/jenkins/jobs/cubicweb-3.22/workspace/TOXENV/web/.tox/web/local/lib/python2.7/site-packages/logilab/common/testlib.py", line 497, in _proceed
testfunc(*args, **kwargs)
File "/var/lib/jenkins/jobs/cubicweb-3.22/workspace/TOXENV/web/web/test/unittest_http.py", line 242, in test_head_verb
self.assertEqual(req.headers_out.getRawHeaders('etag'), ['babar'])
File "/usr/lib/python2.7/unittest/case.py", line 513, in assertEqual
assertion_func(first, second, msg=msg)
File "/usr/lib/python2.7/unittest/case.py", line 506, in _baseAssertEqual
raise self.failureException(msg)
AssertionError: None != ['babar']

no stdout
no stderr
==================== unittest_propertysheet.py =====================
.
===================== unittest_viewselector.py =====================
.......................
===================== unittest_formwidgets.py ======================
...
===================== unittest_views_forms.py ======================
...
==================== unittest_idownloadable.py =====================
2016-04-12 10:44:54 - (cubicweb.web) ERROR: IOError()
Traceback (most recent call last):
File "/var/lib/jenkins/jobs/cubicweb-3.22/workspace/TOXENV/web/.tox/web/local/lib/python2.7/site-packages/cubicweb/web/application.py", line 369, in core_handle
result = controller.publish(rset=rset)
File "/var/lib/jenkins/jobs/cubicweb-3.22/workspace/TOXENV/web/.tox/web/local/lib/python2.7/site-packages/cubicweb/web/views/basecontrollers.py", line 134, in publish
rset=rset, view=view)
File "/var/lib/jenkins/jobs/cubicweb-3.22/workspace/TOXENV/web/.tox/web/local/lib/python2.7/site-packages/cubicweb/cwvreg.py", line 225, in main_template
res = obj.render(**kwargs)
File "/var/lib/jenkins/jobs/cubicweb-3.22/workspace/TOXENV/web/.tox/web/local/lib/python2.7/site-packages/cubicweb/view.py", line 138, in render
view_func(**context)
File "/var/lib/jenkins/jobs/cubicweb-3.22/workspace/TOXENV/web/.tox/web/local/lib/python2.7/site-packages/cubicweb/web/views/basetemplates.py", line 120, in call
view.render()
File "/var/lib/jenkins/jobs/cubicweb-3.22/workspace/TOXENV/web/.tox/web/local/lib/python2.7/site-packages/cubicweb/view.py", line 138, in render
view_func(**context)
File "/var/lib/jenkins/jobs/cubicweb-3.22/workspace/TOXENV/web/.tox/web/local/lib/python2.7/site-packages/cubicweb/web/views/idownloadable.py", line 94, in call
self.w(adapter.download_data())
File "unittest_idownloadable.py", line 56, in download_data
raise IOError()
IOError
......
===================== unittest_views_xmlrss.py =====================
.
===================== unittest_urlpublisher.py =====================
.............
=================== unittest_views_navigation.py ===================
...........
=================== unittest_views_editforms.py ====================
..................
====================== unittest_views_csv.py =======================
..
==================== unittest_views_treeview.py ====================
.
======================= unittest_reledit.py ========================
.S.2016-04-12 10:45:13 - (cubicweb.rtags) WARNING: using explict subject type in <property object at 0x7f68aeddcaf8>.tag_object_of() has no effect, use ("*", concerns, Project) instead of (Ticket, concerns, Project)
.
======================================================================
SKIPPED: test_default_forms (unittest_reledit.ClickAndEditFormTC)
Need to check if this test should still run post reledit/doreledit merge
=================== unittest_views_errorform.py ====================
....
==================== unittest_views_pyviews.py =====================
..
====================== unittest_urlrewrite.py ======================
........
=================== unittest_views_baseviews.py ====================
.............
=============== unittest_views_searchrestriction.py ================
........
========================= unittest_form.py =========================
....2016-04-12 10:45:23 - (py.warnings) WARNING: /var/lib/jenkins/jobs/cubicweb-3.22/workspace/TOXENV/web/.tox/web/local/lib/python2.7/site-packages/cubicweb/web/formfields.py:1199: Warning: [yams 0.38] no targettype specified and there are several relation definitions for rtype tags: ['Tag', 'BlogEntry', 'CWUser']. Yet you get the first rdef.
rdef = eschema.rdef(rschema, role)

...........
===================== unittest_magicsearch.py ======================
..................
-> creating tables
-> inserting default user and default groups.
-> storing the schema in the database
-> database for instance data initialized.
Building autopopulate for database tmpdb
*******************************************************************************
Ran 4215 test cases in 241.51s (229.03s CPU), 3 failures, 1 skipped
37 modules OK (1 failed)
failures: /var/lib/jenkins/jobs/cubicweb-3.22/workspace/TOXENV/web/web/test/unittest_http [3/27]
ERROR: InvocationError: '/var/lib/jenkins/jobs/cubicweb-3.22/workspace/TOXENV/web/.tox/web/bin/python -c from logilab.common import pytest; pytest.run() -t /var/lib/jenkins/jobs/cubicweb-3.22/workspace/TOXENV/web/web/test'
___________________________________ summary ____________________________________
ERROR: web: commands failed
Build step 'Execute shell' marked build as failure
Sending e-mails to: dlaxalde@logilab.fr jcr@logilab.fr syt@logilab.fr david@logilab.fr
[PostBuildScript] - Execution post build scripts.
[web] $ /bin/bash -xe /tmp/hudson3116726234816198998.sh
+ /var/lib/jenkins/scripts/notify_forge_apycot.py cwo cubicweb 6706c46e24ae http://jenkins.logilab.fr/job/cubicweb-3.22/TOXENV=web/17/ --status failure
<br/>

log from execution
download