consoleText

download

20 Started by upstream project "cubicweb-3.22" build number 18
originally caused by:
Started by an SCM change
Building in workspace /var/lib/jenkins/jobs/cubicweb-3.22/workspace/TOXENV/web
[web] $ hg showconfig paths.default
[web] $ hg pull
pulling from http://hg.logilab.org/review/cubicweb
searching for changes
adding changesets
adding manifests
adding file changes
added 5 changesets with 9 changes to 7 files (+2 heads)
26 new obsolescence markers
(run 'hg heads .' to see heads, 'hg merge' to merge)
[web] $ hg update --clean --rev e1d96a3b9d03d5f298efe93ae7c6815f05a24e89
4 files updated, 0 files merged, 0 files removed, 0 files unresolved
[web] $ hg --config extensions.purge= clean --all
[web] $ hg log --rev . --template {node}
[web] $ hg log --rev . --template {rev}
[web] $ hg id --branch
[web] $ /bin/bash -xe /tmp/hudson1982345462969437694.sh
+ find . '(' -name 'pgdb*' -o -name 'tmpdb*' ')' -print0
+ xargs -0 rm -rf
[web] $ /bin/bash -xe /tmp/hudson4897740758539223256.sh
+ PATH=/usr/lib/postgresql/9.4/bin:/usr/local/bin:/usr/bin:/bin:/usr/local/games:/usr/games
+ tox --recreate
GLOB sdist-make: /var/lib/jenkins/jobs/cubicweb-3.22/workspace/TOXENV/web/setup.py
web create: /var/lib/jenkins/jobs/cubicweb-3.22/workspace/TOXENV/web/.tox/web
web installdeps: -r/var/lib/jenkins/jobs/cubicweb-3.22/workspace/TOXENV/web/web/test/requirements.txt
web inst: /var/lib/jenkins/jobs/cubicweb-3.22/workspace/TOXENV/web/.tox/dist/cubicweb-3.22.2.zip
web installed: You are using pip version 7.1.2, however version 8.1.1 is available.,You should consider upgrading via the 'pip install --upgrade pip' command.,beautifulsoup4==4.3.2,boto==2.34.0,bzr-etckeeper==0.0.0,cffi==0.8.6,characteristic==0.1.0,chardet==2.3.0,Cheetah==2.4.4,cloud-init==0.7.6,colorama==0.3.2,configobj==5.0.6,coverage==3.7.1,croniter==0.3.4,cryptography==0.6.1,cubicweb==3.22.2,cubicweb-blog==1.12.0,cubicweb-file==1.18.0,cubicweb-tag==1.8.3,cwclientlib==0.4.1,Cython==0.21.1,decorator==3.4.0,docutils==0.12,ecdsa==0.11,euca2ools==3.1.0,GDAL==1.10.1,hg-evolve==5.2.1,html2text==2016.4.2,html5lib==0.999,isodate==0.5.0,Jinja2==2.7.3,joblib==0.8.3,jsonpatch==1.3,jsonpointer==1.0,logilab-common==1.2.0,logilab-constraint==0.6.0,logilab-database==1.15.0,logilab-mtconverter==0.9.0,lxml==3.4.0,M2Crypto==0.21.1,Mako==1.0.0,Markdown==2.5.1,MarkupSafe==0.23,matplotlib==1.4.2,mccabe==0.2.1,mercurial==3.7.3,mock==1.0.1,msgpack-python==0.4.2,nose==1.3.4,numexpr==2.4,numpy==1.8.2,oauth==1.0.1,openpyxl==1.7.0,pandas==0.14.1,paramiko==1.15.1,passlib==1.6.5,pep8==1.5.7,Pillow==2.6.1,pluggy==0.3.1,ply==3.4,prettytable==0.7.2,psycopg2==2.5.4,py==1.4.31,pyasn1==0.1.7,pyasn1-modules==0.0.5,pycparser==2.10,pycrypto==2.6.1,pyflakes==0.8.1,Pygments==2.0.1,pyinotify==0.9.4,pyOpenSSL==0.14,pyparsing==2.0.3,pyserial==2.6,pysqlite==2.6.3,python-apt==0.9.3.12,python-augeas==0.4.1,python-dateutil==2.2,python-jenkins==0.2.1,python-ldap==2.4.10,python-yapps==2.1.1,python3-ldap==0.9.4.2,pytz==2012rc0,PyYAML==3.11,pyzmq==14.4.0,rdflib==4.1.2,requestbuilder==0.2.3,requests==2.4.3,roman==2.0.0,rql==0.34.0,rubber==1.1,salt==2015.5.3,scikit-learn==0.14.1,scipy==0.14.0,service-identity==1.0.0,Shapely==1.4.3,simplejson==3.6.5,SimpleTAL==4.1,six==1.8.0,SPARQLWrapper==1.6.0,statsmodels==0.4.2,tables==3.1.1,tox==2.3.1,Twisted==15.5.0,urllib3==1.9.1,virtualenv==13.1.2,waitress==0.9.0,WebOb==1.6.0,WebTest==2.0.21,wheel==0.24.0,xlrd==0.9.2,xlwt==0.7.5,yams==0.42.0,Yapps==2.2.0,Yapps2==2.2.0,zope.interface==4.1.3
web runtests: PYTHONHASHSEED='2394663039'
web runtests: commands[0] | /var/lib/jenkins/jobs/cubicweb-3.22/workspace/TOXENV/web/.tox/web/bin/python -c from logilab.common import pytest; pytest.run() -t /var/lib/jenkins/jobs/cubicweb-3.22/workspace/TOXENV/web/web/test
=================== unittest_views_errorform.py ====================
2016-04-22 16:25:18 - (cubicweb.appobject) WARNING: can't find any workflow for CWUser
2016-04-22 16:25:35 - (cubicweb.web) WARNING: [3.17] massmailing extracted to cube massmailing that was not found. try installing it.
2016-04-22 16:25:35 - (cubicweb.web) WARNING: [3.17] igeocoding extracted to cube geocoding that was not found. try installing it.
2016-04-22 16:25:35 - (cubicweb.web) WARNING: [3.17] embedding extracted to cube embed that was not found. try installing it.
2016-04-22 16:25:35 - (cubicweb.web) WARNING: [3.17] isioc extracted to cube sioc that was not found. try installing it.
....
====================== unittest_webconfig.py =======================
...
=================== unittest_views_baseviews.py ====================
.............
===================== unittest_magicsearch.py ======================
..................
=============== unittest_views_searchrestriction.py ================
........
===================== unittest_http_headers.py =====================
.
======================== unittest_uicfg.py =========================
.........
===================== unittest_views_xmlrss.py =====================
.
======================= unittest_request.py ========================
....
====================== unittest_urlrewrite.py ======================
........
======================= unittest_reledit.py ========================
.S.2016-04-22 16:25:51 - (cubicweb.rtags) WARNING: using explict subject type in <property object at 0x7fb1f803cb50>.tag_object_of() has no effect, use ("*", concerns, Project) instead of (Ticket, concerns, Project)
.
======================================================================
SKIPPED: test_default_forms (unittest_reledit.ClickAndEditFormTC)
Need to check if this test should still run post reledit/doreledit merge
======================== unittest_facet.py =========================
....................
===================== unittest_views_forms.py ======================
...
====================== unittest_views_csv.py =======================
..
===================== unittest_formwidgets.py ======================
...
==================== unittest_idownloadable.py =====================
2016-04-22 16:25:55 - (cubicweb.web) ERROR: IOError()
Traceback (most recent call last):
File "/var/lib/jenkins/jobs/cubicweb-3.22/workspace/TOXENV/web/.tox/web/local/lib/python2.7/site-packages/cubicweb/web/application.py", line 369, in core_handle
result = controller.publish(rset=rset)
File "/var/lib/jenkins/jobs/cubicweb-3.22/workspace/TOXENV/web/.tox/web/local/lib/python2.7/site-packages/cubicweb/web/views/basecontrollers.py", line 134, in publish
rset=rset, view=view)
File "/var/lib/jenkins/jobs/cubicweb-3.22/workspace/TOXENV/web/.tox/web/local/lib/python2.7/site-packages/cubicweb/cwvreg.py", line 225, in main_template
res = obj.render(**kwargs)
File "/var/lib/jenkins/jobs/cubicweb-3.22/workspace/TOXENV/web/.tox/web/local/lib/python2.7/site-packages/cubicweb/view.py", line 138, in render
view_func(**context)
File "/var/lib/jenkins/jobs/cubicweb-3.22/workspace/TOXENV/web/.tox/web/local/lib/python2.7/site-packages/cubicweb/web/views/basetemplates.py", line 120, in call
view.render()
File "/var/lib/jenkins/jobs/cubicweb-3.22/workspace/TOXENV/web/.tox/web/local/lib/python2.7/site-packages/cubicweb/view.py", line 138, in render
view_func(**context)
File "/var/lib/jenkins/jobs/cubicweb-3.22/workspace/TOXENV/web/.tox/web/local/lib/python2.7/site-packages/cubicweb/web/views/idownloadable.py", line 94, in call
self.w(adapter.download_data())
File "unittest_idownloadable.py", line 56, in download_data
raise IOError()
IOError
......
========================= unittest_http.py =========================
......FF.F.................
======================================================================
FAIL: test_both_ok (unittest_http.HTTPCache)
----------------------------------------------------------------------
Traceback (most recent call last)
File "/var/lib/jenkins/jobs/cubicweb-3.22/workspace/TOXENV/web/.tox/web/local/lib/python2.7/site-packages/logilab/common/testlib.py", line 497, in _proceed
testfunc(*args, **kwargs)
File "/var/lib/jenkins/jobs/cubicweb-3.22/workspace/TOXENV/web/web/test/unittest_http.py", line 222, in test_both_ok
self.assertEqual(req.headers_out.getRawHeaders('etag'), ['babar'])
File "/usr/lib/python2.7/unittest/case.py", line 513, in assertEqual
assertion_func(first, second, msg=msg)
File "/usr/lib/python2.7/unittest/case.py", line 506, in _baseAssertEqual
raise self.failureException(msg)
AssertionError: None != ['babar']

no stdout
no stderr
======================================================================
FAIL: test_etag_match (unittest_http.HTTPCache)
----------------------------------------------------------------------
Traceback (most recent call last)
File "/var/lib/jenkins/jobs/cubicweb-3.22/workspace/TOXENV/web/.tox/web/local/lib/python2.7/site-packages/logilab/common/testlib.py", line 497, in _proceed
testfunc(*args, **kwargs)
File "/var/lib/jenkins/jobs/cubicweb-3.22/workspace/TOXENV/web/web/test/unittest_http.py", line 155, in test_etag_match
self.assertEqual(req.headers_out.getRawHeaders('etag'), ['babar'])
File "/usr/lib/python2.7/unittest/case.py", line 513, in assertEqual
assertion_func(first, second, msg=msg)
File "/usr/lib/python2.7/unittest/case.py", line 506, in _baseAssertEqual
raise self.failureException(msg)
AssertionError: None != ['babar']

no stdout
no stderr
======================================================================
FAIL: test_head_verb (unittest_http.HTTPCache)
----------------------------------------------------------------------
Traceback (most recent call last)
File "/var/lib/jenkins/jobs/cubicweb-3.22/workspace/TOXENV/web/.tox/web/local/lib/python2.7/site-packages/logilab/common/testlib.py", line 497, in _proceed
testfunc(*args, **kwargs)
File "/var/lib/jenkins/jobs/cubicweb-3.22/workspace/TOXENV/web/web/test/unittest_http.py", line 242, in test_head_verb
self.assertEqual(req.headers_out.getRawHeaders('etag'), ['babar'])
File "/usr/lib/python2.7/unittest/case.py", line 513, in assertEqual
assertion_func(first, second, msg=msg)
File "/usr/lib/python2.7/unittest/case.py", line 506, in _baseAssertEqual
raise self.failureException(msg)
AssertionError: None != ['babar']

no stdout
no stderr
========================= unittest_web.py ==========================
..2016-04-22 16:26:03 - (py.warnings) WARNING: /var/lib/jenkins/jobs/cubicweb-3.22/workspace/TOXENV/web/.tox/web/local/lib/python2.7/site-packages/cubicweb/devtools/__init__.py:111: RuntimeWarning: anonfdcb677cb19f414f838de5c4d2e3b805 Open session found while turning repository off
%sessionid, RuntimeWarning)

.2016-04-22 16:26:05 - (py.warnings) WARNING: /var/lib/jenkins/jobs/cubicweb-3.22/workspace/TOXENV/web/.tox/web/local/lib/python2.7/site-packages/cubicweb/devtools/__init__.py:111: RuntimeWarning: anon59261a1f215f4bf39fc271e60e7b0450 Open session found while turning repository off
%sessionid, RuntimeWarning)

.2016-04-22 16:26:08 - (py.warnings) WARNING: /var/lib/jenkins/jobs/cubicweb-3.22/workspace/TOXENV/web/.tox/web/local/lib/python2.7/site-packages/cubicweb/devtools/__init__.py:111: RuntimeWarning: anon35666616a0c04cd3b0ef1b726c40679a Open session found while turning repository off
%sessionid, RuntimeWarning)

2016-04-22 16:26:08 - (py.warnings) WARNING: /var/lib/jenkins/jobs/cubicweb-3.22/workspace/TOXENV/web/.tox/web/local/lib/python2.7/site-packages/cubicweb/devtools/__init__.py:111: RuntimeWarning: anon14ef4382ccd04ee3b713b9b1ac3d1bce Open session found while turning repository off
%sessionid, RuntimeWarning)

.2016-04-22 16:26:12 - (py.warnings) WARNING: /var/lib/jenkins/jobs/cubicweb-3.22/workspace/TOXENV/web/.tox/web/local/lib/python2.7/site-packages/cubicweb/devtools/__init__.py:111: RuntimeWarning: adminbe3230b61919438593137e0496a51ff8 Open session found while turning repository off
%sessionid, RuntimeWarning)

2016-04-22 16:26:12 - (py.warnings) WARNING: /var/lib/jenkins/jobs/cubicweb-3.22/workspace/TOXENV/web/.tox/web/local/lib/python2.7/site-packages/cubicweb/devtools/__init__.py:111: RuntimeWarning: anon520ca5be3b1741e2887d0cb0e8d3fb4c Open session found while turning repository off
%sessionid, RuntimeWarning)

.2016-04-22 16:26:14 - (py.warnings) WARNING: /var/lib/jenkins/jobs/cubicweb-3.22/workspace/TOXENV/web/.tox/web/local/lib/python2.7/site-packages/cubicweb/devtools/__init__.py:111: RuntimeWarning: anonf0c1877e23894754aef54a9363f31799 Open session found while turning repository off
%sessionid, RuntimeWarning)

.2016-04-22 16:26:16 - (py.warnings) WARNING: /var/lib/jenkins/jobs/cubicweb-3.22/workspace/TOXENV/web/.tox/web/local/lib/python2.7/site-packages/cubicweb/devtools/__init__.py:111: RuntimeWarning: anon29b1269a40144914919a84d6fc682680 Open session found while turning repository off
%sessionid, RuntimeWarning)

.2016-04-22 16:26:19 - (py.warnings) WARNING: /var/lib/jenkins/jobs/cubicweb-3.22/workspace/TOXENV/web/.tox/web/local/lib/python2.7/site-packages/cubicweb/devtools/__init__.py:111: RuntimeWarning: anon723d722ede7f4866bf2b984de35f9a2b Open session found while turning repository off
%sessionid, RuntimeWarning)

.
==================== unittest_views_pyviews.py =====================
..
================= unittest_views_apacherewrite.py ==================
.
=================== unittest_views_editforms.py ====================
..................
=================== unittest_views_navigation.py ===================
...........
=============== unittest_views_staticcontrollers.py ================
.2016-04-22 16:26:27 - (cubicweb.web) ERROR: concatenated data url error: u'dummy.js' file does not exist
.2016-04-22 16:26:27 - (cubicweb.web) ERROR: concatenated data url error: u'dummy.js' file does not exist
....
===================== unittest_application.py ======================
2016-04-22 16:26:30 - (cubicweb.web) ERROR: Exception('whatever',)
Traceback (most recent call last):
File "/var/lib/jenkins/jobs/cubicweb-3.22/workspace/TOXENV/web/.tox/web/local/lib/python2.7/site-packages/cubicweb/web/application.py", line 369, in core_handle
result = controller.publish(rset=rset)
File "/var/lib/jenkins/jobs/cubicweb-3.22/workspace/TOXENV/web/.tox/web/local/lib/python2.7/site-packages/cubicweb/web/views/basecontrollers.py", line 134, in publish
rset=rset, view=view)
File "/var/lib/jenkins/jobs/cubicweb-3.22/workspace/TOXENV/web/.tox/web/local/lib/python2.7/site-packages/cubicweb/cwvreg.py", line 225, in main_template
res = obj.render(**kwargs)
File "/var/lib/jenkins/jobs/cubicweb-3.22/workspace/TOXENV/web/.tox/web/local/lib/python2.7/site-packages/cubicweb/view.py", line 138, in render
view_func(**context)
File "/var/lib/jenkins/jobs/cubicweb-3.22/workspace/TOXENV/web/.tox/web/local/lib/python2.7/site-packages/cubicweb/web/views/basetemplates.py", line 163, in call
view.render(w=w)
File "/var/lib/jenkins/jobs/cubicweb-3.22/workspace/TOXENV/web/.tox/web/local/lib/python2.7/site-packages/cubicweb/view.py", line 138, in render
view_func(**context)
File "unittest_application.py", line 519, in call
raise Exception('whatever')
Exception: whatever
2016-04-22 16:26:30 - (py.warnings) WARNING: /var/lib/jenkins/jobs/cubicweb-3.22/workspace/TOXENV/web/.tox/web/local/lib/python2.7/site-packages/cubicweb/devtools/__init__.py:111: RuntimeWarning: anon1537ff0e7c844cbc89ff59d68d75b21a Open session found while turning repository off
%sessionid, RuntimeWarning)

.2016-04-22 16:26:31 - (py.warnings) WARNING: /var/lib/jenkins/jobs/cubicweb-3.22/workspace/TOXENV/web/.tox/web/local/lib/python2.7/site-packages/cubicweb/devtools/__init__.py:111: RuntimeWarning: anon593a5dc059bf43b7833e3489eed6419a Open session found while turning repository off
%sessionid, RuntimeWarning)

....2016-04-22 16:26:37 - (py.warnings) WARNING: /var/lib/jenkins/jobs/cubicweb-3.22/workspace/TOXENV/web/.tox/web/local/lib/python2.7/site-packages/cubicweb/web/formfields.py:1199: Warning: [yams 0.38] no targettype specified and there are several relation definitions for rtype parent: ['Directory', 'Filesystem']. Yet you get the first rdef.
rdef = eschema.rdef(rschema, role)

.......2016-04-22 16:26:44 - (cubicweb.web) WARNING: the view toto could not be found
.................
==================== unittest_propertysheet.py =====================
.
========================== test_views.py ===========================
2016-04-22 16:26:47 - (py.warnings) WARNING: /var/lib/jenkins/jobs/cubicweb-3.22/workspace/TOXENV/web/.tox/web/local/lib/python2.7/site-packages/cubicweb/devtools/__init__.py:111: RuntimeWarning: admine54e625d1a154518a0448d1cd9351632 Open session found while turning repository off
%sessionid, RuntimeWarning)

........................................................................................................................................................................................................................................................2016-04-22 16:26:50 - (py.warnings) WARNING: /var/lib/jenkins/jobs/cubicweb-3.22/workspace/TOXENV/web/.tox/web/local/lib/python2.7/site-packages/cubicweb/web/formfields.py:1199: Warning: [yams 0.38] no targettype specified and there are several relation definitions for rtype allowed_transition: ['BaseTransition', 'Transition', 'WorkflowTransition']. Yet you get the first rdef.
rdef = eschema.rdef(rschema, role)

.....................................................................................................................................................................................................................................................................................................................................................................................................................................................................................................................................................................................................................................................................................................................2016-04-22 16:27:00 - (py.warnings) WARNING: /var/lib/jenkins/jobs/cubicweb-3.22/workspace/TOXENV/web/.tox/web/local/lib/python2.7/site-packages/cubicweb/web/formfields.py:1199: Warning: [yams 0.38] no targettype specified and there are several relation definitions for rtype constrained_by: ['CWAttribute', 'CWRelation']. Yet you get the first rdef.
rdef = eschema.rdef(rschema, role)

........................................................................................................................................................................................................................................................................................................................................................................................................................................................................................................................................................................................................................................................................................................................................................................................................................................................................................................................................................................................................................................................................................................................................................................................................................................................................................................................................................................................................................................................................................................................................................................................................................................................................................................................................................................................................................................................................................................................................................................................................................................................................................................................................................................................................................................................................................................................................................................................................................................................................................................2016-04-22 16:27:58 - (cubicweb.appobject) ERROR: cycle in breadcrumbs for entity <Entity TreeNode 1378 ['name', 'cwuri', 'modification_date', 'creation_date'] at 140402135413008>
..2016-04-22 16:27:58 - (cubicweb.appobject) ERROR: cycle in breadcrumbs for entity <Entity TreeNode 1378 ['name', 'cwuri', 'modification_date', 'creation_date'] at 140402135413008>
.2016-04-22 16:27:58 - (cubicweb.appobject) ERROR: cycle in breadcrumbs for entity <Entity TreeNode 1378 ['name', 'cwuri', 'modification_date', 'creation_date'] at 140402135413008>
.2016-04-22 16:27:58 - (cubicweb.appobject) ERROR: cycle in breadcrumbs for entity <Entity TreeNode 1378 ['name', 'cwuri', 'modification_date', 'creation_date'] at 140402135413008>
..2016-04-22 16:27:58 - (cubicweb.appobject) ERROR: cycle in breadcrumbs for entity <Entity TreeNode 1378 ['name', 'cwuri', 'modification_date', 'creation_date'] at 140402135413008>
..2016-04-22 16:27:58 - (cubicweb.appobject) ERROR: cycle in breadcrumbs for entity <Entity TreeNode 1378 ['name', 'cwuri', 'modification_date', 'creation_date'] at 140402135413008>
.2016-04-22 16:27:58 - (cubicweb.appobject) ERROR: cycle in breadcrumbs for entity <Entity TreeNode 1378 ['name', 'cwuri', 'modification_date', 'creation_date'] at 140402135413008>
.......2016-04-22 16:27:58 - (cubicweb.appobject) ERROR: cycle in breadcrumbs for entity <Entity TreeNode 1378 ['name', 'cwuri', 'modification_date', 'creation_date'] at 140402135413008>
...................2016-04-22 16:27:58 - (cubicweb.appobject) ERROR: cycle in breadcrumbs for entity <Entity TreeNode 1378 ['name', 'cwuri', 'modification_date', 'creation_date'] at 140402135413008>
............................................................................................................................................................................................................................................................................................................................................................................................................................................................................
===================== unittest_breadcrumbs.py ======================
.
========================= test_jscript.py ==========================
......................2016-04-22 16:28:17 - (py.warnings) WARNING: /var/lib/jenkins/jobs/cubicweb-3.22/workspace/TOXENV/web/.tox/web/local/lib/python2.7/site-packages/cubicweb/devtools/__init__.py:111: RuntimeWarning: anon7b0028b0ccf648b8a08be365f08af475 Open session found while turning repository off
%sessionid, RuntimeWarning)

2016-04-22 16:28:17 - (py.warnings) WARNING: /var/lib/jenkins/jobs/cubicweb-3.22/workspace/TOXENV/web/.tox/web/local/lib/python2.7/site-packages/cubicweb/devtools/__init__.py:111: RuntimeWarning: anonbf5ac66637914eb9bcffe193493420f3 Open session found while turning repository off
%sessionid, RuntimeWarning)

2016-04-22 16:28:17 - (py.warnings) WARNING: /var/lib/jenkins/jobs/cubicweb-3.22/workspace/TOXENV/web/.tox/web/local/lib/python2.7/site-packages/cubicweb/devtools/__init__.py:111: RuntimeWarning: anond1a5687a2c874db9aef5c27dde69497a Open session found while turning repository off
%sessionid, RuntimeWarning)

===================== unittest_urlpublisher.py =====================
.............
==================== unittest_views_treeview.py ====================
.
====================== unittest_views_json.py ======================
...2016-04-22 16:28:35 - (py.warnings) WARNING: /var/lib/jenkins/jobs/cubicweb-3.22/workspace/TOXENV/web/.tox/web/local/lib/python2.7/site-packages/cubicweb/devtools/__init__.py:111: RuntimeWarning: anone5bd85e779f449a381d8d1e8453d12e2 Open session found while turning repository off
%sessionid, RuntimeWarning)

.2016-04-22 16:28:35 - (cubicweb.web) WARNING: vid table can't be used with jsonp controller, falling back to jsonexport
2016-04-22 16:28:37 - (py.warnings) WARNING: /var/lib/jenkins/jobs/cubicweb-3.22/workspace/TOXENV/web/.tox/web/local/lib/python2.7/site-packages/cubicweb/devtools/__init__.py:111: RuntimeWarning: anon70c82c93cda04efeb5be514eef5ac1b4 Open session found while turning repository off
%sessionid, RuntimeWarning)

.....2016-04-22 16:28:38 - (cubicweb.web) WARNING: vid table can't be used with jsonp controller, falling back to jsonexport
.
===================== unittest_viewselector.py =====================
.......................
================ unittest_views_basecontrollers.py =================
.................2016-04-22 16:28:57 - (py.warnings) WARNING: /var/lib/jenkins/jobs/cubicweb-3.22/workspace/TOXENV/web/.tox/web/local/lib/python2.7/site-packages/cubicweb/web/formfields.py:1199: Warning: [yams 0.38] no targettype specified and there are several relation definitions for rtype to_entity: ['CWAttribute', 'CWRelation']. Yet you get the first rdef.
rdef = eschema.rdef(rschema, role)

.....2016-04-22 16:29:02 - (py.warnings) WARNING: /var/lib/jenkins/jobs/cubicweb-3.22/workspace/TOXENV/web/.tox/web/local/lib/python2.7/site-packages/cubicweb/web/formfields.py:1199: Warning: [yams 0.38] no targettype specified and there are several relation definitions for rtype read_permission: ['RQLExpression', 'CWGroup']. Yet you get the first rdef.
rdef = eschema.rdef(rschema, role)

2016-04-22 16:29:02 - (cubicweb.session) WARNING: no schema for 7
2016-04-22 16:29:02 - (cubicweb.session) WARNING: no schema for 7
..2016-04-22 16:29:03 - (cubicweb.web) WARNING: param login-subject mis-formatted
.........................................2016-04-22 16:29:27 - (py.warnings) WARNING: /var/lib/jenkins/jobs/cubicweb-3.22/workspace/TOXENV/web/.tox/web/local/lib/python2.7/site-packages/cubicweb/devtools/__init__.py:111: RuntimeWarning: anon56d62b81bed745ecaacbba63f34fbbc6 Open session found while turning repository off
%sessionid, RuntimeWarning)

.
==================== unittest_views_actions.py =====================
..
====================== unittest_controller.py ======================
..
====================== unittest_formfields.py ======================
....2016-04-22 16:29:30 - (py.warnings) WARNING: /var/lib/jenkins/jobs/cubicweb-3.22/workspace/TOXENV/web/.tox/web/local/lib/python2.7/site-packages/cubicweb/web/formfields.py:1199: Warning: [yams 0.38] no targettype specified and there are several relation definitions for rtype owned_by: ['CWGroup', 'Salesterm', 'MicroBlog', 'Project', 'BlogEntry', 'State', 'RQLExpression', 'EmailAddress', 'Directory', 'CWConstraintType', 'Version', 'MicroBlogEntry', 'CWProperty', 'Societe', 'TrInfo', 'CWUniqueTogetherConstraint', 'DirectoryPermission', 'Filesystem', 'ExternalUri', 'Bookmark', 'CWSource', 'CWConstraint', 'UserAccount', 'CWSourceSchemaConfig', 'Blog', 'BaseTransition', 'Folder', 'TreeNode', 'SubWorkflowExitPoint', 'Personne', 'CWEType', 'CWSourceHostConfig', 'CWComputedRType', 'CWUser', 'CWCache', 'Ticket', 'CWDataImport', 'File', 'WorkflowTransition', 'Workflow', 'CWRType', 'CWRelation', 'Tag', 'CWAttribute', 'Transition']. Yet you get the first rdef.
rdef = eschema.rdef(rschema, role)

......
========================= unittest_form.py =========================
....2016-04-22 16:29:31 - (py.warnings) WARNING: /var/lib/jenkins/jobs/cubicweb-3.22/workspace/TOXENV/web/.tox/web/local/lib/python2.7/site-packages/cubicweb/web/formfields.py:1199: Warning: [yams 0.38] no targettype specified and there are several relation definitions for rtype tags: ['BlogEntry', 'CWUser', 'Tag']. Yet you get the first rdef.
rdef = eschema.rdef(rschema, role)

...........
================= unittest_views_basetemplates.py ==================
..
-> creating tables
-> inserting default user and default groups.
-> storing the schema in the database
-> database for instance data initialized.
Building autopopulate for database tmpdb
*******************************************************************************
Ran 4221 test cases in 258.69s (243.52s CPU), 3 failures, 1 skipped
37 modules OK (1 failed)
failures: /var/lib/jenkins/jobs/cubicweb-3.22/workspace/TOXENV/web/web/test/unittest_http [3/27]
ERROR: InvocationError: '/var/lib/jenkins/jobs/cubicweb-3.22/workspace/TOXENV/web/.tox/web/bin/python -c from logilab.common import pytest; pytest.run() -t /var/lib/jenkins/jobs/cubicweb-3.22/workspace/TOXENV/web/web/test'
___________________________________ summary ____________________________________
ERROR: web: commands failed
Build step 'Execute shell' marked build as failure
Sending e-mails to: dlaxalde@logilab.fr jcr@logilab.fr syt@logilab.fr david@logilab.fr
[PostBuildScript] - Execution post build scripts.
[web] $ /bin/bash -xe /tmp/hudson1280502445827046459.sh
+ /var/lib/jenkins/scripts/notify_forge_apycot.py cwo cubicweb e1d96a3b9d03 http://jenkins.logilab.fr/job/cubicweb-3.22/TOXENV=web/18/ --status failure
<br/>

log from execution
download