consoleText

download

20 Started by upstream project "cubes-skos" build number 108
originally caused by:
Started by an SCM change
Building on master in workspace /var/lib/jenkins/jobs/cubes-skos/workspace/TOXENV/py27-default
[py27-default] $ hg showconfig paths.default
[py27-default] $ hg pull --rev cce1b7cd31315e472be5f719a267e72d0c3f33c0
pulling from http://hg.logilab.org/review/cubes/skos
searching for changes
adding changesets
adding manifests
adding file changes
added 1 changesets with 1 changes to 1 files (+1 heads)
(run 'hg heads .' to see heads, 'hg merge' to merge)
[py27-default] $ hg update --clean --rev cce1b7cd31315e472be5f719a267e72d0c3f33c0
2 files updated, 0 files merged, 0 files removed, 0 files unresolved
[py27-default] $ hg --config extensions.purge= clean --all
[py27-default] $ hg log --rev . --template {node}
[py27-default] $ hg log --rev . --template {rev}
[py27-default] $ hg log --rev 0a303952c0636f337fb224a436c7848d8236adf1
changeset: 334:0a303952c063
parent: 332:24472d150b3d
user: Sylvain Thénault <sylvain.thenault@logilab.fr>
date: Mon May 16 21:47:42 2016 +0200
summary: Support for specifying label's kind on *.add_concept methods

[py27-default] $ hg log --template "<changeset node='{node}' author='{author|xmlescape}' rev='{rev}' date='{date}'><msg>{desc|xmlescape}</msg><added>{file_adds|stringify|xmlescape}</added><deleted>{file_dels|stringify|xmlescape}</deleted><files>{files|stringify|xmlescape}</files><parents>{parents}</parents></changeset>\n" --rev cce1b7cd31315e472be5f719a267e72d0c3f33c0:0 --follow --prune 0a303952c0636f337fb224a436c7848d8236adf1 --encoding UTF-8 --encodingmode replace
[py27-default] $ /bin/bash -xe /tmp/hudson4953622349689719102.sh
+ find . '(' -name 'pgdb*' -o -name 'tmpdb*' ')' -print0
+ xargs -0 rm -rf
[py27-default] $ /bin/bash -xe /tmp/hudson4402514194470987181.sh
+ PATH=/usr/lib/postgresql/9.4/bin:/usr/local/bin:/usr/bin:/bin:/usr/local/games:/usr/games
+ tox --recreate
GLOB sdist-make: /var/lib/jenkins/jobs/cubes-skos/workspace/TOXENV/py27-default/setup.py
py27-default create: /var/lib/jenkins/jobs/cubes-skos/workspace/TOXENV/py27-default/.tox/py27-default
py27-default installdeps: cubicweb, -rtest-requirements.txt, pytest
py27-default inst: /var/lib/jenkins/jobs/cubes-skos/workspace/TOXENV/py27-default/.tox/dist/cubicweb-skos-0.10.0.zip
py27-default installed: You are using pip version 7.1.2, however version 8.1.2 is available.,You should consider upgrading via the 'pip install --upgrade pip' command.,beautifulsoup4==4.3.2,boto==2.34.0,bzr-etckeeper==0.0.0,cffi==0.8.6,characteristic==0.1.0,chardet==2.3.0,Cheetah==2.4.4,cloud-init==0.7.6,colorama==0.3.2,configobj==5.0.6,coverage==3.7.1,croniter==0.3.4,cryptography==0.6.1,cubicweb==3.22.2,cubicweb-skos==0.10.0,cwclientlib==0.4.1,Cython==0.21.1,decorator==3.4.0,docutils==0.12,ecdsa==0.11,euca2ools==3.1.0,GDAL==1.10.1,hg-evolve==5.2.1,html2text==2016.4.2,html5lib==0.999,isodate==0.5.0,Jinja2==2.7.3,joblib==0.8.3,jsonpatch==1.3,jsonpointer==1.0,logilab-common==1.2.0,logilab-constraint==0.6.0,logilab-database==1.15.0,logilab-mtconverter==0.9.0,lxml==3.4.0,M2Crypto==0.21.1,Mako==1.0.0,Markdown==2.5.1,MarkupSafe==0.23,matplotlib==1.4.2,mccabe==0.2.1,mercurial==3.7.3,mock==1.0.1,msgpack-python==0.4.2,nose==1.3.4,numexpr==2.4,numpy==1.8.2,oauth==1.0.1,openpyxl==1.7.0,pandas==0.14.1,paramiko==1.15.1,passlib==1.6.5,pep8==1.5.7,Pillow==2.6.1,pluggy==0.3.1,ply==3.4,prettytable==0.7.2,psycopg2==2.5.4,py==1.4.31,pyasn1==0.1.7,pyasn1-modules==0.0.5,pycparser==2.10,pycrypto==2.6.1,pyflakes==0.8.1,Pygments==2.0.1,pyinotify==0.9.4,pyOpenSSL==0.14,pyparsing==2.0.3,pyserial==2.6,pysqlite==2.6.3,pytest==2.9.1,python-apt==0.9.3.12,python-augeas==0.4.1,python-dateutil==2.2,python-jenkins==0.2.1,python-ldap==2.4.10,python-yapps==2.1.1,python3-ldap==0.9.4.2,pytz==2012rc0,PyYAML==3.11,pyzmq==14.4.0,rdflib==4.1.2,requestbuilder==0.2.3,requests==2.4.3,roman==2.0.0,rql==0.34.0,rubber==1.1,salt==2015.5.3,scikit-learn==0.14.1,scipy==0.14.0,service-identity==1.0.0,Shapely==1.4.3,simplejson==3.6.5,SimpleTAL==4.1,six==1.8.0,SPARQLWrapper==1.6.0,statsmodels==0.4.2,tables==3.1.1,tox==2.3.1,urllib3==1.9.1,virtualenv==13.1.2,wheel==0.24.0,xlrd==0.9.2,xlwt==0.7.5,yams==0.42.0,Yapps==2.2.0,Yapps2==2.2.0
py27-default runtests: PYTHONHASHSEED='562249216'
py27-default runtests: commands[0] | /var/lib/jenkins/jobs/cubes-skos/workspace/TOXENV/py27-default/.tox/py27-default/bin/python -m pytest /var/lib/jenkins/jobs/cubes-skos/workspace/TOXENV/py27-default/test --junit-xml=test-results.xml
============================= test session starts ==============================
platform linux2 -- Python 2.7.9, pytest-2.9.1, py-1.4.31, pluggy-0.3.1
rootdir: /var/lib/jenkins/jobs/cubes-skos/workspace/TOXENV/py27-default, inifile: tox.ini
collected 70 items

test/test_ccplugin.py FFF
test/unittest_entities.py .......................
test/unittest_hooks.py ....
test/unittest_lcsv.py ...
test/unittest_rdfio.py .....................
test/unittest_schema.py ......
test/unittest_sobjects.py ......
test/unittest_views.py ....

generated xml file: /var/lib/jenkins/jobs/cubes-skos/workspace/TOXENV/py27-default/test-results.xml
=================================== FAILURES ===================================
_____________________ ImportSkosDataCommandTC.test_massive _____________________

self = <test_ccplugin.ImportSkosDataCommandTC testMethod=test_massive>

def test_massive(self):
self.run_import_skos('-s', 'massive')
> self._test_base()

test/test_ccplugin.py:78:
_ _ _ _ _ _ _ _ _ _ _ _ _ _ _ _ _ _ _ _ _ _ _ _ _ _ _ _ _ _ _ _ _ _ _ _ _ _ _ _
test/test_ccplugin.py:66: in _test_base
self.assertEqual(concept.labels, {u'fr': u'économie'})
E AssertionError: {u'fr-fr': u'\xe9conomie', u'fr': u'\xe9conomie'} != {u'fr': u'\xe9conomie'}
E - {u'fr': u'\xe9conomie', u'fr-fr': u'\xe9conomie'}
E + {u'fr': u'\xe9conomie'}
---------------------------- Captured stdout setup -----------------------------
The files belonging to this database system will be owned by user "jenkins".
This user must also own the server process.

The database cluster will be initialized with locale "C".
The default text search configuration will be set to "english".

Data page checksums are disabled.

creating directory /var/lib/jenkins/jobs/cubes-skos/workspace/TOXENV/py27-default/test/data/database/pgdb-test_ccplugin ... ok
creating subdirectories ... ok
selecting default max_connections ... 100
selecting default shared_buffers ... 128MB
selecting dynamic shared memory implementation ... posix
creating configuration files ... ok
creating template1 database in /var/lib/jenkins/jobs/cubes-skos/workspace/TOXENV/py27-default/test/data/database/pgdb-test_ccplugin/base/1 ... ok
initializing pg_authid ... ok
initializing dependencies ... ok
creating system views ... ok
loading system objects' descriptions ... ok
creating collations ... ok
creating conversions ... ok
creating dictionaries ... ok
setting privileges on built-in objects ... ok
creating information schema ... ok
loading PL/pgSQL server-side language ... ok
vacuuming database template1 ... ok
copying template1 to template0 ... ok
copying template1 to postgres ... ok
syncing data to disk ... ok

Success. You can now start the database server using:

postgres -D /var/lib/jenkins/jobs/cubes-skos/workspace/TOXENV/py27-default/test/data/database/pgdb-test_ccplugin
or
pg_ctl -D /var/lib/jenkins/jobs/cubes-skos/workspace/TOXENV/py27-default/test/data/database/pgdb-test_ccplugin -l logfile start

waiting for server to start....LOG: database system was shut down at 2016-05-17 15:18:01 CEST
LOG: MultiXact member wraparound protections are now enabled
LOG: database system is ready to accept connections
LOG: autovacuum launcher started
done
server started
---------------------------- Captured stderr setup -----------------------------

WARNING: enabling "trust" authentication for local connections
You can change this by editing pg_hba.conf or using the option -A, or
--auth-local and --auth-host, the next time you run initdb.
----------------------------- Captured stdout call -----------------------------
-> installing /var/lib/jenkins/jobs/cubes-skos/workspace/TOXENV/py27-default/.tox/py27-default/local/lib/python2.7/site-packages/cubicweb/schemas/_regproc.postgres.sql
-> creating tables
-> inserting default user and default groups.
-> storing the schema in the database
-> database for instance data initialized.
----------------------------- Captured stderr call -----------------------------
2016-05-17 15:18:02 - (logilab.database) WARNING: plpgsql language already installed
2016-05-17 15:18:04 - (cubicweb.appobject) WARNING: can't find any workflow for CWUser
2016-05-17 15:18:26 - (cubicweb.web) WARNING: [3.17] massmailing extracted to cube massmailing that was not found. try installing it.
2016-05-17 15:18:26 - (cubicweb.web) WARNING: [3.17] igeocoding extracted to cube geocoding that was not found. try installing it.
2016-05-17 15:18:26 - (cubicweb.web) WARNING: [3.17] embedding extracted to cube embed that was not found. try installing it.
2016-05-17 15:18:26 - (cubicweb.web) WARNING: [3.17] isioc extracted to cube sioc that was not found. try installing it.
_____________________ ImportSkosDataCommandTC.test_nohook ______________________

self = <test_ccplugin.ImportSkosDataCommandTC testMethod=test_nohook>

def test_nohook(self):
self.run_import_skos('--cw-store', 'nohook')
> self._test_base()

test/test_ccplugin.py:74:
_ _ _ _ _ _ _ _ _ _ _ _ _ _ _ _ _ _ _ _ _ _ _ _ _ _ _ _ _ _ _ _ _ _ _ _ _ _ _ _
test/test_ccplugin.py:66: in _test_base
self.assertEqual(concept.labels, {u'fr': u'économie'})
E AssertionError: {u'fr-fr': u'\xe9conomie', u'fr': u'\xe9conomie'} != {u'fr': u'\xe9conomie'}
E - {u'fr': u'\xe9conomie', u'fr-fr': u'\xe9conomie'}
E + {u'fr': u'\xe9conomie'}
____________________ ImportSkosDataCommandTC.test_nooption _____________________

self = <test_ccplugin.ImportSkosDataCommandTC testMethod=test_nooption>

def test_nooption(self):
self.run_import_skos()
> self._test_base()

test/test_ccplugin.py:70:
_ _ _ _ _ _ _ _ _ _ _ _ _ _ _ _ _ _ _ _ _ _ _ _ _ _ _ _ _ _ _ _ _ _ _ _ _ _ _ _
test/test_ccplugin.py:66: in _test_base
self.assertEqual(concept.labels, {u'fr': u'économie'})
E AssertionError: {u'fr-fr': u'\xe9conomie', u'fr': u'\xe9conomie'} != {u'fr': u'\xe9conomie'}
E - {u'fr': u'\xe9conomie', u'fr-fr': u'\xe9conomie'}
E + {u'fr': u'\xe9conomie'}
==================== 3 failed, 67 passed in 186.37 seconds =====================
ERROR: InvocationError: '/var/lib/jenkins/jobs/cubes-skos/workspace/TOXENV/py27-default/.tox/py27-default/bin/python -m pytest /var/lib/jenkins/jobs/cubes-skos/workspace/TOXENV/py27-default/test --junit-xml=test-results.xml'
___________________________________ summary ____________________________________
ERROR: py27-default: commands failed
Build step 'Execute shell' marked build as failure
[PostBuildScript] - Execution post build scripts.
[py27-default] $ /bin/bash -xe /tmp/hudson4811181195998648308.sh
+ /var/lib/jenkins/scripts/notify_forge_apycot.py cwo cubicweb-skos cce1b7cd3131 http://jenkins.logilab.fr/job/cubes-skos/TOXENV=py27-default/108/ --status failure
<br/>

log from execution
download