consoleText

download

20 Started by upstream project "cubes-skos" build number 140
originally caused by:
Started by user anonymous
Building on master in workspace /var/lib/jenkins/jobs/cubes-skos/workspace/TOXENV/py27-dev
[py27-dev] $ hg showconfig paths.default
[py27-dev] $ hg pull --rev 30f674f7602de60439abd101a6eba9e38c1d7db7
pulling from http://hg.logilab.org/review/cubes/skos
searching for changes
adding changesets
adding manifests
adding file changes
added 1 changesets with 4 changes to 4 files (+1 heads)
2 new obsolescence markers
(run 'hg heads .' to see heads, 'hg merge' to merge)
working directory parent is obsolete!
(use "hg evolve" to update to its successor)
[py27-dev] $ hg update --clean --rev 30f674f7602de60439abd101a6eba9e38c1d7db7
4 files updated, 0 files merged, 0 files removed, 0 files unresolved
[py27-dev] $ hg --config extensions.purge= clean --all
[py27-dev] $ hg log --rev . --template {node}
[py27-dev] $ hg log --rev . --template {rev}
[py27-dev] $ hg log --rev 55e97ae7fc0eb58abaa91fab8c954d470eb9e846 --template exists\n
abort: hidden revision '55e97ae7fc0eb58abaa91fab8c954d470eb9e846'!
(use --hidden to access hidden revisions)
ERROR: Previously built revision 55e97ae7fc0eb58abaa91fab8c954d470eb9e846 is not known in this clone; unable to determine change log
[py27-dev] $ /bin/bash -xe /tmp/hudson731733014291376351.sh
+ find . '(' -name 'pgdb*' -o -name 'tmpdb*' ')' -print0
+ xargs -0 rm -rf
[py27-dev] $ /bin/bash -xe /tmp/hudson249913453348086075.sh
+ PATH=/usr/lib/postgresql/9.4/bin:/usr/local/bin:/usr/bin:/bin:/usr/local/games:/usr/games
+ tox --recreate
GLOB sdist-make: /var/lib/jenkins/jobs/cubes-skos/workspace/TOXENV/py27-dev/setup.py
py27-dev create: /var/lib/jenkins/jobs/cubes-skos/workspace/TOXENV/py27-dev/.tox/py27-dev
py27-dev installdeps: hg+http://hg.logilab.org/master/cubicweb@cubicweb-3.23#egg=cubicweb, -rtest-requirements.txt, pytest
py27-dev inst: /var/lib/jenkins/jobs/cubes-skos/workspace/TOXENV/py27-dev/.tox/dist/cubicweb-skos-0.12.1.zip
py27-dev installed: beautifulsoup4==4.3.2,boto==2.34.0,bzr-etckeeper==0.0.0,cffi==0.8.6,characteristic==0.1.0,chardet==2.3.0,Cheetah==2.4.4,cloud-init==0.7.6,colorama==0.3.2,configobj==5.0.6,coverage==3.7.1,croniter==0.3.4,cryptography==0.6.1,cubicweb==3.23.1,cubicweb-bootstrap==1.2.3,cubicweb-relationwidget==0.4.0,cubicweb-skos==0.12.1,cwclientlib==0.4.1,cwtags==1.1.0,Cython==0.21.1,decorator==3.4.0,docutils==0.12,ecdsa==0.11,euca2ools==3.1.0,GDAL==1.10.1,hg-evolve==5.4.1,html2text==2016.9.19,html5lib==0.999,isodate==0.5.0,Jinja2==2.7.3,joblib==0.8.3,jsonpatch==1.3,jsonpointer==1.0,linecache2==1.0.0,logilab-common==1.2.2,logilab-constraint==0.6.0,logilab-database==1.15.0,logilab-mtconverter==0.9.0,lxml==3.4.0,M2Crypto==0.21.1,Mako==1.0.0,Markdown==2.5.1,MarkupSafe==0.23,matplotlib==1.4.2,mccabe==0.2.1,mercurial==3.9.1,mock==1.0.1,msgpack-python==0.4.2,mysqlclient==1.3.7,nose==1.3.4,numexpr==2.4,numpy==1.8.2,oauth==1.0.1,openpyxl==1.7.0,pandas==0.14.1,paramiko==1.15.1,passlib==1.6.5,pep8==1.5.7,Pillow==2.6.1,pluggy==0.3.1,ply==3.4,prettytable==0.7.2,psycopg2==2.5.4,py==1.4.31,pyasn1==0.1.7,pyasn1-modules==0.0.5,pycparser==2.10,pycrypto==2.6.1,pycurl==7.19.5,Pygments==2.0.1,pyinotify==0.9.4,pyOpenSSL==0.14,pyparsing==2.0.3,pyserial==2.6,pysqlite==2.6.3,pytest==3.0.3,python-apt==0.9.3.12,python-augeas==0.4.1,python-dateutil==2.2,python-jenkins==0.2.1,python-ldap==2.4.10,python-yapps==2.1.1,python3-ldap==0.9.4.2,pytz==2012rc0,PyYAML==3.11,pyzmq==14.4.0,rdflib==4.1.2,requestbuilder==0.2.3,requests==2.4.3,roman==2.0.0,rql==0.34.0,rubber==1.1,salt==2016.3.0,scikit-learn==0.14.1,scipy==0.14.0,service-identity==1.0.0,Shapely==1.4.3,simplejson==3.6.5,SimpleTAL==4.1,six==1.8.0,SPARQLWrapper==1.6.0,Sphinx==1.2.3,statsmodels==0.4.2,tables==3.1.1,tornado==4.2,tox==2.3.1,traceback2==1.4.0,unittest2==1.1.0,urllib3==1.9.1,virtualenv==15.0.3,xlrd==0.9.2,xlwt==0.7.5,yams==0.44.0,Yapps==2.2.0,Yapps2==2.2.0
py27-dev runtests: PYTHONHASHSEED='158950799'
py27-dev runtests: commands[0] | /var/lib/jenkins/jobs/cubes-skos/workspace/TOXENV/py27-dev/.tox/py27-dev/bin/python -m pytest /var/lib/jenkins/jobs/cubes-skos/workspace/TOXENV/py27-dev/test
============================= test session starts ==============================
platform linux2 -- Python 2.7.9, pytest-3.0.3, py-1.4.31, pluggy-0.4.0
rootdir: /var/lib/jenkins/jobs/cubes-skos/workspace/TOXENV/py27-dev, inifile: tox.ini
collected 71 items

test/test_ccplugin.py ...
test/unittest_entities.py .......................
test/unittest_hooks.py ....
test/unittest_lcsv.py ...
test/unittest_rdfio.py .....................
test/unittest_schema.py ......
test/unittest_sobjects.py .F.F..
test/unittest_views.py .....

=================================== FAILURES ===================================
_____________________ SKOSXMLImportTC.test_datafeed_source _____________________

self = <unittest_sobjects.SKOSXMLImportTC testMethod=test_datafeed_source>

def test_datafeed_source(self):
# test creation upon initial pull
self.pull_source('mythesaurus')
> self.check_siaf_shortened(u'mythesaurus')

test/unittest_sobjects.py:146:
_ _ _ _ _ _ _ _ _ _ _ _ _ _ _ _ _ _ _ _ _ _ _ _ _ _ _ _ _ _ _ _ _ _ _ _ _ _ _ _
test/unittest_sobjects.py:79: in check_siaf_shortened
self.assertEqual(scheme.description[:len(descr)], descr)
E AssertionError: u"Le Th\xe9saurus pour la description et l'indexation des archives locales " != "Le Th\xc3\xa9saurus pour la description et l'indexation des archives locales"
----------------------------- Captured stdout call -----------------------------
Building xmlparser for database tmpdb
_________________________ SKOSXMLImportTC.test_service _________________________

self = <unittest_sobjects.SKOSXMLImportTC testMethod=test_service>

def test_service(self):
with self.admin_access.repo_cnx() as cnx:
scheme_uris = cnx.call_service(
'rdf.skos.import',
stream=open(self.datapath('siaf_matieres_shortened.xml')),
rdf_format='xml')[-1]
self.assertEqual(scheme_uris,
['http://data.culture.fr/thesaurus/resource/ark:/67717/Matiere'])
> self.check_siaf_shortened(u'system')

test/unittest_sobjects.py:158:
_ _ _ _ _ _ _ _ _ _ _ _ _ _ _ _ _ _ _ _ _ _ _ _ _ _ _ _ _ _ _ _ _ _ _ _ _ _ _ _
test/unittest_sobjects.py:79: in check_siaf_shortened
self.assertEqual(scheme.description[:len(descr)], descr)
E AssertionError: u"Le Th\xe9saurus pour la description et l'indexation des archives locales " != "Le Th\xc3\xa9saurus pour la description et l'indexation des archives locales"
===================== 2 failed, 69 passed in 72.69 seconds =====================
ERROR: InvocationError: '/var/lib/jenkins/jobs/cubes-skos/workspace/TOXENV/py27-dev/.tox/py27-dev/bin/python -m pytest /var/lib/jenkins/jobs/cubes-skos/workspace/TOXENV/py27-dev/test'
___________________________________ summary ____________________________________
ERROR: py27-dev: commands failed
Build step 'Execute shell' marked build as failure
[PostBuildScript] - Execution post build scripts.
[py27-dev] $ /bin/bash -xe /tmp/hudson681597411647264938.sh
+ /var/lib/jenkins/scripts/notify_forge_apycot.py cwo cubicweb-skos 30f674f7602d http://jenkins.logilab.fr/job/cubes-skos/TOXENV=py27-dev/140/ --status failure
<br/>

log from execution
download